\relax 
\providecommand\hyper@newdestlabel[2]{}
\providecommand*\new@tpo@label[2]{}
\providecommand\HyperFirstAtBeginDocument{\AtBeginDocument}
\HyperFirstAtBeginDocument{\ifx\hyper@anchor\@undefined
\global\let\oldcontentsline\contentsline
\gdef\contentsline#1#2#3#4{\oldcontentsline{#1}{#2}{#3}}
\global\let\oldnewlabel\newlabel
\gdef\newlabel#1#2{\newlabelxx{#1}#2}
\gdef\newlabelxx#1#2#3#4#5#6{\oldnewlabel{#1}{{#2}{#3}}}
\AtEndDocument{\ifx\hyper@anchor\@undefined
\let\contentsline\oldcontentsline
\let\newlabel\oldnewlabel
\fi}
\fi}
\global\let\hyper@last\relax 
\gdef\HyperFirstAtBeginDocument#1{#1}
\providecommand*\HyPL@Entry[1]{}
\HyPL@Entry{0<</S/D>>}
\selectlanguage *[variant=british]{english}
\@writefile{toc}{\selectlanguage *[variant=british]{english}}
\@writefile{lof}{\selectlanguage *[variant=british]{english}}
\@writefile{lot}{\selectlanguage *[variant=british]{english}}
\@writefile{toc}{\contentsline {section}{\nonumberline Lecture 1: The electirc field}{2}{section*.3}\protected@file@percent }
\@writefile{lof}{\contentsline {figure}{\numberline {1}{\ignorespaces cargas\relax }}{2}{figure.caption.4}\protected@file@percent }
\providecommand*\caption@xref[2]{\@setref\relax\@undefined{#1}}
\newlabel{fig:cargas}{{1}{2}{cargas\relax }{figure.caption.4}{}}
\@writefile{lof}{\contentsline {figure}{\numberline {2}{\ignorespaces cargas en un plano\relax }}{3}{figure.caption.5}\protected@file@percent }
\newlabel{fig:cargas-en-un-plano}{{2}{3}{cargas en un plano\relax }{figure.caption.5}{}}
\@writefile{lof}{\contentsline {figure}{\numberline {3}{\ignorespaces coulomb's law\relax }}{4}{figure.caption.7}\protected@file@percent }
\newlabel{fig:coulomb's-law}{{3}{4}{coulomb's law\relax }{figure.caption.7}{}}
\@writefile{lof}{\contentsline {figure}{\numberline {4}{\ignorespaces electric field\relax }}{5}{figure.caption.9}\protected@file@percent }
\newlabel{fig:electric-field}{{4}{5}{electric field\relax }{figure.caption.9}{}}
\@writefile{lof}{\contentsline {figure}{\numberline {5}{\ignorespaces situation\relax }}{6}{figure.caption.10}\protected@file@percent }
\newlabel{fig:situation}{{5}{6}{situation\relax }{figure.caption.10}{}}
\@writefile{toc}{\contentsline {section}{\nonumberline Lecture 2: Divergence and Curl of electrostatic fields}{7}{section*.14}\protected@file@percent }
\@writefile{lof}{\contentsline {figure}{\numberline {6}{\ignorespaces field lines\relax }}{7}{figure.caption.16}\protected@file@percent }
\newlabel{fig:field-lines}{{6}{7}{field lines\relax }{figure.caption.16}{}}
\@writefile{toc}{\contentsline {section}{\nonumberline Lecture 3}{8}{section*.18}\protected@file@percent }
\newlabel{TotPages}{{8}{8}{}{page.8}{}}
\@writefile{toc}{\providecommand\tocbasic@end@toc@file{}\tocbasic@end@toc@file}
\gdef \@abspage@last{8}
