\relax 
\providecommand\hyper@newdestlabel[2]{}
\providecommand*\new@tpo@label[2]{}
\providecommand\HyperFirstAtBeginDocument{\AtBeginDocument}
\HyperFirstAtBeginDocument{\ifx\hyper@anchor\@undefined
\global\let\oldcontentsline\contentsline
\gdef\contentsline#1#2#3#4{\oldcontentsline{#1}{#2}{#3}}
\global\let\oldnewlabel\newlabel
\gdef\newlabel#1#2{\newlabelxx{#1}#2}
\gdef\newlabelxx#1#2#3#4#5#6{\oldnewlabel{#1}{{#2}{#3}}}
\AtEndDocument{\ifx\hyper@anchor\@undefined
\let\contentsline\oldcontentsline
\let\newlabel\oldnewlabel
\fi}
\fi}
\global\let\hyper@last\relax 
\gdef\HyperFirstAtBeginDocument#1{#1}
\providecommand\HyField@AuxAddToFields[1]{}
\providecommand\HyField@AuxAddToCoFields[2]{}
\providecommand\BKM@entry[2]{}
\selectlanguage *[variant=british]{english}
\@writefile{toc}{\selectlanguage *[variant=british]{english}}
\@writefile{lof}{\selectlanguage *[variant=british]{english}}
\@writefile{lot}{\selectlanguage *[variant=british]{english}}
\BKM@entry{id=1,dest={636861707465722E31},srcline={1},srcfile={2E2F6C65635F30312E746578}}{5C3337365C3337375C303030545C303030685C303030655C3030305C3034305C3030306E5C303030615C303030745C303030755C303030725C303030615C3030306C5C3030305C3034305C3030306E5C303030755C3030306D5C303030625C303030655C303030725C30303073}
\@writefile{toc}{\contentsline {chapter}{\numberline {1}The natural numbers}{3}{chapter.1}\protected@file@percent }
\@writefile{lof}{\addvspace {10\p@ }}
\@writefile{lot}{\addvspace {10\p@ }}
\pgfsyspdfmark {pgfid1}{24398338}{35864189}
\pgfsyspdfmark {pgfid2}{26105517}{33633378}
\@writefile{lof}{\contentsline {xchapter}{The natural numbers}{3}{chapter.1}\protected@file@percent }
\@writefile{lot}{\contentsline {xchapter}{The natural numbers}{3}{chapter.1}\protected@file@percent }
\BKM@entry{id=2,dest={73656374696F6E2E32},srcline={31},srcfile={2E2F6C65635F30312E746578}}{5C3337365C3337375C303030545C303030685C303030655C3030305C3034305C303030505C303030655C303030615C3030306E5C3030306F5C3030305C3034305C303030615C303030785C303030695C3030306F5C3030306D5C30303073}
\@writefile{toc}{\contentsline {section}{\numberline {1.1}The Peano axioms}{4}{section.2}\protected@file@percent }
\newlabel{th:1}{{1.1.1}{5}{}{tcb@cnt@axiom.5}{}}
\newlabel{th:2}{{1.1.2}{5}{}{tcb@cnt@axiom.6}{}}
\newlabel{th:3}{{1.1.3}{6}{}{tcb@cnt@axiom.9}{}}
\newlabel{th:4}{{1.1.4}{6}{}{tcb@cnt@axiom.11}{}}
\newlabel{th:5}{{1.1.5}{7}{Principle of mathematical induction}{tcb@cnt@axiom.13}{}}
\BKM@entry{id=3,dest={73656374696F6E2E3139},srcline={1},srcfile={2E2F6C65635F30322E746578}}{5C3337365C3337375C303030415C303030645C303030645C303030695C303030745C303030695C3030306F5C3030306E}
\@writefile{toc}{\contentsline {section}{\numberline {1.2}Addition}{10}{section.19}\protected@file@percent }
\BKM@entry{id=4,dest={73756273656374696F6E2E3335},srcline={257},srcfile={2E2F6C65635F30322E746578}}{5C3337365C3337375C303030455C303030785C303030655C303030725C303030635C303030695C303030735C303030655C30303073}
\@writefile{toc}{\contentsline {subsection}{\numberline {1.2.1}Exercises}{15}{subsection.35}\protected@file@percent }
\BKM@entry{id=5,dest={73656374696F6E2E3432},srcline={1},srcfile={2E2F6C65635F30332E746578}}{5C3337365C3337375C3030304D5C303030755C3030306C5C303030745C303030695C303030705C3030306C5C303030695C303030635C303030615C303030745C303030695C3030306F5C3030306E}
\@writefile{toc}{\contentsline {section}{\numberline {1.3}Multiplication}{20}{section.42}\protected@file@percent }
\BKM@entry{id=6,dest={73756273656374696F6E2E3533},srcline={154},srcfile={2E2F6C65635F30332E746578}}{5C3337365C3337375C303030455C303030785C303030655C303030725C303030635C303030695C303030735C303030655C30303073}
\@writefile{toc}{\contentsline {subsection}{\numberline {1.3.1}Exercises}{23}{subsection.53}\protected@file@percent }
\BKM@entry{id=7,dest={636861707465722E3539},srcline={1},srcfile={2E2F6C65635F30342E746578}}{5C3337365C3337375C303030535C303030655C303030745C3030305C3034305C303030745C303030685C303030655C3030306F5C303030725C30303079}
\BKM@entry{id=8,dest={73656374696F6E2E3630},srcline={8},srcfile={2E2F6C65635F30342E746578}}{5C3337365C3337375C303030465C303030755C3030306E5C303030645C303030615C3030306D5C303030655C3030306E5C303030745C303030615C3030306C5C30303073}
\@writefile{toc}{\contentsline {chapter}{\numberline {2}Set theory}{27}{chapter.59}\protected@file@percent }
\@writefile{lof}{\addvspace {10\p@ }}
\@writefile{lot}{\addvspace {10\p@ }}
\pgfsyspdfmark {pgfid45}{24398338}{35864189}
\pgfsyspdfmark {pgfid46}{26105517}{33633378}
\@writefile{lof}{\contentsline {xchapter}{Set theory}{27}{chapter.59}\protected@file@percent }
\@writefile{lot}{\contentsline {xchapter}{Set theory}{27}{chapter.59}\protected@file@percent }
\@writefile{toc}{\contentsline {section}{\numberline {2.1}Fundamentals}{27}{section.60}\protected@file@percent }
\newlabel{th:setsare}{{2.1.1}{28}{Sets are objects}{tcb@cnt@axiom.62}{}}
\newlabel{th:equset}{{2.1.2}{29}{Equality of sets}{tcb@cnt@definition.64}{}}
\newlabel{th:empty}{{2.1.2}{29}{Empty set}{tcb@cnt@axiom.66}{}}
\newlabel{th:single}{{2.1.3}{30}{Singleton sets and pair sets}{tcb@cnt@axiom.69}{}}
\newlabel{th:union}{{2.1.4}{31}{Pairwise union}{tcb@cnt@axiom.71}{}}
\BKM@entry{id=9,dest={73756273656374696F6E2E3836},srcline={452},srcfile={2E2F6C65635F30342E746578}}{5C3337365C3337375C303030455C303030785C303030655C303030725C303030635C303030695C303030735C303030655C30303073}
\@writefile{toc}{\contentsline {subsection}{\numberline {2.1.1}Exercises}{36}{subsection.86}\protected@file@percent }
\BKM@entry{id=10,dest={73656374696F6E2E3938},srcline={1},srcfile={2E2F6C65635F30352E746578}}{5C3337365C3337375C303030465C303030755C3030306E5C303030635C303030745C303030695C3030306F5C3030306E5C30303073}
\@writefile{toc}{\contentsline {section}{\numberline {2.2}Functions}{43}{section.98}\protected@file@percent }
\BKM@entry{id=11,dest={73756273656374696F6E2E313039},srcline={219},srcfile={2E2F6C65635F30352E746578}}{5C3337365C3337375C303030455C303030785C303030655C303030725C303030635C303030695C303030735C303030655C30303073}
\@writefile{toc}{\contentsline {subsection}{\numberline {2.2.1}Exercises}{48}{subsection.109}\protected@file@percent }
\BKM@entry{id=12,dest={73656374696F6E2E313232},srcline={1},srcfile={2E2F6C65635F30362E746578}}{5C3337365C3337375C303030495C3030306D5C303030615C303030675C303030655C303030735C3030305C3034305C303030615C3030306E5C303030645C3030305C3034305C303030695C3030306E5C303030765C303030655C303030725C303030735C303030655C3030305C3034305C303030695C3030306D5C303030615C303030675C303030655C30303073}
\@writefile{toc}{\contentsline {section}{\numberline {2.3}Images and inverse images}{53}{section.122}\protected@file@percent }
\BKM@entry{id=13,dest={73756273656374696F6E2E313331},srcline={237},srcfile={2E2F6C65635F30362E746578}}{5C3337365C3337375C303030455C303030785C303030655C303030725C303030635C303030695C303030735C303030655C30303073}
\@writefile{toc}{\contentsline {subsection}{\numberline {2.3.1}Exercises}{58}{subsection.131}\protected@file@percent }
\BKM@entry{id=14,dest={73656374696F6E2E313433},srcline={1},srcfile={2E2F6C65635F30372E746578}}{5C3337365C3337375C303030435C303030615C303030725C303030745C303030655C303030735C303030695C303030615C3030306E5C3030305C3034305C303030705C303030725C3030306F5C303030645C303030755C303030635C303030745C30303073}
\@writefile{toc}{\contentsline {section}{\numberline {2.4}Cartesian products}{68}{section.143}\protected@file@percent }
\BKM@entry{id=15,dest={73756273656374696F6E2E313530},srcline={201},srcfile={2E2F6C65635F30372E746578}}{5C3337365C3337375C303030455C303030785C303030655C303030725C303030635C303030695C303030735C303030655C30303073}
\@writefile{toc}{\contentsline {subsection}{\numberline {2.4.1}Exercises}{72}{subsection.150}\protected@file@percent }
\global\mtcsecondpartfalse
\global\@namedef{scr@dte@section@lastmaxnumwidth}{16.49994pt}
\global\@namedef{scr@dte@subsection@lastmaxnumwidth}{23.99994pt}
\gdef \@abspage@last{77}
