<?xml version="1.0" encoding="UTF-8" standalone="no"?>
<svg
   xmlns:dc="http://purl.org/dc/elements/1.1/"
   xmlns:cc="http://creativecommons.org/ns#"
   xmlns:rdf="http://www.w3.org/1999/02/22-rdf-syntax-ns#"
   xmlns:svg="http://www.w3.org/2000/svg"
   xmlns="http://www.w3.org/2000/svg"
   xmlns:xlink="http://www.w3.org/1999/xlink"
   xmlns:sodipodi="http://sodipodi.sourceforge.net/DTD/sodipodi-0.dtd"
   xmlns:inkscape="http://www.inkscape.org/namespaces/inkscape"
   width="260.17429mm"
   height="48.319172mm"
   viewBox="0 0 260.17429 48.319172"
   version="1.1"
   id="svg8"
   inkscape:version="1.0.2 (e86c870879, 2021-01-15)"
   sodipodi:docname="cosine-extended-to-r.svg">
  <defs
     id="defs2">
    <inkscape:path-effect
       effect="spiro"
       id="path-effect181"
       is_visible="true"
       lpeversion="1" />
    <inkscape:path-effect
       effect="spiro"
       id="path-effect169"
       is_visible="true"
       lpeversion="1" />
    <inkscape:path-effect
       effect="spiro"
       id="path-effect157"
       is_visible="true"
       lpeversion="1" />
    <inkscape:path-effect
       effect="spiro"
       id="path-effect134"
       is_visible="true"
       lpeversion="1" />
    <marker
       id="marker-arrow-1.0616"
       orient="auto-start-reverse"
       refY="0"
       refX="0"
       markerHeight="1.6900001"
       markerWidth="0.91100001">
      <g
         transform="scale(1.3434313)"
         id="g139">
        <path
           d="M -1.55415,2.0722 C -1.42464,1.29512 0,0.1295 0.38852,0 0,-0.1295 -1.42464,-1.29512 -1.55415,-2.0722"
           style="fill:none;stroke:#000000;stroke-width:0.6;stroke-linecap:round;stroke-linejoin:round;stroke-miterlimit:10;stroke-dasharray:none;stroke-opacity:1"
           inkscape:connector-curvature="0"
           id="path137" />
      </g>
    </marker>
    <marker
       id="marker402"
       orient="auto-start-reverse"
       refY="0"
       refX="0"
       markerHeight="1.6900001"
       markerWidth="0.91100001">
      <g
         transform="scale(1.3434313)"
         id="g400">
        <path
           d="M -1.55415,2.0722 C -1.42464,1.29512 0,0.1295 0.38852,0 0,-0.1295 -1.42464,-1.29512 -1.55415,-2.0722"
           style="fill:none;stroke:#000000;stroke-width:0.6;stroke-linecap:round;stroke-linejoin:round;stroke-miterlimit:10;stroke-dasharray:none;stroke-opacity:1"
           inkscape:connector-curvature="0"
           id="path398" />
      </g>
    </marker>
    <inkscape:path-effect
       effect="spiro"
       id="path-effect93"
       is_visible="true"
       lpeversion="1" />
    <inkscape:path-effect
       effect="spiro"
       id="path-effect192"
       is_visible="true"
       lpeversion="1" />
    <inkscape:path-effect
       effect="spiro"
       id="path-effect215"
       is_visible="true"
       lpeversion="1" />
    <inkscape:path-effect
       effect="spiro"
       id="path-effect407"
       is_visible="true"
       lpeversion="1" />
    <inkscape:path-effect
       effect="spiro"
       id="path-effect409"
       is_visible="true"
       lpeversion="1" />
    <inkscape:path-effect
       effect="spiro"
       id="path-effect411"
       is_visible="true"
       lpeversion="1" />
    <inkscape:path-effect
       effect="spiro"
       id="path-effect413"
       is_visible="true"
       lpeversion="1" />
    <inkscape:path-effect
       effect="spiro"
       id="path-effect415"
       is_visible="true"
       lpeversion="1" />
    <inkscape:path-effect
       effect="spiro"
       id="path-effect417"
       is_visible="true"
       lpeversion="1" />
    <inkscape:path-effect
       effect="spiro"
       id="path-effect419"
       is_visible="true"
       lpeversion="1" />
    <inkscape:path-effect
       effect="spiro"
       id="path-effect421"
       is_visible="true"
       lpeversion="1" />
    <inkscape:path-effect
       effect="spiro"
       id="path-effect423"
       is_visible="true"
       lpeversion="1" />
    <inkscape:path-effect
       effect="spiro"
       id="path-effect425"
       is_visible="true"
       lpeversion="1" />
    <inkscape:path-effect
       effect="spiro"
       id="path-effect427"
       is_visible="true"
       lpeversion="1" />
    <inkscape:path-effect
       effect="spiro"
       id="path-effect429"
       is_visible="true"
       lpeversion="1" />
    <marker
       id="marker435"
       orient="auto-start-reverse"
       refY="0"
       refX="0"
       markerHeight="1.6900001"
       markerWidth="0.91100001">
      <g
         transform="scale(1.3434313)"
         id="g433">
        <path
           d="M -1.55415,2.0722 C -1.42464,1.29512 0,0.1295 0.38852,0 0,-0.1295 -1.42464,-1.29512 -1.55415,-2.0722"
           style="fill:none;stroke:#000000;stroke-width:0.6;stroke-linecap:round;stroke-linejoin:round;stroke-miterlimit:10;stroke-dasharray:none;stroke-opacity:1"
           inkscape:connector-curvature="0"
           id="path431" />
      </g>
    </marker>
    <inkscape:path-effect
       effect="spiro"
       id="path-effect311"
       is_visible="true"
       lpeversion="1" />
    <marker
       id="marker442"
       orient="auto-start-reverse"
       refY="0"
       refX="0"
       markerHeight="1.6900001"
       markerWidth="0.91100001">
      <g
         transform="scale(1.3434313)"
         id="g440">
        <path
           d="M -1.55415,2.0722 C -1.42464,1.29512 0,0.1295 0.38852,0 0,-0.1295 -1.42464,-1.29512 -1.55415,-2.0722"
           style="fill:none;stroke:#000000;stroke-width:0.6;stroke-linecap:round;stroke-linejoin:round;stroke-miterlimit:10;stroke-dasharray:none;stroke-opacity:1"
           inkscape:connector-curvature="0"
           id="path438" />
      </g>
    </marker>
    <inkscape:path-effect
       effect="spiro"
       id="path-effect334"
       is_visible="true"
       lpeversion="1" />
  </defs>
  <sodipodi:namedview
     id="base"
     pagecolor="#ffffff"
     bordercolor="#666666"
     borderopacity="1.0"
     inkscape:pageopacity="0.0"
     inkscape:pageshadow="2"
     inkscape:zoom="3.9774955"
     inkscape:cx="210.17046"
     inkscape:cy="89.91179"
     inkscape:document-units="mm"
     inkscape:current-layer="g275"
     showgrid="false"
     showborder="true"
     width="200mm"
     showguides="true"
     inkscape:guide-bbox="true"
     inkscape:window-width="868"
     inkscape:window-height="855"
     inkscape:window-x="5"
     inkscape:window-y="38"
     inkscape:window-maximized="1"
     inkscape:document-rotation="0">
    <inkscape:grid
       type="xygrid"
       id="grid815"
       units="mm"
       spacingx="10"
       spacingy="10"
       empspacing="4"
       dotted="false"
       originx="25.072982"
       originy="-34.334103" />
  </sodipodi:namedview>
  <metadata
     id="metadata5">
    <rdf:RDF>
      <cc:Work
         rdf:about="">
        <dc:format>image/svg+xml</dc:format>
        <dc:type
           rdf:resource="http://purl.org/dc/dcmitype/StillImage" />
        <dc:title />
      </cc:Work>
    </rdf:RDF>
  </metadata>
  <g
     inkscape:label="Layer 1"
     inkscape:groupmode="layer"
     id="layer1"
     transform="translate(25.072981,-211.3341)">
    <g
       id="g385"
       transform="translate(-53.773172,133.1103)">
      <g
         id="g98"
         transform="matrix(-1.0504522,0,0,-1.0504522,215.03586,262.82316)"
         style="fill:none;fill-opacity:1;stroke:#000000;stroke-width:0.267391;stroke-dasharray:none;stroke-opacity:1;marker-start:url(#marker-arrow-1.0616);marker-end:url(#marker-arrow-1.0616)">
        <path
           style="fill:none;fill-opacity:1;stroke:#000000;stroke-width:0.267391;stroke-linecap:butt;stroke-linejoin:miter;stroke-dasharray:none;stroke-opacity:1;marker-start:url(#marker-arrow-1.0616);marker-end:url(#marker-arrow-1.0616)"
           d="M 177.13884,153.16283 H -70.044916"
           id="path91"
           inkscape:path-effect="#path-effect93"
           inkscape:original-d="m 177.13884,153.16283 c -82.394834,-2.5e-4 -164.78942,-2.5e-4 -247.183756,0" />
      </g>
      <g
         id="g368">
        <g
           id="g266"
           transform="matrix(0.25367407,0,0,0.3646402,16.878826,60.826116)"
           style="fill:#000000;fill-opacity:0.12;stroke:#000000;stroke-width:0.923534;stroke-dasharray:none;stroke-opacity:1;marker-start:none;marker-end:none">
          <g
             id="g284"
             style="fill:none;fill-opacity:1;stroke:#000000;stroke-width:0.923534;stroke-dasharray:none;stroke-opacity:1;marker-start:none;marker-end:none">
            <g
               id="g130"
               transform="translate(-114.35701,-1.5277835)">
              <g
                 id="g275"
                 transform="translate(-1.1830083,1.5277848)">
                <path
                   style="fill:none;fill-opacity:1;stroke:#000000;stroke-width:0.869946px;stroke-linecap:butt;stroke-linejoin:miter;stroke-dasharray:none;stroke-opacity:1;marker-start:none;marker-end:none"
                   d="m 982.80048,111.27781 v 6.78795"
                   id="path132-3"
                   inkscape:path-effect="#path-effect157"
                   inkscape:original-d="m 982.80048,111.27781 c -10e-4,2.26338 -10e-4,4.52603 0,6.78795" />
                <g
                   id="use222"
                   inkscape:tile-x0="20.74125"
                   inkscape:tile-y0="86.488482"
                   transform="translate(919.07274,-7.9488074)"
                   inkscape:tile-cx="97.735164"
                   inkscape:tile-cy="112.78898"
                   inkscape:tile-w="153.98783"
                   inkscape:tile-h="52.600996"
                   style="fill:none;fill-opacity:1;stroke:#000000;stroke-width:0.923534;stroke-dasharray:none;stroke-opacity:1;marker-start:none;marker-end:none">
                  <path
                     style="fill:none;fill-opacity:1;stroke:#000000;stroke-width:0.923534;stroke-linecap:butt;stroke-linejoin:miter;stroke-dasharray:none;stroke-opacity:1;marker-start:none;marker-end:none"
                     d="m 24.241553,120.73778 c 3.017153,-7.65826 8.382601,-14.37285 15.18654,-19.00519 6.803939,-4.632338 15.017903,-7.163052 23.249073,-7.163012 8.231104,4e-5 16.444977,2.53079 23.248839,7.163122 6.803861,4.63234 12.169246,11.34688 15.186375,19.00508"
                     id="path228"
                     inkscape:path-effect="#path-effect192"
                     inkscape:original-d="m 24.241553,120.73778 c 12.811937,1.3e-4 32.256119,-26.168202 38.435613,-26.168202 6.179494,0 25.623542,26.168332 38.435214,26.168202"
                     sodipodi:nodetypes="czc" />
                  <path
                     style="fill:none;fill-opacity:1;stroke:#000000;stroke-width:0.923534;stroke-linecap:butt;stroke-linejoin:miter;stroke-dasharray:none;stroke-opacity:1;marker-start:none;marker-end:none"
                     d="m 177.98321,120.73778 c -3.01715,7.65826 -8.3826,14.37285 -15.18654,19.00519 -6.80394,4.63235 -15.01791,7.16306 -23.24908,7.16302 -8.2311,-4e-5 -16.44498,-2.53079 -23.24884,-7.16313 -6.80386,-4.63234 -12.16924,-11.34688 -15.18637,-19.00508"
                     id="path230"
                     sodipodi:nodetypes="czc"
                     inkscape:original-d="m 177.98321,120.73778 c -12.81194,-1.3e-4 -32.25612,26.16821 -38.43562,26.16821 -6.17949,0 -25.62354,-26.16834 -38.43521,-26.16821"
                     inkscape:path-effect="#path-effect215" />
                </g>
                <use
                   x="0"
                   y="0"
                   inkscape:tiled-clone-of="#use222"
                   xlink:href="#use222"
                   transform="translate(-614.96664)"
                   id="use250"
                   width="100%"
                   height="100%"
                   style="fill:none;fill-opacity:1;stroke:#000000;stroke-width:0.923534;stroke-dasharray:none;stroke-opacity:1;marker-start:none;marker-end:none" />
                <use
                   x="0"
                   y="0"
                   inkscape:tiled-clone-of="#use222"
                   xlink:href="#use222"
                   transform="translate(-461.22498)"
                   id="use252"
                   width="100%"
                   height="100%"
                   style="fill:none;fill-opacity:1;stroke:#000000;stroke-width:0.923534;stroke-dasharray:none;stroke-opacity:1;marker-start:none;marker-end:none" />
                <use
                   x="0"
                   y="0"
                   inkscape:tiled-clone-of="#use222"
                   xlink:href="#use222"
                   transform="translate(-307.48332)"
                   id="use254"
                   width="100%"
                   height="100%"
                   style="fill:none;fill-opacity:1;stroke:#000000;stroke-width:0.923534;stroke-dasharray:none;stroke-opacity:1;marker-start:none;marker-end:none" />
                <use
                   x="0"
                   y="0"
                   inkscape:tiled-clone-of="#use222"
                   xlink:href="#use222"
                   transform="translate(-153.74166)"
                   id="use256"
                   width="100%"
                   height="100%"
                   style="fill:none;fill-opacity:1;stroke:#000000;stroke-width:0.923534;stroke-dasharray:none;stroke-opacity:1;marker-start:none;marker-end:none" />
                <path
                   style="fill:none;stroke:#000000;stroke-width:0.869946px;stroke-linecap:butt;stroke-linejoin:miter;stroke-opacity:1"
                   d="m 829.02021,110.6227 v 6.78795"
                   id="path132"
                   inkscape:path-effect="#path-effect134"
                   inkscape:original-d="m 829.02021,110.6227 c -10e-4,2.26338 -10e-4,4.52603 0,6.78795" />
                <path
                   style="fill:none;fill-opacity:1;stroke:#000000;stroke-width:0.869946px;stroke-linecap:butt;stroke-linejoin:miter;stroke-dasharray:none;stroke-opacity:1;marker-start:none;marker-end:none"
                   d="m 520.6029,110.93128 v 6.78795"
                   id="path132-6"
                   inkscape:path-effect="#path-effect169"
                   inkscape:original-d="m 520.6029,110.93128 c -10e-4,2.26338 -10e-4,4.52603 0,6.78795" />
                <path
                   style="fill:none;fill-opacity:1;stroke:#000000;stroke-width:0.869946px;stroke-linecap:butt;stroke-linejoin:miter;stroke-dasharray:none;stroke-opacity:1;marker-start:none;marker-end:none"
                   d="m 368.05263,111.02481 v 6.78795"
                   id="path132-7"
                   inkscape:path-effect="#path-effect181"
                   inkscape:original-d="m 368.05263,111.02481 c -0.001,2.26338 -0.001,4.52603 0,6.78795" />
                <text
                   style="font-size:8.69946px;font-family:monospace;-inkscape-font-specification:'monospace, Normal';fill:#000000;fill-opacity:1;stroke:none;stroke-width:0.803424"
                   xml:space="preserve"
                   id="text186"
                   x="568.35791"
                   y="156.47839"
                   transform="scale(1.1989311,0.83407628)"><tspan
                     sodipodi:role="line"
                     id="tspan184"
                     x="568.35791"
                     y="156.47839"
                     style="stroke-width:0.803424">$0$</tspan></text>
                <text
                   style="font-size:8.69946px;font-family:monospace;-inkscape-font-specification:'monospace, Normal';fill:#000000;fill-opacity:1;stroke:none;stroke-width:0.803424"
                   xml:space="preserve"
                   id="text200"
                   x="677.1474"
                   y="161.01187"
                   transform="scale(1.1989311,0.83407628)"><tspan
                     sodipodi:role="line"
                     id="tspan198"
                     x="677.1474"
                     y="161.01187"
                     style="stroke-width:0.803424">$2\pi$</tspan></text>
                <text
                   style="font-size:8.69946px;font-family:monospace;-inkscape-font-specification:'monospace, Normal';fill:#000000;fill-opacity:1;stroke:none;stroke-width:0.803424"
                   xml:space="preserve"
                   id="text214"
                   x="804.17963"
                   y="161.71678"
                   transform="scale(1.1989311,0.83407628)"><tspan
                     sodipodi:role="line"
                     id="tspan212"
                     x="804.17963"
                     y="161.71678"
                     style="stroke-width:0.803424">$4\pi$</tspan></text>
                <text
                   style="font-size:8.69946px;font-family:monospace;-inkscape-font-specification:'monospace, Normal';fill:#000000;fill-opacity:1;stroke:none;stroke-width:0.803424"
                   xml:space="preserve"
                   id="text228"
                   x="416.63022"
                   y="159.4966"
                   transform="scale(1.1989311,0.83407628)"><tspan
                     sodipodi:role="line"
                     id="tspan226"
                     x="416.63022"
                     y="159.4966"
                     style="stroke-width:0.803424">$-2\pi$</tspan></text>
                <text
                   style="font-size:8.69946px;font-family:monospace;-inkscape-font-specification:'monospace, Normal';fill:#000000;fill-opacity:1;stroke:none;stroke-width:0.803424"
                   xml:space="preserve"
                   id="text242"
                   x="284.94043"
                   y="161.14832"
                   transform="scale(1.1989311,0.83407628)"><tspan
                     sodipodi:role="line"
                     id="tspan240"
                     x="284.94043"
                     y="161.14832"
                     style="stroke-width:0.803424">$-4\pi$</tspan></text>
              </g>
            </g>
          </g>
        </g>
        <path
           style="fill:none;fill-opacity:1;stroke:#000000;stroke-width:0.280882;stroke-linecap:butt;stroke-linejoin:miter;stroke-dasharray:none;stroke-opacity:1;marker-start:none;marker-end:url(#marker-arrow-1.0616)"
           d="M 158.67252,101.95351 V 100.79987 78.483589"
           id="path309"
           inkscape:path-effect="#path-effect311"
           inkscape:original-d="m 158.67252,101.95351 c 2.6e-4,-0.38449 2.6e-4,-0.76904 0,-1.15364 -2.7e-4,-0.3846 2.6e-4,-14.877465 0,-22.316281" />
        <path
           style="fill:none;fill-opacity:1;stroke:#000000;stroke-width:0.280882;stroke-linecap:butt;stroke-linejoin:miter;stroke-dasharray:none;stroke-opacity:1;marker-start:none;marker-end:url(#marker-arrow-1.0616)"
           d="m 158.67115,101.95351 v 1.19589 23.13379"
           id="path309-5"
           inkscape:path-effect="#path-effect334"
           inkscape:original-d="m 158.67115,101.95351 c -2.6e-4,0.39857 -2.6e-4,0.79721 0,1.19589 2.7e-4,0.39869 -2.6e-4,15.42247 0,23.13379" />
      </g>
    </g>
  </g>
</svg>
