\selectlanguage *[variant=british]{english}
\contentsline {section}{\nonumberline Lecture 1: The electirc field}{2}{section*.3}%
\contentsline {section}{\nonumberline Lecture 2: Divergence and Curl of electrostatic fields}{7}{section*.14}%
\contentsline {section}{\nonumberline Lecture 3}{8}{section*.18}%
\providecommand \tocbasic@end@toc@file {}\tocbasic@end@toc@file 
