<?xml version="1.0" encoding="UTF-8" standalone="no"?>
<svg
   xmlns:dc="http://purl.org/dc/elements/1.1/"
   xmlns:cc="http://creativecommons.org/ns#"
   xmlns:rdf="http://www.w3.org/1999/02/22-rdf-syntax-ns#"
   xmlns:svg="http://www.w3.org/2000/svg"
   xmlns="http://www.w3.org/2000/svg"
   xmlns:sodipodi="http://sodipodi.sourceforge.net/DTD/sodipodi-0.dtd"
   xmlns:inkscape="http://www.inkscape.org/namespaces/inkscape"
   width="86.137665mm"
   height="66.313774mm"
   viewBox="0 0 86.137665 66.313774"
   version="1.1"
   id="svg8"
   inkscape:version="1.0.2 (e86c870879, 2021-01-15)"
   sodipodi:docname="situation.svg">
  <defs
     id="defs2">
    <inkscape:path-effect
       effect="simplify"
       id="path-effect97"
       is_visible="true"
       lpeversion="1"
       steps="1"
       threshold="0.0142857"
       smooth_angles="360"
       helper_size="0"
       simplify_individual_paths="false"
       simplify_just_coalesce="false" />
    <inkscape:path-effect
       effect="spiro"
       id="path-effect79"
       is_visible="true"
       lpeversion="1" />
    <inkscape:path-effect
       effect="simplify"
       id="path-effect77"
       is_visible="true"
       lpeversion="1"
       steps="1"
       threshold="0.0142857"
       smooth_angles="360"
       helper_size="0"
       simplify_individual_paths="false"
       simplify_just_coalesce="false" />
    <inkscape:path-effect
       effect="spiro"
       id="path-effect62"
       is_visible="true"
       lpeversion="1" />
    <inkscape:path-effect
       effect="spiro"
       id="path-effect35"
       is_visible="true"
       lpeversion="1" />
    <inkscape:path-effect
       effect="spiro"
       id="path-effect14"
       is_visible="true"
       lpeversion="1" />
    <inkscape:path-effect
       effect="spiro"
       id="path-effect10"
       is_visible="true"
       lpeversion="1" />
    <marker
       id="marker-arrow-1.0616"
       orient="auto-start-reverse"
       refY="0"
       refX="0"
       markerHeight="1.6900001"
       markerWidth="0.91100001">
      <g
         transform="scale(1.3434313)"
         id="g18">
        <path
           d="M -1.55415,2.0722 C -1.42464,1.29512 0,0.1295 0.38852,0 0,-0.1295 -1.42464,-1.29512 -1.55415,-2.0722"
           style="fill:none;stroke:#000000;stroke-width:0.6;stroke-linecap:round;stroke-linejoin:round;stroke-miterlimit:10;stroke-dasharray:none;stroke-opacity:1"
           inkscape:connector-curvature="0"
           id="path16" />
      </g>
    </marker>
    <marker
       id="marker-arrow-1.0616-3"
       orient="auto-start-reverse"
       refY="0"
       refX="0"
       markerHeight="1.6900001"
       markerWidth="0.91100001">
      <g
         transform="scale(1.3434313)"
         id="g33">
        <path
           d="M -1.55415,2.0722 C -1.42464,1.29512 0,0.1295 0.38852,0 0,-0.1295 -1.42464,-1.29512 -1.55415,-2.0722"
           style="fill:none;stroke:#000000;stroke-width:0.6;stroke-linecap:round;stroke-linejoin:round;stroke-miterlimit:10;stroke-dasharray:none;stroke-opacity:1"
           inkscape:connector-curvature="0"
           id="path31" />
      </g>
    </marker>
    <marker
       id="marker-arrow-1.0616-6"
       orient="auto-start-reverse"
       refY="0"
       refX="0"
       markerHeight="1.690"
       markerWidth="0.911">
      <g
         transform="scale(1.343431298668676)"
         id="g67">
        <path
           d="M -1.55415,2.0722 C -1.42464,1.29512 0,0.1295 0.38852,0 0,-0.1295 -1.42464,-1.29512 -1.55415,-2.0722"
           style="fill:none;stroke:#000000;stroke-width:0.6;stroke-linecap:round;stroke-linejoin:round;stroke-miterlimit:10;stroke-dasharray:none;stroke-opacity:1"
           inkscape:connector-curvature="0"
           id="path65" />
      </g>
    </marker>
    <marker
       id="marker-arrow-1.0616-7"
       orient="auto-start-reverse"
       refY="0"
       refX="0"
       markerHeight="1.690"
       markerWidth="0.911">
      <g
         transform="scale(1.343431298668676)"
         id="g82">
        <path
           d="M -1.55415,2.0722 C -1.42464,1.29512 0,0.1295 0.38852,0 0,-0.1295 -1.42464,-1.29512 -1.55415,-2.0722"
           style="fill:none;stroke:#000000;stroke-width:0.6;stroke-linecap:round;stroke-linejoin:round;stroke-miterlimit:10;stroke-dasharray:none;stroke-opacity:1"
           inkscape:connector-curvature="0"
           id="path80" />
      </g>
    </marker>
  </defs>
  <sodipodi:namedview
     id="base"
     pagecolor="#ffffff"
     bordercolor="#666666"
     borderopacity="1.0"
     inkscape:pageopacity="0.0"
     inkscape:pageshadow="2"
     inkscape:zoom="1.9887477"
     inkscape:cx="204.92948"
     inkscape:cy="123.6193"
     inkscape:document-units="mm"
     inkscape:current-layer="layer1"
     showgrid="false"
     showborder="true"
     width="200mm"
     showguides="true"
     inkscape:guide-bbox="true"
     inkscape:window-width="868"
     inkscape:window-height="855"
     inkscape:window-x="5"
     inkscape:window-y="38"
     inkscape:window-maximized="1"
     inkscape:document-rotation="0">
    <inkscape:grid
       type="xygrid"
       id="grid815"
       units="mm"
       spacingx="10"
       spacingy="10"
       empspacing="4"
       dotted="false"
       originx="-20.993838"
       originy="-15.637205" />
  </sodipodi:namedview>
  <metadata
     id="metadata5">
    <rdf:RDF>
      <cc:Work
         rdf:about="">
        <dc:format>image/svg+xml</dc:format>
        <dc:type
           rdf:resource="http://purl.org/dc/dcmitype/StillImage" />
        <dc:title />
      </cc:Work>
    </rdf:RDF>
  </metadata>
  <g
     inkscape:label="Layer 1"
     inkscape:groupmode="layer"
     id="layer1"
     transform="translate(-20.993839,-192.6372)">
    <path
       style="fill:none;fill-opacity:1;stroke:#000000;stroke-width:0.280882;stroke-linecap:butt;stroke-linejoin:miter;stroke-dasharray:none;stroke-opacity:1;marker-start:none;marker-end:url(#marker-arrow-1.0616)"
       d="M 64.52863,258.95098 V 192.89699"
       id="path8"
       inkscape:path-effect="#path-effect10"
       inkscape:original-d="m 64.52863,258.95098 c 2.65e-4,-22.01773 2.65e-4,-44.03573 0,-66.05399" />
    <path
       style="fill:none;fill-opacity:1;stroke:#000000;stroke-width:0.280882;stroke-linecap:butt;stroke-linejoin:miter;stroke-dasharray:none;stroke-opacity:1;marker-start:none;marker-end:url(#marker-arrow-1.0616)"
       d="M 20.993839,248.88412 H 106.87172"
       id="path12"
       inkscape:path-effect="#path-effect14"
       inkscape:original-d="m 20.993839,248.88412 c 34.410192,2.6e-4 51.468216,2.6e-4 85.877881,0"
       sodipodi:nodetypes="cc" />
    <circle
       style="fill:#000000;fill-opacity:1;stroke:none;stroke-width:0.280882;stroke-dasharray:none;stroke-opacity:1;marker-start:none;marker-end:none;paint-order:stroke fill markers"
       id="path46"
       sodipodi:type="arc"
       sodipodi:cx="36.057899"
       sodipodi:cy="248.78664"
       sodipodi:rx="0.97833329"
       sodipodi:ry="0.97833329"
       sodipodi:start="0.013264816"
       sodipodi:end="0.013185404"
       sodipodi:open="true"
       sodipodi:arc-type="arc"
       d="m 37.036147,248.79961 a 0.97833329,0.97833329 0 0 1 -0.991205,0.96527 0.97833329,0.97833329 0 0 1 -0.96529,-0.99118 0.97833329,0.97833329 0 0 1 0.991166,-0.96531 0.97833329,0.97833329 0 0 1 0.96533,0.99115" />
    <circle
       style="fill:#000000;fill-opacity:1;stroke:none;stroke-width:0.280882;stroke-dasharray:none;stroke-opacity:1;marker-start:none;marker-end:none;paint-order:stroke fill markers"
       id="path46-6"
       sodipodi:type="arc"
       sodipodi:cx="92.574982"
       sodipodi:cy="249.11436"
       sodipodi:rx="0.97833329"
       sodipodi:ry="0.97833329"
       sodipodi:start="0.013264816"
       sodipodi:end="0.013185404"
       sodipodi:open="true"
       sodipodi:arc-type="arc"
       d="m 93.553229,249.12734 a 0.97833329,0.97833329 0 0 1 -0.991205,0.96527 0.97833329,0.97833329 0 0 1 -0.96529,-0.99118 0.97833329,0.97833329 0 0 1 0.991166,-0.96531 0.97833329,0.97833329 0 0 1 0.96533,0.99114" />
    <text
       style="font-size:2.64583px;font-family:monospace;-inkscape-font-specification:'monospace, Normal';fill:#000000;fill-opacity:1;stroke:none;stroke-width:0.264583"
       xml:space="preserve"
       id="text78"
       y="254.84531"
       x="33.755768"><tspan
         sodipodi:role="line"
         id="tspan76"
         x="33.755768"
         y="254.84531"
         style="stroke-width:0.264583">$q$</tspan></text>
    <text
       style="font-size:2.64583px;font-family:monospace;-inkscape-font-specification:'monospace, Normal';fill:#000000;fill-opacity:1;stroke:none;stroke-width:0.264583"
       xml:space="preserve"
       id="text92"
       y="254.50662"
       x="94.431992"><tspan
         sodipodi:role="line"
         id="tspan90"
         x="94.431992"
         y="254.50662"
         style="stroke-width:0.264583">$q$</tspan></text>
    <text
       style="font-size:2.64583px;font-family:monospace;-inkscape-font-specification:'monospace, Normal';fill:#000000;fill-opacity:1;stroke:none;stroke-width:0.264583"
       xml:space="preserve"
       id="text106"
       y="254.75157"
       x="48.714775"><tspan
         sodipodi:role="line"
         id="tspan104"
         x="48.714775"
         y="254.75157"
         style="stroke-width:0.264583">$d/2$</tspan></text>
    <text
       style="font-size:2.64583px;font-family:monospace;-inkscape-font-specification:'monospace, Normal';fill:#000000;fill-opacity:1;stroke:none;stroke-width:0.264583"
       xml:space="preserve"
       id="text120"
       y="254.55246"
       x="70.958641"><tspan
         sodipodi:role="line"
         id="tspan118"
         x="70.958641"
         y="254.55246"
         style="stroke-width:0.264583">$d/2$</tspan></text>
    <circle
       style="fill:#000000;fill-opacity:1;stroke:none;stroke-width:0.280882;stroke-dasharray:none;stroke-opacity:1;marker-start:none;marker-end:none;paint-order:stroke fill markers"
       id="path46-7"
       sodipodi:type="arc"
       sodipodi:cx="64.503693"
       sodipodi:cy="201.8318"
       sodipodi:rx="0.97833329"
       sodipodi:ry="0.97833329"
       sodipodi:start="0.013264816"
       sodipodi:end="0.013185404"
       sodipodi:open="true"
       sodipodi:arc-type="arc"
       d="m 65.48194,201.84478 a 0.97833329,0.97833329 0 0 1 -0.991205,0.96527 0.97833329,0.97833329 0 0 1 -0.96529,-0.99119 0.97833329,0.97833329 0 0 1 0.991166,-0.96531 0.97833329,0.97833329 0 0 1 0.96533,0.99115" />
    <text
       style="font-size:2.64583px;font-family:monospace;-inkscape-font-specification:'monospace, Normal';fill:#000000;fill-opacity:1;stroke:none;stroke-width:0.264583"
       xml:space="preserve"
       id="text168"
       y="202.88998"
       x="68.181679"><tspan
         sodipodi:role="line"
         id="tspan166"
         x="68.181679"
         y="202.88998"
         style="stroke-width:0.264583">$P$</tspan></text>
    <text
       style="font-size:2.64583px;font-family:monospace;-inkscape-font-specification:'monospace, Normal';fill:#000000;fill-opacity:1;stroke:none;stroke-width:0.264583"
       xml:space="preserve"
       id="text182"
       y="227.11853"
       x="68.020264"><tspan
         sodipodi:role="line"
         id="tspan180"
         x="68.020264"
         y="227.11853"
         style="stroke-width:0.264583">$z$</tspan></text>
    <path
       style="fill:none;stroke:black;stroke-width:0.28088167;stroke-linecap:butt;stroke-linejoin:miter;stroke-opacity:1;fill-opacity:1;marker-end:url(#marker-arrow-1.0616);marker-start:none;stroke-dasharray:none"
       d="M 35.977812,248.79961 68.534718,194.84109"
       id="path33"
       inkscape:path-effect="#path-effect35"
       inkscape:original-d="M 35.977812,248.79961 C 46.830379,230.8137 68.534718,194.84109 68.534718,194.84109" />
    <path
       style="fill:none;stroke:black;stroke-width:0.28088167;stroke-linecap:butt;stroke-linejoin:miter;stroke-opacity:1;fill-opacity:1;marker-end:url(#marker-arrow-1.0616);marker-start:none;stroke-dasharray:none"
       d="M 92.521597,248.69743 59.964696,194.73891"
       id="path33-3"
       inkscape:path-effect="#path-effect62"
       inkscape:original-d="M 92.521597,248.69743 C 81.66903,230.71152 59.964696,194.73891 59.964696,194.73891" />
    <text
       style="font-size:2.64583px;font-family:monospace;-inkscape-font-specification:'monospace, Normal';fill:#000000;fill-opacity:1;stroke:none;stroke-width:0.264583"
       xml:space="preserve"
       id="text97"
       x="52.341366"
       y="196.41805"><tspan
         sodipodi:role="line"
         id="tspan95"
         x="52.341366"
         y="196.41805"
         style="stroke-width:0.264583">$\mathbf{E}_2$</tspan></text>
    <text
       style="font-size:2.64583px;font-family:monospace;-inkscape-font-specification:'monospace, Normal';fill:#000000;fill-opacity:1;stroke:none;stroke-width:0.264583"
       xml:space="preserve"
       id="text111"
       x="70.701691"
       y="196.34015"><tspan
         sodipodi:role="line"
         id="tspan109"
         x="70.701691"
         y="196.34015"
         style="stroke-width:0.264583">$\mathbf{E}_1$</tspan></text>
    <text
       style="font-size:2.64583px;font-family:monospace;-inkscape-font-specification:'monospace, Normal';fill:#000000;fill-opacity:1;stroke:none;stroke-width:0.264583"
       xml:space="preserve"
       id="text49"
       x="62.534454"
       y="190.71678"><tspan
         sodipodi:role="line"
         id="tspan47"
         x="62.534454"
         y="190.71678"
         style="stroke-width:0.264583">$\mathbf{E}$</tspan></text>
    <text
       style="font-size:2.64583px;font-family:monospace;-inkscape-font-specification:'monospace, Normal';fill:#000000;fill-opacity:1;stroke:none;stroke-width:0.264583"
       xml:space="preserve"
       id="text63"
       x="77.053078"
       y="218.93488"><tspan
         sodipodi:role="line"
         id="tspan61"
         x="77.053078"
         y="218.93488"
         style="stroke-width:0.264583">$\mathbfscr{r}$</tspan></text>
    <path
       style="fill:none;stroke:#000000;stroke-width:0.264583px;stroke-linecap:butt;stroke-linejoin:miter;stroke-opacity:1"
       d="m 64.39966,210.96561 c -0.824731,0.57141 -1.900578,0.76518 -2.87285,0.51745 -0.734588,-0.18717 -1.40458,-0.61911 -1.878302,-1.21092"
       id="path75"
       inkscape:path-effect="#path-effect77;#path-effect79"
       inkscape:original-d="m 64.39966,210.96561 c -2.052587,0.91028 -3.123366,0.87577 -4.751152,-0.69347" />
    <text
       style="font-size:2.64583px;font-family:monospace;-inkscape-font-specification:'monospace, Normal';fill:#000000;fill-opacity:1;stroke:none;stroke-width:0.264583"
       xml:space="preserve"
       id="text83"
       x="60.274303"
       y="216.25572"><tspan
         sodipodi:role="line"
         id="tspan81"
         x="60.274303"
         y="216.25572"
         style="stroke-width:0.264583">$\theta$</tspan></text>
  </g>
</svg>
