<?xml version="1.0" encoding="UTF-8" standalone="no"?>
<svg
   xmlns:dc="http://purl.org/dc/elements/1.1/"
   xmlns:cc="http://creativecommons.org/ns#"
   xmlns:rdf="http://www.w3.org/1999/02/22-rdf-syntax-ns#"
   xmlns:svg="http://www.w3.org/2000/svg"
   xmlns="http://www.w3.org/2000/svg"
   xmlns:sodipodi="http://sodipodi.sourceforge.net/DTD/sodipodi-0.dtd"
   xmlns:inkscape="http://www.inkscape.org/namespaces/inkscape"
   width="122.59882mm"
   height="56.212776mm"
   viewBox="0 0 122.59882 56.212776"
   version="1.1"
   id="svg8"
   inkscape:version="1.0.2 (e86c870879, 2021-01-15)"
   sodipodi:docname="sequences.svg">
  <defs
     id="defs2">
    <inkscape:path-effect
       effect="spiro"
       id="path-effect322"
       is_visible="true"
       lpeversion="1" />
    <inkscape:path-effect
       effect="spiro"
       id="path-effect317"
       is_visible="true"
       lpeversion="1" />
    <inkscape:path-effect
       effect="spiro"
       id="path-effect294"
       is_visible="true"
       lpeversion="1" />
    <inkscape:path-effect
       effect="spiro"
       id="path-effect290"
       is_visible="true"
       lpeversion="1" />
    <inkscape:path-effect
       effect="spiro"
       id="path-effect286"
       is_visible="true"
       lpeversion="1" />
    <inkscape:path-effect
       effect="spiro"
       id="path-effect282"
       is_visible="true"
       lpeversion="1" />
    <inkscape:path-effect
       effect="spiro"
       id="path-effect203"
       is_visible="true"
       lpeversion="1" />
    <inkscape:path-effect
       effect="spiro"
       id="path-effect10"
       is_visible="true"
       lpeversion="1" />
  </defs>
  <sodipodi:namedview
     id="base"
     pagecolor="#ffffff"
     bordercolor="#666666"
     borderopacity="1.0"
     inkscape:pageopacity="0.0"
     inkscape:pageshadow="2"
     inkscape:zoom="1.9887478"
     inkscape:cx="273.28886"
     inkscape:cy="144.70473"
     inkscape:document-units="mm"
     inkscape:current-layer="layer1"
     showgrid="false"
     showborder="true"
     width="200mm"
     showguides="true"
     inkscape:guide-bbox="true"
     inkscape:window-width="1400"
     inkscape:window-height="900"
     inkscape:window-x="87"
     inkscape:window-y="33"
     inkscape:window-maximized="1"
     inkscape:document-rotation="0">
    <inkscape:grid
       type="xygrid"
       id="grid815"
       units="mm"
       spacingx="10"
       spacingy="10"
       empspacing="4"
       dotted="false"
       originx="-2.9070854"
       originy="-31.34478" />
  </sodipodi:namedview>
  <metadata
     id="metadata5">
    <rdf:RDF>
      <cc:Work
         rdf:about="">
        <dc:format>image/svg+xml</dc:format>
        <dc:type
           rdf:resource="http://purl.org/dc/dcmitype/StillImage" />
        <dc:title />
      </cc:Work>
    </rdf:RDF>
  </metadata>
  <g
     inkscape:label="Layer 1"
     inkscape:groupmode="layer"
     id="layer1"
     transform="translate(-2.9070855,-208.34478)">
    <path
       style="fill:none;stroke:#000000;stroke-width:0.264583px;stroke-linecap:butt;stroke-linejoin:miter;stroke-opacity:1"
       d="M 23.050749,215.4459 H 102.00389"
       id="path8"
       inkscape:path-effect="#path-effect10"
       inkscape:original-d="m 23.050749,215.4459 c 26.317976,2.6e-4 52.635689,2.6e-4 78.953141,0" />
    <text
       style="font-size:2.64583px;font-family:monospace;-inkscape-font-specification:'monospace, Normal';fill:#000000;fill-opacity:1;stroke:none;stroke-width:0.264583"
       xml:space="preserve"
       id="text14"
       y="210.9901"
       x="20.972736"><tspan
         sodipodi:role="line"
         id="tspan12"
         x="20.972736"
         y="210.9901"
         style="stroke-width:0.264583">$0$</tspan></text>
    <text
       style="font-size:2.64583px;font-family:monospace;-inkscape-font-specification:'monospace, Normal';fill:#000000;fill-opacity:1;stroke:none;stroke-width:0.264583"
       xml:space="preserve"
       id="text28"
       y="221.73254"
       x="28.66934"><tspan
         sodipodi:role="line"
         x="28.66934"
         y="221.73254"
         style="stroke-width:0.264583"
         id="tspan166">$\alpha_1$</tspan></text>
    <text
       style="font-size:2.64583px;font-family:monospace;-inkscape-font-specification:'monospace, Normal';fill:#000000;fill-opacity:1;stroke:none;stroke-width:0.264583"
       xml:space="preserve"
       id="text28-3"
       y="210.3692"
       x="39.350128"><tspan
         sodipodi:role="line"
         id="tspan26-6"
         x="39.350128"
         y="210.3692"
         style="stroke-width:0.264583">$\alpha_2$</tspan></text>
    <text
       style="font-size:2.64583px;font-family:monospace;-inkscape-font-specification:'monospace, Normal';fill:#000000;fill-opacity:1;stroke:none;stroke-width:0.264583"
       xml:space="preserve"
       id="text28-7"
       y="221.08961"
       x="51.80249"><tspan
         sodipodi:role="line"
         id="tspan26-5"
         x="51.80249"
         y="221.08961"
         style="stroke-width:0.264583">$\alpha_3$</tspan></text>
    <circle
       style="fill:#000000;fill-opacity:1;stroke:none;stroke-width:0.280882;stroke-opacity:1;marker-start:none;marker-end:none;paint-order:stroke fill markers"
       id="path78"
       sodipodi:type="arc"
       sodipodi:cx="30.419895"
       sodipodi:cy="215.42226"
       sodipodi:rx="0.75721675"
       sodipodi:ry="0.75721675"
       sodipodi:start="0.013264816"
       sodipodi:end="0.013185404"
       sodipodi:open="true"
       sodipodi:arc-type="arc"
       d="m 31.177045,215.4323 a 0.75721675,0.75721675 0 0 1 -0.767179,0.74711 0.75721675,0.75721675 0 0 1 -0.747121,-0.76717 0.75721675,0.75721675 0 0 1 0.767149,-0.74713 0.75721675,0.75721675 0 0 1 0.747152,0.76713" />
    <circle
       style="fill:#000000;fill-opacity:1;stroke:none;stroke-width:0.280882;stroke-opacity:1;marker-start:none;marker-end:none;paint-order:stroke fill markers"
       id="path78-3"
       sodipodi:type="arc"
       sodipodi:cx="41.955853"
       sodipodi:cy="215.39273"
       sodipodi:rx="0.75721675"
       sodipodi:ry="0.75721675"
       sodipodi:start="0.013264816"
       sodipodi:end="0.013185404"
       sodipodi:open="true"
       sodipodi:arc-type="arc"
       d="m 42.713003,215.40277 a 0.75721675,0.75721675 0 0 1 -0.76718,0.74711 0.75721675,0.75721675 0 0 1 -0.747121,-0.76716 0.75721675,0.75721675 0 0 1 0.767149,-0.74714 0.75721675,0.75721675 0 0 1 0.747152,0.76713" />
    <circle
       style="fill:#000000;fill-opacity:1;stroke:none;stroke-width:0.280882;stroke-opacity:1;marker-start:none;marker-end:none;paint-order:stroke fill markers"
       id="path78-5"
       sodipodi:type="arc"
       sodipodi:cx="54.343884"
       sodipodi:cy="215.49219"
       sodipodi:rx="0.75721675"
       sodipodi:ry="0.75721675"
       sodipodi:start="0.013264816"
       sodipodi:end="0.013185404"
       sodipodi:open="true"
       sodipodi:arc-type="arc"
       d="m 55.101034,215.50223 a 0.75721675,0.75721675 0 0 1 -0.76718,0.74711 0.75721675,0.75721675 0 0 1 -0.747121,-0.76717 0.75721675,0.75721675 0 0 1 0.767149,-0.74713 0.75721675,0.75721675 0 0 1 0.747152,0.76713" />
    <circle
       style="fill:#000000;fill-opacity:1;stroke:none;stroke-width:0.280882;stroke-opacity:1;marker-start:none;marker-end:none;paint-order:stroke fill markers"
       id="path78-5-9"
       sodipodi:type="arc"
       sodipodi:cx="65.822968"
       sodipodi:cy="215.36359"
       sodipodi:rx="0.75721675"
       sodipodi:ry="0.75721675"
       sodipodi:start="0.013264816"
       sodipodi:end="0.013185404"
       sodipodi:open="true"
       sodipodi:arc-type="arc"
       d="m 66.580118,215.37363 a 0.75721675,0.75721675 0 0 1 -0.767179,0.74711 0.75721675,0.75721675 0 0 1 -0.747122,-0.76717 0.75721675,0.75721675 0 0 1 0.767149,-0.74713 0.75721675,0.75721675 0 0 1 0.747152,0.76713" />
    <path
       style="fill:none;stroke:#000000;stroke-width:0.264583px;stroke-linecap:butt;stroke-linejoin:miter;stroke-opacity:1"
       d="M 22.805562,237.99507 H 101.7587"
       id="path8-1"
       inkscape:path-effect="#path-effect203"
       inkscape:original-d="m 22.805562,237.99507 c 26.317976,2.6e-4 52.635689,2.6e-4 78.953138,0" />
    <circle
       style="fill:#000000;fill-opacity:1;stroke:none;stroke-width:0.280882;stroke-opacity:1;marker-start:none;marker-end:none;paint-order:stroke fill markers"
       id="path78-5-0"
       sodipodi:type="arc"
       sodipodi:cx="47.696861"
       sodipodi:cy="237.97726"
       sodipodi:rx="0.75721675"
       sodipodi:ry="0.75721675"
       sodipodi:start="0.013264816"
       sodipodi:end="0.013185404"
       sodipodi:open="true"
       sodipodi:arc-type="arc"
       d="m 48.454011,237.98731 a 0.75721675,0.75721675 0 0 1 -0.767179,0.7471 0.75721675,0.75721675 0 0 1 -0.747121,-0.76716 0.75721675,0.75721675 0 0 1 0.767149,-0.74714 0.75721675,0.75721675 0 0 1 0.747152,0.76714" />
    <circle
       style="fill:#000000;fill-opacity:1;stroke:none;stroke-width:0.280882;stroke-opacity:1;marker-start:none;marker-end:none;paint-order:stroke fill markers"
       id="path78-5-9-9"
       sodipodi:type="arc"
       sodipodi:cx="77.84494"
       sodipodi:cy="237.96387"
       sodipodi:rx="0.75721675"
       sodipodi:ry="0.75721675"
       sodipodi:start="0.013264816"
       sodipodi:end="0.013185404"
       sodipodi:open="true"
       sodipodi:arc-type="arc"
       d="m 78.60209,237.97391 a 0.75721675,0.75721675 0 0 1 -0.767179,0.74711 0.75721675,0.75721675 0 0 1 -0.747121,-0.76717 0.75721675,0.75721675 0 0 1 0.767149,-0.74713 0.75721675,0.75721675 0 0 1 0.747152,0.76713" />
    <text
       style="font-size:2.64583px;font-family:monospace;-inkscape-font-specification:'monospace, Normal';fill:#000000;fill-opacity:1;stroke:none;stroke-width:0.264583"
       xml:space="preserve"
       id="text212"
       y="210.41312"
       x="63.147594"><tspan
         sodipodi:role="line"
         id="tspan210"
         x="63.147594"
         y="210.41312"
         style="stroke-width:0.264583">$\alpha_3$</tspan></text>
    <text
       style="font-size:2.64583px;font-family:monospace;-inkscape-font-specification:'monospace, Normal';fill:#000000;fill-opacity:1;stroke:none;stroke-width:0.264583"
       xml:space="preserve"
       id="text226"
       y="244.33911"
       x="14.145354"><tspan
         sodipodi:role="line"
         id="tspan224"
         x="14.145354"
         y="244.33911"
         style="stroke-width:0.264583">$\cdots=\beta_5=\beta_3=\beta_1$</tspan></text>
    <text
       style="font-size:2.64583px;font-family:monospace;-inkscape-font-specification:'monospace, Normal';fill:#000000;fill-opacity:1;stroke:none;stroke-width:0.264583"
       xml:space="preserve"
       id="text240"
       y="244.0193"
       x="74.686073"><tspan
         sodipodi:role="line"
         id="tspan238"
         x="74.686073"
         y="244.0193"
         style="stroke-width:0.264583">$\beta_2=\beta_4=\beta_6=\cdots$</tspan></text>
    <text
       style="font-size:2.64583px;font-family:monospace;-inkscape-font-specification:'monospace, Normal';fill:#000000;fill-opacity:1;stroke:none;stroke-width:0.264583"
       xml:space="preserve"
       id="text14-3"
       y="235.38371"
       x="59.841476"><tspan
         sodipodi:role="line"
         id="tspan12-6"
         x="59.841476"
         y="235.38371"
         style="stroke-width:0.264583">$0$</tspan></text>
    <path
       style="fill:none;stroke:#000000;stroke-width:0.264583px;stroke-linecap:butt;stroke-linejoin:miter;stroke-opacity:1"
       d="m 62.069447,236.42931 v 3.49571"
       id="path284"
       inkscape:path-effect="#path-effect286"
       inkscape:original-d="m 62.069447,236.42931 c 2.65e-4,1.1655 2.65e-4,2.33074 0,3.49571" />
    <path
       style="fill:none;stroke:#000000;stroke-width:0.264583px;stroke-linecap:butt;stroke-linejoin:miter;stroke-opacity:1"
       d="m 23.050749,212.58916 v 2.85674 2.81674"
       id="path288"
       inkscape:path-effect="#path-effect290"
       inkscape:original-d="m 23.050749,212.58916 c 2.64e-4,0.95251 2.65e-4,1.90476 0,2.85674 -2.65e-4,0.95198 2.65e-4,1.87809 0,2.81674" />
    <path
       style="fill:none;stroke:#000000;stroke-width:0.264583px;stroke-linecap:butt;stroke-linejoin:miter;stroke-opacity:1"
       d="M 35.634727,258.69162 H 114.58786"
       id="path8-1-0"
       inkscape:path-effect="#path-effect317"
       inkscape:original-d="m 35.634727,258.69162 c 26.317976,2.6e-4 52.635689,2.6e-4 78.953133,0" />
    <path
       style="fill:none;stroke:#000000;stroke-width:0.264583px;stroke-linecap:butt;stroke-linejoin:miter;stroke-opacity:1"
       d="m 42.204526,256.41784 v 4.38119"
       id="path320"
       inkscape:path-effect="#path-effect322"
       inkscape:original-d="m 42.204526,256.41784 c 2.64e-4,1.46066 2.64e-4,2.92106 0,4.38119" />
    <text
       style="font-size:2.64583px;font-family:monospace;-inkscape-font-specification:'monospace, Normal';fill:#000000;fill-opacity:1;stroke:none;stroke-width:0.264583"
       xml:space="preserve"
       id="text326"
       y="254.43451"
       x="41.412426"><tspan
         sodipodi:role="line"
         id="tspan324"
         x="41.412426"
         y="254.43451"
         style="stroke-width:0.264583">0</tspan></text>
    <circle
       style="fill:#000000;fill-opacity:1;stroke:none;stroke-width:0.280882;stroke-opacity:1;marker-start:none;marker-end:none;paint-order:stroke fill markers"
       id="path78-5-9-9-6"
       sodipodi:type="arc"
       sodipodi:cx="64.334114"
       sodipodi:cy="258.69244"
       sodipodi:rx="0.75721675"
       sodipodi:ry="0.75721675"
       sodipodi:start="0.013264816"
       sodipodi:end="0.013185404"
       sodipodi:open="true"
       sodipodi:arc-type="arc"
       d="m 65.091264,258.70249 a 0.75721675,0.75721675 0 0 1 -0.767179,0.7471 0.75721675,0.75721675 0 0 1 -0.747121,-0.76716 0.75721675,0.75721675 0 0 1 0.767149,-0.74714 0.75721675,0.75721675 0 0 1 0.747152,0.76714" />
    <circle
       style="fill:#000000;fill-opacity:1;stroke:none;stroke-width:0.280882;stroke-opacity:1;marker-start:none;marker-end:none;paint-order:stroke fill markers"
       id="path78-5-9-9-2"
       sodipodi:type="arc"
       sodipodi:cx="59.145145"
       sodipodi:cy="258.69339"
       sodipodi:rx="0.75721675"
       sodipodi:ry="0.75721675"
       sodipodi:start="0.013264816"
       sodipodi:end="0.013185404"
       sodipodi:open="true"
       sodipodi:arc-type="arc"
       d="m 59.902296,258.70343 a 0.75721675,0.75721675 0 0 1 -0.76718,0.74711 0.75721675,0.75721675 0 0 1 -0.747121,-0.76716 0.75721675,0.75721675 0 0 1 0.767149,-0.74714 0.75721675,0.75721675 0 0 1 0.747152,0.76713" />
    <circle
       style="fill:#000000;fill-opacity:1;stroke:none;stroke-width:0.280882;stroke-opacity:1;marker-start:none;marker-end:none;paint-order:stroke fill markers"
       id="path78-5-9-9-61"
       sodipodi:type="arc"
       sodipodi:cx="55.09153"
       sodipodi:cy="258.75595"
       sodipodi:rx="0.75721675"
       sodipodi:ry="0.75721675"
       sodipodi:start="0.013264816"
       sodipodi:end="0.013185404"
       sodipodi:open="true"
       sodipodi:arc-type="arc"
       d="m 55.84868,258.76599 a 0.75721675,0.75721675 0 0 1 -0.767179,0.74711 0.75721675,0.75721675 0 0 1 -0.747122,-0.76716 0.75721675,0.75721675 0 0 1 0.76715,-0.74714 0.75721675,0.75721675 0 0 1 0.747152,0.76713" />
    <circle
       style="fill:#000000;fill-opacity:1;stroke:none;stroke-width:0.280882;stroke-opacity:1;marker-start:none;marker-end:none;paint-order:stroke fill markers"
       id="path78-5-9-9-8"
       sodipodi:type="arc"
       sodipodi:cx="72.333199"
       sodipodi:cy="258.61993"
       sodipodi:rx="0.75721675"
       sodipodi:ry="0.75721675"
       sodipodi:start="0.013264816"
       sodipodi:end="0.013185404"
       sodipodi:open="true"
       sodipodi:arc-type="arc"
       d="m 73.090349,258.62998 a 0.75721675,0.75721675 0 0 1 -0.767179,0.7471 0.75721675,0.75721675 0 0 1 -0.747122,-0.76716 0.75721675,0.75721675 0 0 1 0.767149,-0.74714 0.75721675,0.75721675 0 0 1 0.747152,0.76714" />
    <circle
       style="fill:#000000;fill-opacity:1;stroke:none;stroke-width:0.280882;stroke-opacity:1;marker-start:none;marker-end:none;paint-order:stroke fill markers"
       id="path78-5-9-9-7"
       sodipodi:type="arc"
       sodipodi:cx="89.778015"
       sodipodi:cy="258.66058"
       sodipodi:rx="0.75721675"
       sodipodi:ry="0.75721675"
       sodipodi:start="0.013264816"
       sodipodi:end="0.013185404"
       sodipodi:open="true"
       sodipodi:arc-type="arc"
       d="m 90.535165,258.67063 a 0.75721675,0.75721675 0 0 1 -0.767179,0.7471 0.75721675,0.75721675 0 0 1 -0.747121,-0.76716 0.75721675,0.75721675 0 0 1 0.767149,-0.74714 0.75721675,0.75721675 0 0 1 0.747152,0.76714" />
    <text
       style="font-size:2.64583px;font-family:monospace;-inkscape-font-specification:'monospace, Normal';fill:#000000;fill-opacity:1;stroke:none;stroke-width:0.264583"
       xml:space="preserve"
       id="text396"
       y="263.93356"
       x="88.320923"><tspan
         sodipodi:role="line"
         id="tspan394"
         x="88.320923"
         y="263.93356"
         style="stroke-width:0.264583">$\gamma_1$</tspan></text>
    <text
       style="font-size:2.64583px;font-family:monospace;-inkscape-font-specification:'monospace, Normal';fill:#000000;fill-opacity:1;stroke:none;stroke-width:0.264583"
       xml:space="preserve"
       id="text396-9"
       y="254.85397"
       x="72.201233"><tspan
         sodipodi:role="line"
         x="72.201233"
         y="254.85397"
         style="stroke-width:0.264583"
         id="tspan468">$\gamma_2$</tspan></text>
    <text
       style="font-size:2.64583px;font-family:monospace;-inkscape-font-specification:'monospace, Normal';fill:#000000;fill-opacity:1;stroke:none;stroke-width:0.264583"
       xml:space="preserve"
       id="text396-0"
       y="263.84131"
       x="63.578552"><tspan
         sodipodi:role="line"
         id="tspan394-23"
         x="63.578552"
         y="263.84131"
         style="stroke-width:0.264583">$\gamma_3$</tspan></text>
    <text
       style="font-size:2.64583px;font-family:monospace;-inkscape-font-specification:'monospace, Normal';fill:#000000;fill-opacity:1;stroke:none;stroke-width:0.264583"
       xml:space="preserve"
       id="text396-7"
       y="254.8111"
       x="57.78685"><tspan
         sodipodi:role="line"
         id="tspan394-5"
         x="57.78685"
         y="254.8111"
         style="stroke-width:0.264583">$\gamma_4$</tspan></text>
    <text
       style="font-size:2.64583px;font-family:monospace;-inkscape-font-specification:'monospace, Normal';fill:#000000;fill-opacity:1;stroke:none;stroke-width:0.264583"
       xml:space="preserve"
       id="text396-92"
       y="263.78336"
       x="53.778297"><tspan
         sodipodi:role="line"
         id="tspan394-28"
         x="53.778297"
         y="263.78336"
         style="stroke-width:0.264583">$\gamma_5$</tspan></text>
  </g>
</svg>
