PWD /home/juan/Personal/latex/2022/beam-angle
INPUT /var/lib/texmf/web2c/luahbtex/lualatex.fmt
INPUT ./main.tex
OUTPUT main.log
INPUT /usr/share/texmf-dist/tex/latex/latexconfig/lualatexquotejobname.lua
INPUT /usr/share/texmf-dist/tex/latex/base/ltluatex.lua
INPUT /usr/share/texmf-dist/tex/luatex/luaotfload/luaotfload-main.lua
INPUT /usr/share/texmf-dist/tex/luatex/luaotfload/luaotfload.lua
INPUT /usr/share/texmf-dist/tex/luatex/luaotfload/luaotfload-init.lua
INPUT /usr/share/texmf-dist/tex/luatex/lualibs/lualibs.lua
INPUT /usr/share/texmf-dist/tex/luatex/lualibs/lualibs-basic.lua
INPUT /usr/share/texmf-dist/tex/luatex/lualibs/lualibs-basic-merged.lua
INPUT /usr/share/texmf-dist/tex/luatex/lualibs/lualibs-compat.lua
INPUT /usr/share/texmf-dist/tex/luatex/lualibs/lualibs-extended.lua
INPUT /usr/share/texmf-dist/tex/luatex/lualibs/lualibs-extended-merged.lua
INPUT /usr/share/texmf-dist/tex/luatex/luaotfload/luaotfload-log.lua
INPUT /usr/share/texmf-dist/tex/luatex/luaotfload/fontloader-basics-gen.lua
OUTPUT /home/juan/.texlive/texmf-var/m_t_x_t_e_s_t.tmp
INPUT /usr/share/texmf-dist/tex/luatex/luaotfload/luaotfload-parsers.lua
INPUT /usr/share/texmf-dist/tex/luatex/luaotfload/luaotfload-configuration.lua
INPUT /usr/share/texmf-dist/tex/luatex/luaotfload/luaotfload-status.lua
INPUT /usr/share/texmf-dist/tex/luatex/luaotfload/fontloader-2021-05-20.lua
INPUT /usr/share/texmf-dist/tex/luatex/luaotfload/luaotfload-fallback.lua
INPUT /usr/share/texmf-dist/tex/luatex/luaotfload/luaotfload-multiscript.lua
INPUT /usr/share/texmf-dist/tex/luatex/luaotfload/luaotfload-scripts.lua
INPUT /usr/share/texmf-dist/tex/generic/unicode-data/ScriptExtensions.txt
INPUT /usr/share/texmf-dist/tex/generic/unicode-data/Scripts.txt
INPUT /usr/share/texmf-dist/tex/luatex/luaotfload/luaotfload-loaders.lua
INPUT /usr/share/texmf-dist/tex/luatex/luaotfload/luaotfload-database.lua
INPUT /usr/share/texmf-dist/tex/luatex/luaotfload/luaotfload-unicode.lua
INPUT /usr/share/texmf-dist/tex/generic/unicode-data/CaseFolding.txt
INPUT /usr/share/texmf-dist/tex/generic/unicode-data/UnicodeData.txt
INPUT /usr/share/texmf-dist/tex/generic/unicode-data/UnicodeData.txt
INPUT /usr/share/texmf-dist/tex/generic/unicode-data/PropList.txt
INPUT /usr/share/texmf-dist/tex/generic/unicode-data/WordBreakProperty.txt
INPUT /usr/share/texmf-dist/tex/generic/unicode-data/SpecialCasing.txt
INPUT /usr/share/texmf-dist/tex/luatex/luaotfload/luaotfload-colors.lua
INPUT /usr/share/texmf-dist/tex/luatex/luaotfload/luaotfload-resolvers.lua
INPUT /usr/share/texmf-dist/tex/luatex/luaotfload/luaotfload-features.lua
INPUT /usr/share/texmf-dist/tex/luatex/luaotfload/luaotfload-harf-define.lua
INPUT /usr/share/texmf-dist/tex/luatex/luaotfload/luaotfload-harf-plug.lua
INPUT /usr/share/texmf-dist/tex/luatex/luaotfload/luaotfload-letterspace.lua
INPUT /usr/share/texmf-dist/tex/luatex/luaotfload/luaotfload-embolden.lua
INPUT /usr/share/texmf-dist/tex/luatex/luaotfload/luaotfload-notdef.lua
INPUT /usr/share/texmf-dist/tex/generic/unicode-data/UnicodeData.txt
INPUT /usr/share/texmf-dist/tex/generic/unicode-data/PropList.txt
INPUT /usr/share/texmf-dist/tex/luatex/luaotfload/luaotfload-suppress.lua
INPUT /usr/share/texmf-dist/tex/luatex/luaotfload/luaotfload-szss.lua
INPUT /usr/share/texmf-dist/tex/luatex/luaotfload/luaotfload-auxiliary.lua
INPUT /usr/share/texmf-dist/tex/luatex/luaotfload/luaotfload-tounicode.lua
INPUT /usr/share/texmf-dist/tex/luatex/luaotfload/luaotfload-case.lua
INPUT /usr/share/texmf-dist/tex/latex/l3kernel/expl3.lua
INPUT /usr/share/texmf-dist/tex/latex/koma-script/scrarticle.cls
INPUT /usr/share/texmf-dist/tex/latex/koma-script/scrarticle.cls
INPUT /usr/share/texmf-dist/tex/latex/koma-script/scrarticle.cls
INPUT /usr/share/texmf-dist/tex/latex/koma-script/scrartcl.cls
INPUT /usr/share/texmf-dist/tex/latex/koma-script/scrartcl.cls
INPUT /usr/share/texmf-dist/tex/latex/koma-script/scrartcl.cls
INPUT /usr/share/texmf-dist/tex/latex/koma-script/scrkbase.sty
INPUT /usr/share/texmf-dist/tex/latex/koma-script/scrkbase.sty
INPUT /usr/share/texmf-dist/tex/latex/koma-script/scrkbase.sty
INPUT /usr/share/texmf-dist/tex/latex/koma-script/scrbase.sty
INPUT /usr/share/texmf-dist/tex/latex/koma-script/scrbase.sty
INPUT /usr/share/texmf-dist/tex/latex/koma-script/scrbase.sty
INPUT /usr/share/texmf-dist/tex/latex/koma-script/scrlfile.sty
INPUT /usr/share/texmf-dist/tex/latex/koma-script/scrlfile.sty
INPUT /usr/share/texmf-dist/tex/latex/koma-script/scrlfile.sty
INPUT /usr/share/texmf-dist/tex/latex/koma-script/scrlfile-hook.sty
INPUT /usr/share/texmf-dist/tex/latex/koma-script/scrlfile-hook.sty
INPUT /usr/share/texmf-dist/tex/latex/koma-script/scrlfile-hook.sty
INPUT /usr/share/texmf-dist/tex/latex/koma-script/scrlogo.sty
INPUT /usr/share/texmf-dist/tex/latex/koma-script/scrlogo.sty
INPUT /usr/share/texmf-dist/tex/latex/koma-script/scrlogo.sty
INPUT /usr/share/texmf-dist/tex/latex/graphics/keyval.sty
INPUT /usr/share/texmf-dist/tex/latex/graphics/keyval.sty
INPUT /usr/share/texmf-dist/tex/latex/graphics/keyval.sty
INPUT /usr/share/texmf-dist/tex/latex/koma-script/tocbasic.sty
INPUT /usr/share/texmf-dist/tex/latex/koma-script/tocbasic.sty
INPUT /usr/share/texmf-dist/tex/latex/koma-script/tocbasic.sty
INPUT /usr/share/texmf-dist/tex/latex/koma-script/scrsize10pt.clo
INPUT /usr/share/texmf-dist/tex/latex/koma-script/scrsize10pt.clo
INPUT /home/juan/.texlive/texmf-var/luatex-cache/generic/names/luaotfload-names.luc
INPUT /home/juan/.texlive/texmf-var/luatex-cache/generic/fonts/otl/lmroman10-regular.luc
INPUT /usr/share/texmf-dist/tex/latex/koma-script/typearea.sty
INPUT /usr/share/texmf-dist/tex/latex/koma-script/typearea.sty
INPUT /usr/share/texmf-dist/tex/latex/koma-script/typearea.sty
INPUT /usr/share/texmf-dist/tex/latex/pgfplots/pgfplots.sty
INPUT /usr/share/texmf-dist/tex/latex/pgfplots/pgfplots.sty
INPUT /usr/share/texmf-dist/tex/latex/pgfplots/pgfplots.sty
INPUT /usr/share/texmf-dist/tex/generic/pgfplots/pgfplots.revision.tex
INPUT /usr/share/texmf-dist/tex/generic/pgfplots/pgfplots.revision.tex
INPUT /usr/share/texmf-dist/tex/latex/graphics/graphicx.sty
INPUT /usr/share/texmf-dist/tex/latex/graphics/graphicx.sty
INPUT /usr/share/texmf-dist/tex/latex/graphics/graphicx.sty
INPUT /usr/share/texmf-dist/tex/latex/graphics/graphics.sty
INPUT /usr/share/texmf-dist/tex/latex/graphics/graphics.sty
INPUT /usr/share/texmf-dist/tex/latex/graphics/graphics.sty
INPUT /usr/share/texmf-dist/tex/latex/graphics/trig.sty
INPUT /usr/share/texmf-dist/tex/latex/graphics/trig.sty
INPUT /usr/share/texmf-dist/tex/latex/graphics/trig.sty
INPUT /usr/share/texmf-dist/tex/latex/graphics-cfg/graphics.cfg
INPUT /usr/share/texmf-dist/tex/latex/graphics-cfg/graphics.cfg
INPUT /usr/share/texmf-dist/tex/latex/graphics-def/luatex.def
INPUT /usr/share/texmf-dist/tex/latex/graphics-def/luatex.def
INPUT /usr/share/texmf-dist/tex/generic/pgf/systemlayer/pgfsys-luatex.def
INPUT /usr/share/texmf-dist/tex/latex/pgf/frontendlayer/tikz.sty
INPUT /usr/share/texmf-dist/tex/latex/pgf/frontendlayer/tikz.sty
INPUT /usr/share/texmf-dist/tex/latex/pgf/frontendlayer/tikz.sty
INPUT /usr/share/texmf-dist/tex/latex/pgf/basiclayer/pgf.sty
INPUT /usr/share/texmf-dist/tex/latex/pgf/basiclayer/pgf.sty
INPUT /usr/share/texmf-dist/tex/latex/pgf/basiclayer/pgf.sty
INPUT /usr/share/texmf-dist/tex/latex/pgf/utilities/pgfrcs.sty
INPUT /usr/share/texmf-dist/tex/latex/pgf/utilities/pgfrcs.sty
INPUT /usr/share/texmf-dist/tex/latex/pgf/utilities/pgfrcs.sty
INPUT /usr/share/texmf-dist/tex/generic/pgf/utilities/pgfutil-common.tex
INPUT /usr/share/texmf-dist/tex/generic/pgf/utilities/pgfutil-common-lists.tex
INPUT /usr/share/texmf-dist/tex/generic/pgf/utilities/pgfutil-latex.def
INPUT /usr/share/texmf-dist/tex/generic/pgf/utilities/pgfrcs.code.tex
INPUT /usr/share/texmf-dist/tex/generic/pgf/utilities/pgfrcs.code.tex
INPUT /usr/share/texmf-dist/tex/generic/pgf/pgf.revision.tex
INPUT /usr/share/texmf-dist/tex/generic/pgf/pgf.revision.tex
INPUT /usr/share/texmf-dist/tex/latex/pgf/basiclayer/pgfcore.sty
INPUT /usr/share/texmf-dist/tex/latex/pgf/basiclayer/pgfcore.sty
INPUT /usr/share/texmf-dist/tex/latex/pgf/basiclayer/pgfcore.sty
INPUT /usr/share/texmf-dist/tex/latex/pgf/systemlayer/pgfsys.sty
INPUT /usr/share/texmf-dist/tex/latex/pgf/systemlayer/pgfsys.sty
INPUT /usr/share/texmf-dist/tex/latex/pgf/systemlayer/pgfsys.sty
INPUT /usr/share/texmf-dist/tex/generic/pgf/systemlayer/pgfsys.code.tex
INPUT /usr/share/texmf-dist/tex/generic/pgf/systemlayer/pgfsys.code.tex
INPUT /usr/share/texmf-dist/tex/generic/pgf/utilities/pgfkeys.code.tex
INPUT /usr/share/texmf-dist/tex/generic/pgf/utilities/pgfkeysfiltered.code.tex
INPUT /usr/share/texmf-dist/tex/generic/pgf/systemlayer/pgf.cfg
INPUT /usr/share/texmf-dist/tex/generic/pgf/systemlayer/pgfsys-luatex.def
INPUT /usr/share/texmf-dist/tex/generic/pgf/systemlayer/pgfsys-luatex.def
INPUT /usr/share/texmf-dist/tex/generic/pgf/systemlayer/pgfsys-common-pdf.def
INPUT /usr/share/texmf-dist/tex/generic/pgf/systemlayer/pgfsyssoftpath.code.tex
INPUT /usr/share/texmf-dist/tex/generic/pgf/systemlayer/pgfsyssoftpath.code.tex
INPUT /usr/share/texmf-dist/tex/generic/pgf/systemlayer/pgfsysprotocol.code.tex
INPUT /usr/share/texmf-dist/tex/generic/pgf/systemlayer/pgfsysprotocol.code.tex
INPUT /usr/share/texmf-dist/tex/latex/xcolor/xcolor.sty
INPUT /usr/share/texmf-dist/tex/latex/xcolor/xcolor.sty
INPUT /usr/share/texmf-dist/tex/latex/xcolor/xcolor.sty
INPUT /usr/share/texmf-dist/tex/latex/graphics-cfg/color.cfg
INPUT /usr/share/texmf-dist/tex/latex/graphics-cfg/color.cfg
INPUT /usr/share/texmf-dist/tex/generic/pgf/basiclayer/pgfcore.code.tex
INPUT /usr/share/texmf-dist/tex/generic/pgf/basiclayer/pgfcore.code.tex
INPUT /usr/share/texmf-dist/tex/generic/pgf/math/pgfmath.code.tex
INPUT /usr/share/texmf-dist/tex/generic/pgf/math/pgfmathcalc.code.tex
INPUT /usr/share/texmf-dist/tex/generic/pgf/math/pgfmathutil.code.tex
INPUT /usr/share/texmf-dist/tex/generic/pgf/math/pgfmathparser.code.tex
INPUT /usr/share/texmf-dist/tex/generic/pgf/math/pgfmathfunctions.code.tex
INPUT /usr/share/texmf-dist/tex/generic/pgf/math/pgfmathfunctions.basic.code.tex
INPUT /usr/share/texmf-dist/tex/generic/pgf/math/pgfmathfunctions.trigonometric.code.tex
INPUT /usr/share/texmf-dist/tex/generic/pgf/math/pgfmathfunctions.random.code.tex
INPUT /usr/share/texmf-dist/tex/generic/pgf/math/pgfmathfunctions.comparison.code.tex
INPUT /usr/share/texmf-dist/tex/generic/pgf/math/pgfmathfunctions.base.code.tex
INPUT /usr/share/texmf-dist/tex/generic/pgf/math/pgfmathfunctions.round.code.tex
INPUT /usr/share/texmf-dist/tex/generic/pgf/math/pgfmathfunctions.misc.code.tex
INPUT /usr/share/texmf-dist/tex/generic/pgf/math/pgfmathfunctions.integerarithmetics.code.tex
INPUT /usr/share/texmf-dist/tex/generic/pgf/math/pgfmathfloat.code.tex
INPUT /usr/share/texmf-dist/tex/generic/pgf/math/pgfint.code.tex
INPUT /usr/share/texmf-dist/tex/generic/pgf/basiclayer/pgfcorepoints.code.tex
INPUT /usr/share/texmf-dist/tex/generic/pgf/basiclayer/pgfcorepathconstruct.code.tex
INPUT /usr/share/texmf-dist/tex/generic/pgf/basiclayer/pgfcorepathusage.code.tex
INPUT /usr/share/texmf-dist/tex/generic/pgf/basiclayer/pgfcorescopes.code.tex
INPUT /usr/share/texmf-dist/tex/generic/pgf/basiclayer/pgfcoregraphicstate.code.tex
INPUT /usr/share/texmf-dist/tex/generic/pgf/basiclayer/pgfcoretransformations.code.tex
INPUT /usr/share/texmf-dist/tex/generic/pgf/basiclayer/pgfcorequick.code.tex
INPUT /usr/share/texmf-dist/tex/generic/pgf/basiclayer/pgfcoreobjects.code.tex
INPUT /usr/share/texmf-dist/tex/generic/pgf/basiclayer/pgfcorepathprocessing.code.tex
INPUT /usr/share/texmf-dist/tex/generic/pgf/basiclayer/pgfcorearrows.code.tex
INPUT /usr/share/texmf-dist/tex/generic/pgf/basiclayer/pgfcoreshade.code.tex
INPUT /usr/share/texmf-dist/tex/generic/pgf/basiclayer/pgfcoreimage.code.tex
INPUT /usr/share/texmf-dist/tex/generic/pgf/basiclayer/pgfcoreexternal.code.tex
INPUT /usr/share/texmf-dist/tex/generic/pgf/basiclayer/pgfcorelayers.code.tex
INPUT /usr/share/texmf-dist/tex/generic/pgf/basiclayer/pgfcoretransparency.code.tex
INPUT /usr/share/texmf-dist/tex/generic/pgf/basiclayer/pgfcorepatterns.code.tex
INPUT /usr/share/texmf-dist/tex/generic/pgf/basiclayer/pgfcorerdf.code.tex
INPUT /usr/share/texmf-dist/tex/generic/pgf/modules/pgfmoduleshapes.code.tex
INPUT /usr/share/texmf-dist/tex/generic/pgf/modules/pgfmoduleplot.code.tex
INPUT /usr/share/texmf-dist/tex/latex/pgf/compatibility/pgfcomp-version-0-65.sty
INPUT /usr/share/texmf-dist/tex/latex/pgf/compatibility/pgfcomp-version-0-65.sty
INPUT /usr/share/texmf-dist/tex/latex/pgf/compatibility/pgfcomp-version-0-65.sty
INPUT /usr/share/texmf-dist/tex/latex/pgf/compatibility/pgfcomp-version-1-18.sty
INPUT /usr/share/texmf-dist/tex/latex/pgf/compatibility/pgfcomp-version-1-18.sty
INPUT /usr/share/texmf-dist/tex/latex/pgf/compatibility/pgfcomp-version-1-18.sty
INPUT /usr/share/texmf-dist/tex/latex/pgf/utilities/pgffor.sty
INPUT /usr/share/texmf-dist/tex/latex/pgf/utilities/pgffor.sty
INPUT /usr/share/texmf-dist/tex/latex/pgf/utilities/pgffor.sty
INPUT /usr/share/texmf-dist/tex/latex/pgf/utilities/pgfkeys.sty
INPUT /usr/share/texmf-dist/tex/latex/pgf/utilities/pgfkeys.sty
INPUT /usr/share/texmf-dist/tex/latex/pgf/utilities/pgfkeys.sty
INPUT /usr/share/texmf-dist/tex/generic/pgf/utilities/pgfkeys.code.tex
INPUT /usr/share/texmf-dist/tex/generic/pgf/utilities/pgfkeys.code.tex
INPUT /usr/share/texmf-dist/tex/latex/pgf/math/pgfmath.sty
INPUT /usr/share/texmf-dist/tex/latex/pgf/math/pgfmath.sty
INPUT /usr/share/texmf-dist/tex/latex/pgf/math/pgfmath.sty
INPUT /usr/share/texmf-dist/tex/generic/pgf/math/pgfmath.code.tex
INPUT /usr/share/texmf-dist/tex/generic/pgf/math/pgfmath.code.tex
INPUT /usr/share/texmf-dist/tex/generic/pgf/utilities/pgffor.code.tex
INPUT /usr/share/texmf-dist/tex/generic/pgf/utilities/pgffor.code.tex
INPUT /usr/share/texmf-dist/tex/generic/pgf/math/pgfmath.code.tex
INPUT /usr/share/texmf-dist/tex/generic/pgf/frontendlayer/tikz/tikz.code.tex
INPUT /usr/share/texmf-dist/tex/generic/pgf/frontendlayer/tikz/tikz.code.tex
INPUT /usr/share/texmf-dist/tex/generic/pgf/libraries/pgflibraryplothandlers.code.tex
INPUT /usr/share/texmf-dist/tex/generic/pgf/libraries/pgflibraryplothandlers.code.tex
INPUT /usr/share/texmf-dist/tex/generic/pgf/modules/pgfmodulematrix.code.tex
INPUT /usr/share/texmf-dist/tex/generic/pgf/frontendlayer/tikz/libraries/tikzlibrarytopaths.code.tex
INPUT /usr/share/texmf-dist/tex/generic/pgf/frontendlayer/tikz/libraries/tikzlibrarytopaths.code.tex
INPUT /usr/share/texmf-dist/tex/generic/pgfplots/pgfplots.code.tex
INPUT /usr/share/texmf-dist/tex/generic/pgfplots/pgfplotscore.code.tex
INPUT /usr/share/texmf-dist/tex/generic/pgfplots/lua/pgfplots.lua
INPUT /usr/share/texmf-dist/tex/generic/pgfplots/lua/pgfplots/binary.lua
INPUT /usr/share/texmf-dist/tex/generic/pgfplots/lua/pgfplots/pgfplotsutil.lua
INPUT /usr/share/texmf-dist/tex/generic/pgf/libraries/luamath/pgf/luamath/parser.lua
INPUT /usr/share/texmf-dist/tex/generic/pgf/libraries/luamath/pgf/luamath/functions.lua
INPUT /usr/share/texmf-dist/tex/generic/pgfplots/lua/pgfplots/plothandler.lua
INPUT /usr/share/texmf-dist/tex/generic/pgfplots/lua/pgfplots/meshplothandler.lua
INPUT /usr/share/texmf-dist/tex/generic/pgfplots/lua/pgfplots/colormap.lua
INPUT /usr/share/texmf-dist/tex/generic/pgfplots/lua/pgfplots/streamer.lua
INPUT /usr/share/texmf-dist/tex/generic/pgfplots/lua/pgfplots/pgfplotstexio.lua
INPUT /usr/share/texmf-dist/tex/generic/pgfplots/sys/pgfplotssysgeneric.code.tex
INPUT /usr/share/texmf-dist/tex/generic/pgfplots/libs/pgfplotslibrary.code.tex
INPUT /usr/share/texmf-dist/tex/generic/pgfplots/oldpgfcompatib/pgfplotsoldpgfsupp_loader.code.tex
INPUT /usr/share/texmf-dist/tex/generic/pgf/libraries/pgflibraryfpu.code.tex
INPUT /usr/share/texmf-dist/tex/generic/pgf/libraries/pgflibraryfpu.code.tex
INPUT /usr/share/texmf-dist/tex/generic/pgf/libraries/pgflibraryfpu.code.tex
INPUT /usr/share/texmf-dist/tex/generic/pgf/libraries/luamath/pgflibraryluamath.code.tex
INPUT /usr/share/texmf-dist/tex/generic/pgf/libraries/luamath/pgflibraryluamath.code.tex
INPUT /usr/share/texmf-dist/tex/generic/pgf/libraries/luamath/pgflibraryluamath.code.tex
INPUT /usr/share/texmf-dist/tex/generic/pgfplots/util/pgfplotsutil.code.tex
INPUT /usr/share/texmf-dist/tex/generic/pgfplots/liststructure/pgfplotsliststructure.code.tex
INPUT /usr/share/texmf-dist/tex/generic/pgfplots/liststructure/pgfplotsliststructureext.code.tex
INPUT /usr/share/texmf-dist/tex/generic/pgfplots/liststructure/pgfplotsarray.code.tex
INPUT /usr/share/texmf-dist/tex/generic/pgfplots/liststructure/pgfplotsmatrix.code.tex
INPUT /usr/share/texmf-dist/tex/generic/pgfplots/numtable/pgfplotstableshared.code.tex
INPUT /usr/share/texmf-dist/tex/generic/pgfplots/liststructure/pgfplotsdeque.code.tex
INPUT /usr/share/texmf-dist/tex/generic/pgfplots/util/pgfplotsbinary.code.tex
INPUT /usr/share/texmf-dist/tex/generic/pgfplots/util/pgfplotsbinary.data.code.tex
INPUT /usr/share/texmf-dist/tex/generic/pgfplots/util/pgfplotsutil.verb.code.tex
INPUT /usr/share/texmf-dist/tex/generic/pgfplots/libs/pgflibrarypgfplots.surfshading.code.tex
INPUT /usr/share/texmf-dist/tex/generic/pgfplots/sys/pgflibrarypgfplots.surfshading.pgfsys-luatex.def
INPUT /usr/share/texmf-dist/tex/generic/pgfplots/sys/pgflibrarypgfplots.surfshading.pgfsys-luatex.def
INPUT /usr/share/texmf-dist/tex/generic/pgfplots/util/pgfplotscolormap.code.tex
INPUT /usr/share/texmf-dist/tex/generic/pgfplots/util/pgfplotscolor.code.tex
INPUT /usr/share/texmf-dist/tex/generic/pgfplots/pgfplotsstackedplots.code.tex
INPUT /usr/share/texmf-dist/tex/generic/pgfplots/pgfplotsplothandlers.code.tex
INPUT /usr/share/texmf-dist/tex/generic/pgfplots/pgfplotsmeshplothandler.code.tex
INPUT /usr/share/texmf-dist/tex/generic/pgfplots/pgfplotsmeshplotimage.code.tex
INPUT /usr/share/texmf-dist/tex/generic/pgfplots/pgfplots.scaling.code.tex
INPUT /usr/share/texmf-dist/tex/generic/pgfplots/pgfplotscoordprocessing.code.tex
INPUT /usr/share/texmf-dist/tex/generic/pgfplots/pgfplots.errorbars.code.tex
INPUT /usr/share/texmf-dist/tex/generic/pgfplots/pgfplots.markers.code.tex
INPUT /usr/share/texmf-dist/tex/generic/pgfplots/pgfplotsticks.code.tex
INPUT /usr/share/texmf-dist/tex/generic/pgfplots/pgfplots.paths.code.tex
INPUT /usr/share/texmf-dist/tex/generic/pgf/frontendlayer/tikz/libraries/tikzlibrarydecorations.code.tex
INPUT /usr/share/texmf-dist/tex/generic/pgf/frontendlayer/tikz/libraries/tikzlibrarydecorations.code.tex
INPUT /usr/share/texmf-dist/tex/generic/pgf/modules/pgfmoduledecorations.code.tex
INPUT /usr/share/texmf-dist/tex/generic/pgf/frontendlayer/tikz/libraries/tikzlibrarydecorations.pathmorphing.code.tex
INPUT /usr/share/texmf-dist/tex/generic/pgf/frontendlayer/tikz/libraries/tikzlibrarydecorations.pathmorphing.code.tex
INPUT /usr/share/texmf-dist/tex/generic/pgf/libraries/decorations/pgflibrarydecorations.pathmorphing.code.tex
INPUT /usr/share/texmf-dist/tex/generic/pgf/libraries/decorations/pgflibrarydecorations.pathmorphing.code.tex
INPUT /usr/share/texmf-dist/tex/generic/pgf/frontendlayer/tikz/libraries/tikzlibrarydecorations.pathreplacing.code.tex
INPUT /usr/share/texmf-dist/tex/generic/pgf/frontendlayer/tikz/libraries/tikzlibrarydecorations.pathreplacing.code.tex
INPUT /usr/share/texmf-dist/tex/generic/pgf/libraries/decorations/pgflibrarydecorations.pathreplacing.code.tex
INPUT /usr/share/texmf-dist/tex/generic/pgf/libraries/decorations/pgflibrarydecorations.pathreplacing.code.tex
INPUT /usr/share/texmf-dist/tex/generic/pgfplots/libs/tikzlibrarypgfplots.contourlua.code.tex
INPUT /usr/share/texmf-dist/tex/generic/pgfplots/libs/tikzlibrarypgfplots.contourlua.code.tex
INPUT /usr/share/texmf-dist/tex/generic/pgfplots/lua/prepcontour.lua
INPUT /usr/share/texmf-dist/tex/generic/pgf/frontendlayer/tikz/libraries/tikzlibraryplotmarks.code.tex
INPUT /usr/share/texmf-dist/tex/generic/pgf/frontendlayer/tikz/libraries/tikzlibraryplotmarks.code.tex
INPUT /usr/share/texmf-dist/tex/generic/pgf/libraries/pgflibraryplotmarks.code.tex
INPUT /usr/share/texmf-dist/tex/generic/pgf/libraries/pgflibraryplotmarks.code.tex
INPUT /usr/share/texmf-dist/tex/generic/pgfplots/libs/tikzlibrarypgfplots.groupplots.code.tex
INPUT /usr/share/texmf-dist/tex/generic/pgfplots/libs/tikzlibrarypgfplots.groupplots.code.tex
INPUT /usr/share/texmf-dist/tex/generic/pgf/frontendlayer/tikz/libraries/tikzlibrarycalc.code.tex
INPUT /usr/share/texmf-dist/tex/generic/pgf/frontendlayer/tikz/libraries/tikzlibrarycalc.code.tex
INPUT /usr/share/texmf-dist/tex/generic/pgfplots/libs/tikzlibrarypgfplots.dateplot.code.tex
INPUT /usr/share/texmf-dist/tex/generic/pgfplots/libs/tikzlibrarypgfplots.dateplot.code.tex
INPUT /usr/share/texmf-dist/tex/latex/pgf/utilities/pgfcalendar.sty
INPUT /usr/share/texmf-dist/tex/latex/pgf/utilities/pgfcalendar.sty
INPUT /usr/share/texmf-dist/tex/latex/pgf/utilities/pgfcalendar.sty
INPUT /usr/share/texmf-dist/tex/generic/pgf/utilities/pgfcalendar.code.tex
INPUT /usr/share/texmf-dist/tex/generic/pgf/utilities/pgfcalendar.code.tex
INPUT /usr/share/texmf-dist/tex/generic/pgf/math/pgfint.code.tex
INPUT /usr/share/texmf-dist/tex/generic/pgf/frontendlayer/tikz/libraries/tikzlibrarypatterns.code.tex
INPUT /usr/share/texmf-dist/tex/generic/pgf/frontendlayer/tikz/libraries/tikzlibrarypatterns.code.tex
INPUT /usr/share/texmf-dist/tex/generic/pgf/libraries/pgflibrarypatterns.code.tex
INPUT /usr/share/texmf-dist/tex/generic/pgf/libraries/pgflibrarypatterns.code.tex
INPUT /usr/share/texmf-dist/tex/generic/pgf/frontendlayer/tikz/libraries/tikzlibraryshapes.arrows.code.tex
INPUT /usr/share/texmf-dist/tex/generic/pgf/frontendlayer/tikz/libraries/tikzlibraryshapes.arrows.code.tex
INPUT /usr/share/texmf-dist/tex/generic/pgf/libraries/shapes/pgflibraryshapes.arrows.code.tex
INPUT /usr/share/texmf-dist/tex/generic/pgf/libraries/shapes/pgflibraryshapes.arrows.code.tex
INPUT /home/juan/texmf/tex/latex/articlepreamble-spanish/articlepreamble-spanish.sty
INPUT /home/juan/texmf/tex/latex/articlepreamble-spanish/articlepreamble-spanish.sty
INPUT /home/juan/texmf/tex/latex/articlepreamble-spanish/articlepreamble-spanish.sty
INPUT /usr/share/texmf-dist/tex/latex/etoolbox/etoolbox.sty
INPUT /usr/share/texmf-dist/tex/latex/etoolbox/etoolbox.sty
INPUT /usr/share/texmf-dist/tex/latex/etoolbox/etoolbox.sty
INPUT /usr/share/texmf-dist/tex/generic/iftex/ifluatex.sty
INPUT /usr/share/texmf-dist/tex/generic/iftex/ifluatex.sty
INPUT /usr/share/texmf-dist/tex/generic/iftex/ifluatex.sty
INPUT /usr/share/texmf-dist/tex/generic/iftex/iftex.sty
INPUT /usr/share/texmf-dist/tex/generic/iftex/iftex.sty
INPUT /usr/share/texmf-dist/tex/generic/iftex/iftex.sty
INPUT /usr/share/texmf-dist/tex/latex/xpatch/xpatch.sty
INPUT /usr/share/texmf-dist/tex/latex/xpatch/xpatch.sty
INPUT /usr/share/texmf-dist/tex/latex/xpatch/xpatch.sty
INPUT /usr/share/texmf-dist/tex/latex/l3kernel/expl3.sty
INPUT /usr/share/texmf-dist/tex/latex/l3kernel/expl3.sty
INPUT /usr/share/texmf-dist/tex/latex/l3kernel/expl3.sty
INPUT /usr/share/texmf-dist/tex/latex/l3backend/l3backend-luatex.def
INPUT /usr/share/texmf-dist/tex/latex/l3backend/l3backend-luatex.def
INPUT /usr/share/texmf-dist/tex/latex/l3backend/l3backend-luatex.def
INPUT /usr/share/texmf-dist/tex/latex/l3packages/xparse/xparse.sty
INPUT /usr/share/texmf-dist/tex/latex/l3packages/xparse/xparse.sty
INPUT /usr/share/texmf-dist/tex/latex/l3packages/xparse/xparse.sty
INPUT /usr/share/texmf-dist/tex/latex/environ/environ.sty
INPUT /usr/share/texmf-dist/tex/latex/environ/environ.sty
INPUT /usr/share/texmf-dist/tex/latex/environ/environ.sty
INPUT /usr/share/texmf-dist/tex/latex/trimspaces/trimspaces.sty
INPUT /usr/share/texmf-dist/tex/latex/trimspaces/trimspaces.sty
INPUT /usr/share/texmf-dist/tex/latex/trimspaces/trimspaces.sty
INPUT /usr/share/texmf-dist/tex/latex/fontspec/fontspec.sty
INPUT /usr/share/texmf-dist/tex/latex/fontspec/fontspec.sty
INPUT /usr/share/texmf-dist/tex/latex/fontspec/fontspec.sty
INPUT /usr/share/texmf-dist/tex/latex/fontspec/fontspec.lua
INPUT /usr/share/texmf-dist/tex/latex/fontspec/fontspec-luatex.sty
INPUT /usr/share/texmf-dist/tex/latex/fontspec/fontspec-luatex.sty
INPUT /usr/share/texmf-dist/tex/latex/fontspec/fontspec-luatex.sty
INPUT /usr/share/texmf-dist/tex/latex/base/fontenc.sty
INPUT /usr/share/texmf-dist/tex/latex/base/fontenc.sty
INPUT /usr/share/texmf-dist/tex/latex/base/fontenc.sty
INPUT /usr/share/texmf-dist/tex/latex/fontspec/fontspec.cfg
INPUT /usr/share/texmf-dist/tex/latex/fontspec/fontspec.cfg
INPUT /home/juan/.texlive/texmf-var/luatex-cache/generic/fonts/otl/lmroman10-bold.luc
INPUT /usr/share/texmf-dist/tex/latex/polyglossia/polyglossia.sty
INPUT /usr/share/texmf-dist/tex/latex/polyglossia/polyglossia.sty
INPUT /usr/share/texmf-dist/tex/latex/polyglossia/polyglossia.sty
INPUT /usr/share/texmf-dist/tex/latex/makecmds/makecmds.sty
INPUT /usr/share/texmf-dist/tex/latex/makecmds/makecmds.sty
INPUT /usr/share/texmf-dist/tex/latex/makecmds/makecmds.sty
INPUT /usr/share/texmf-dist/tex/latex/xkeyval/xkeyval.sty
INPUT /usr/share/texmf-dist/tex/latex/xkeyval/xkeyval.sty
INPUT /usr/share/texmf-dist/tex/latex/xkeyval/xkeyval.sty
INPUT /usr/share/texmf-dist/tex/generic/xkeyval/xkeyval.tex
INPUT /usr/share/texmf-dist/tex/generic/xkeyval/xkvutils.tex
INPUT /usr/share/texmf-dist/tex/latex/l3packages/l3keys2e/l3keys2e.sty
INPUT /usr/share/texmf-dist/tex/latex/l3packages/l3keys2e/l3keys2e.sty
INPUT /usr/share/texmf-dist/tex/latex/l3packages/l3keys2e/l3keys2e.sty
INPUT /usr/share/texmf-dist/tex/luatex/luatexbase/luatexbase.sty
INPUT /usr/share/texmf-dist/tex/luatex/luatexbase/luatexbase.sty
INPUT /usr/share/texmf-dist/tex/luatex/luatexbase/luatexbase.sty
INPUT /usr/share/texmf-dist/tex/luatex/ctablestack/ctablestack.sty
INPUT /usr/share/texmf-dist/tex/luatex/ctablestack/ctablestack.sty
INPUT /usr/share/texmf-dist/tex/luatex/ctablestack/ctablestack.sty
INPUT /usr/share/texmf-dist/tex/latex/polyglossia/polyglossia.lua
INPUT /usr/share/texmf-dist/tex/generic/config/language.dat.lua
INPUT /usr/share/texmf-dist/tex/latex/polyglossia/gloss-latex.ldf
INPUT /usr/share/texmf-dist/tex/latex/polyglossia/gloss-latex.ldf
INPUT /usr/share/texmf-dist/tex/latex/polyglossia/gloss-spanish.ldf
INPUT /usr/share/texmf-dist/tex/latex/polyglossia/gloss-spanish.ldf
INPUT /usr/share/texmf-dist/tex/generic/hyph-utf8/patterns/txt/hyph-es.pat.txt
INPUT /usr/share/texmf-dist/tex/latex/import/import.sty
INPUT /usr/share/texmf-dist/tex/latex/import/import.sty
INPUT /usr/share/texmf-dist/tex/latex/import/import.sty
INPUT /usr/share/texmf-dist/tex/latex/xifthen/xifthen.sty
INPUT /usr/share/texmf-dist/tex/latex/xifthen/xifthen.sty
INPUT /usr/share/texmf-dist/tex/latex/xifthen/xifthen.sty
INPUT /usr/share/texmf-dist/tex/latex/tools/calc.sty
INPUT /usr/share/texmf-dist/tex/latex/tools/calc.sty
INPUT /usr/share/texmf-dist/tex/latex/tools/calc.sty
INPUT /usr/share/texmf-dist/tex/latex/base/ifthen.sty
INPUT /usr/share/texmf-dist/tex/latex/base/ifthen.sty
INPUT /usr/share/texmf-dist/tex/latex/base/ifthen.sty
INPUT /usr/share/texmf-dist/tex/latex/ifmtarg/ifmtarg.sty
INPUT /usr/share/texmf-dist/tex/latex/ifmtarg/ifmtarg.sty
INPUT /usr/share/texmf-dist/tex/latex/ifmtarg/ifmtarg.sty
INPUT /usr/share/texmf-dist/tex/latex/pdfpages/pdfpages.sty
INPUT /usr/share/texmf-dist/tex/latex/pdfpages/pdfpages.sty
INPUT /usr/share/texmf-dist/tex/latex/pdfpages/pdfpages.sty
INPUT /usr/share/texmf-dist/tex/latex/eso-pic/eso-pic.sty
INPUT /usr/share/texmf-dist/tex/latex/eso-pic/eso-pic.sty
INPUT /usr/share/texmf-dist/tex/latex/eso-pic/eso-pic.sty
INPUT /usr/share/texmf-dist/tex/latex/pdfpages/ppluatex.def
INPUT /usr/share/texmf-dist/tex/latex/pdfpages/ppluatex.def
INPUT /usr/share/texmf-dist/tex/latex/tcolorbox/tcolorbox.sty
INPUT /usr/share/texmf-dist/tex/latex/tcolorbox/tcolorbox.sty
INPUT /usr/share/texmf-dist/tex/latex/tcolorbox/tcolorbox.sty
INPUT /usr/share/texmf-dist/tex/latex/tools/verbatim.sty
INPUT /usr/share/texmf-dist/tex/latex/tools/verbatim.sty
INPUT /usr/share/texmf-dist/tex/latex/tools/verbatim.sty
INPUT /usr/share/texmf-dist/tex/latex/tcolorbox/tcbbreakable.code.tex
INPUT /usr/share/texmf-dist/tex/generic/oberdiek/pdfcol.sty
INPUT /usr/share/texmf-dist/tex/generic/oberdiek/pdfcol.sty
INPUT /usr/share/texmf-dist/tex/generic/oberdiek/pdfcol.sty
INPUT /usr/share/texmf-dist/tex/generic/ltxcmds/ltxcmds.sty
INPUT /usr/share/texmf-dist/tex/generic/ltxcmds/ltxcmds.sty
INPUT /usr/share/texmf-dist/tex/generic/ltxcmds/ltxcmds.sty
INPUT /usr/share/texmf-dist/tex/generic/infwarerr/infwarerr.sty
INPUT /usr/share/texmf-dist/tex/generic/infwarerr/infwarerr.sty
INPUT /usr/share/texmf-dist/tex/generic/infwarerr/infwarerr.sty
INPUT /usr/share/texmf-dist/tex/latex/bbding/bbding.sty
INPUT /usr/share/texmf-dist/tex/latex/bbding/bbding.sty
INPUT /usr/share/texmf-dist/tex/latex/bbding/bbding.sty
INPUT /usr/share/texmf-dist/tex/latex/sttools/stfloats.sty
INPUT /usr/share/texmf-dist/tex/latex/sttools/stfloats.sty
INPUT /usr/share/texmf-dist/tex/latex/sttools/stfloats.sty
INPUT /usr/share/texmf-dist/tex/latex/caption/caption.sty
INPUT /usr/share/texmf-dist/tex/latex/caption/caption.sty
INPUT /usr/share/texmf-dist/tex/latex/caption/caption.sty
INPUT /usr/share/texmf-dist/tex/latex/caption/caption3.sty
INPUT /usr/share/texmf-dist/tex/latex/caption/caption3.sty
INPUT /usr/share/texmf-dist/tex/latex/caption/caption3.sty
INPUT /usr/share/texmf-dist/tex/latex/caption/caption-koma.sto
INPUT /usr/share/texmf-dist/tex/latex/caption/caption-koma.sto
INPUT /usr/share/texmf-dist/tex/latex/caption/subcaption.sty
INPUT /usr/share/texmf-dist/tex/latex/caption/subcaption.sty
INPUT /usr/share/texmf-dist/tex/latex/caption/subcaption.sty
INPUT /usr/share/texmf-dist/tex/latex/multirow/multirow.sty
INPUT /usr/share/texmf-dist/tex/latex/multirow/multirow.sty
INPUT /usr/share/texmf-dist/tex/latex/multirow/multirow.sty
INPUT /usr/share/texmf-dist/tex/latex/tools/tabularx.sty
INPUT /usr/share/texmf-dist/tex/latex/tools/tabularx.sty
INPUT /usr/share/texmf-dist/tex/latex/tools/tabularx.sty
INPUT /usr/share/texmf-dist/tex/latex/tools/array.sty
INPUT /usr/share/texmf-dist/tex/latex/tools/array.sty
INPUT /usr/share/texmf-dist/tex/latex/tools/array.sty
INPUT /usr/share/texmf-dist/tex/latex/amsmath/amsmath.sty
INPUT /usr/share/texmf-dist/tex/latex/amsmath/amsmath.sty
INPUT /usr/share/texmf-dist/tex/latex/amsmath/amsmath.sty
INPUT /usr/share/texmf-dist/tex/latex/amsmath/amstext.sty
INPUT /usr/share/texmf-dist/tex/latex/amsmath/amstext.sty
INPUT /usr/share/texmf-dist/tex/latex/amsmath/amstext.sty
INPUT /usr/share/texmf-dist/tex/latex/amsmath/amsgen.sty
INPUT /usr/share/texmf-dist/tex/latex/amsmath/amsgen.sty
INPUT /usr/share/texmf-dist/tex/latex/amsmath/amsgen.sty
INPUT /usr/share/texmf-dist/tex/latex/amsmath/amsbsy.sty
INPUT /usr/share/texmf-dist/tex/latex/amsmath/amsbsy.sty
INPUT /usr/share/texmf-dist/tex/latex/amsmath/amsbsy.sty
INPUT /usr/share/texmf-dist/tex/latex/amsmath/amsopn.sty
INPUT /usr/share/texmf-dist/tex/latex/amsmath/amsopn.sty
INPUT /usr/share/texmf-dist/tex/latex/amsmath/amsopn.sty
INPUT /usr/share/texmf-dist/tex/xelatex/xltxtra/xltxtra.sty
INPUT /usr/share/texmf-dist/tex/xelatex/xltxtra/xltxtra.sty
INPUT /usr/share/texmf-dist/tex/xelatex/xltxtra/xltxtra.sty
INPUT /usr/share/texmf-dist/tex/latex/newtx/TeXGyreTermesX.fontspec
INPUT /home/juan/.texlive/texmf-var/luatex-cache/generic/fonts/hb/:usr:share:texmf-dist:fonts:opentype:public:newtx:TeXGyreTermesX-Regular.otf:1
INPUT /home/juan/.texlive/texmf-var/luatex-cache/generic/fonts/hb/:usr:share:texmf-dist:fonts:opentype:public:newtx:TeXGyreTermesX-Bold.otf:1
INPUT /home/juan/.texlive/texmf-var/luatex-cache/generic/fonts/hb/:usr:share:texmf-dist:fonts:opentype:public:newtx:TeXGyreTermesX-Italic.otf:1
INPUT /home/juan/.texlive/texmf-var/luatex-cache/generic/fonts/hb/:usr:share:texmf-dist:fonts:opentype:public:newtx:TeXGyreTermesX-Slanted.otf:1
INPUT /home/juan/.texlive/texmf-var/luatex-cache/generic/fonts/hb/:usr:share:texmf-dist:fonts:opentype:public:newtx:TeXGyreTermesX-BoldItalic.otf:1
INPUT /home/juan/.texlive/texmf-var/luatex-cache/generic/fonts/hb/:usr:share:texmf-dist:fonts:opentype:public:newtx:TeXGyreTermesX-BoldSlanted.otf:1
INPUT /home/juan/.texlive/texmf-var/luatex-cache/generic/fonts/hb/:usr:share:texmf-dist:fonts:opentype:public:libertinus-fonts:LibertinusSans-Regular.otf:1
INPUT /home/juan/.texlive/texmf-var/luatex-cache/generic/fonts/hb/:usr:share:texmf-dist:fonts:opentype:public:libertinus-fonts:LibertinusSans-Bold.otf:1
INPUT /home/juan/.texlive/texmf-var/luatex-cache/generic/fonts/hb/:usr:share:texmf-dist:fonts:opentype:public:libertinus-fonts:LibertinusSans-Italic.otf:1
INPUT /usr/share/texmf-dist/tex/latex/inconsolata/inconsolata.fontspec
INPUT /home/juan/.texlive/texmf-var/luatex-cache/generic/fonts/hb/:usr:share:texmf-dist:fonts:opentype:public:inconsolata:Inconsolatazi4-Regular.otf:1
INPUT /home/juan/.texlive/texmf-var/luatex-cache/generic/fonts/hb/:usr:share:texmf-dist:fonts:opentype:public:inconsolata:Inconsolatazi4-Bold.otf:1
INPUT /var/lib/texmf/tex/latex/mtpro2/mtpro2.sty
INPUT /var/lib/texmf/tex/latex/mtpro2/mtpro2.sty
INPUT /var/lib/texmf/tex/latex/mtpro2/mtpro2.sty
INPUT /var/lib/texmf/fonts/tfm/pctex/mtpro2/mt2exa.tfm
INPUT /var/lib/texmf/fonts/tfm/pctex/mtpro2/mt2xl.tfm
INPUT /var/lib/texmf/fonts/tfm/pctex/mtpro2/mt2exe.tfm
INPUT /var/lib/texmf/fonts/tfm/pctex/mtpro2/mt2xxxl.tfm
INPUT /var/lib/texmf/fonts/tfm/pctex/mtpro2/mt2exf.tfm
INPUT /var/lib/texmf/fonts/tfm/pctex/mtpro2/mt2exg.tfm
INPUT /usr/share/texmf-dist/tex/latex/koma-script/scrlayer-scrpage.sty
INPUT /usr/share/texmf-dist/tex/latex/koma-script/scrlayer-scrpage.sty
INPUT /usr/share/texmf-dist/tex/latex/koma-script/scrlayer-scrpage.sty
INPUT /usr/share/texmf-dist/tex/latex/koma-script/scrlayer.sty
INPUT /usr/share/texmf-dist/tex/latex/koma-script/scrlayer.sty
INPUT /usr/share/texmf-dist/tex/latex/koma-script/scrlayer.sty
INPUT /usr/share/texmf-dist/tex/latex/csquotes/csquotes.sty
INPUT /usr/share/texmf-dist/tex/latex/csquotes/csquotes.sty
INPUT /usr/share/texmf-dist/tex/latex/csquotes/csquotes.sty
INPUT /usr/share/texmf-dist/tex/latex/csquotes/csquotes.def
INPUT /usr/share/texmf-dist/tex/latex/csquotes/csquotes.def
INPUT /usr/share/texmf-dist/tex/latex/csquotes/csquotes.cfg
INPUT /usr/share/texmf-dist/tex/latex/csquotes/csquotes.cfg
INPUT /usr/share/texmf-dist/tex/latex/siunitx/siunitx.sty
INPUT /usr/share/texmf-dist/tex/latex/siunitx/siunitx.sty
INPUT /usr/share/texmf-dist/tex/latex/siunitx/siunitx.sty
INPUT /usr/share/texmf-dist/tex/latex/translations/translations.sty
INPUT /usr/share/texmf-dist/tex/latex/translations/translations.sty
INPUT /usr/share/texmf-dist/tex/latex/translations/translations.sty
INPUT /usr/share/texmf-dist/tex/generic/pdftexcmds/pdftexcmds.sty
INPUT /usr/share/texmf-dist/tex/generic/pdftexcmds/pdftexcmds.sty
INPUT /usr/share/texmf-dist/tex/generic/pdftexcmds/pdftexcmds.sty
INPUT /usr/share/texmf-dist/tex/generic/pdftexcmds/pdftexcmds.lua
INPUT /usr/share/texmf-dist/tex/latex/geometry/geometry.sty
INPUT /usr/share/texmf-dist/tex/latex/geometry/geometry.sty
INPUT /usr/share/texmf-dist/tex/latex/geometry/geometry.sty
INPUT /usr/share/texmf-dist/tex/generic/iftex/ifvtex.sty
INPUT /usr/share/texmf-dist/tex/generic/iftex/ifvtex.sty
INPUT /usr/share/texmf-dist/tex/generic/iftex/ifvtex.sty
INPUT /usr/share/texmf-dist/tex/latex/tools/afterpage.sty
INPUT /usr/share/texmf-dist/tex/latex/tools/afterpage.sty
INPUT /usr/share/texmf-dist/tex/latex/tools/afterpage.sty
INPUT /usr/share/texmf-dist/tex/latex/biblatex/biblatex.sty
INPUT /usr/share/texmf-dist/tex/latex/biblatex/biblatex.sty
INPUT /usr/share/texmf-dist/tex/latex/biblatex/biblatex.sty
INPUT /usr/share/texmf-dist/tex/latex/kvoptions/kvoptions.sty
INPUT /usr/share/texmf-dist/tex/latex/kvoptions/kvoptions.sty
INPUT /usr/share/texmf-dist/tex/latex/kvoptions/kvoptions.sty
INPUT /usr/share/texmf-dist/tex/generic/kvsetkeys/kvsetkeys.sty
INPUT /usr/share/texmf-dist/tex/generic/kvsetkeys/kvsetkeys.sty
INPUT /usr/share/texmf-dist/tex/generic/kvsetkeys/kvsetkeys.sty
INPUT /usr/share/texmf-dist/tex/latex/logreq/logreq.sty
INPUT /usr/share/texmf-dist/tex/latex/logreq/logreq.sty
INPUT /usr/share/texmf-dist/tex/latex/logreq/logreq.sty
INPUT /usr/share/texmf-dist/tex/latex/logreq/logreq.def
INPUT /usr/share/texmf-dist/tex/latex/logreq/logreq.def
INPUT /usr/share/texmf-dist/tex/latex/url/url.sty
INPUT /usr/share/texmf-dist/tex/latex/url/url.sty
INPUT /usr/share/texmf-dist/tex/latex/url/url.sty
INPUT /usr/share/texmf-dist/tex/latex/biblatex/blx-dm.def
INPUT /usr/share/texmf-dist/tex/latex/biblatex/blx-dm.def
INPUT /usr/share/texmf-dist/tex/latex/biblatex-phys/phys.dbx
INPUT /usr/share/texmf-dist/tex/latex/biblatex-phys/phys.dbx
INPUT /usr/share/texmf-dist/tex/latex/biblatex/blx-unicode.def
INPUT /usr/share/texmf-dist/tex/latex/biblatex/blx-unicode.def
INPUT /usr/share/texmf-dist/tex/generic/unicode-data/UnicodeData.txt
INPUT /usr/share/texmf-dist/tex/latex/biblatex/blx-compat.def
INPUT /usr/share/texmf-dist/tex/latex/biblatex/blx-compat.def
INPUT /usr/share/texmf-dist/tex/latex/biblatex/biblatex.def
INPUT /usr/share/texmf-dist/tex/latex/biblatex/biblatex.def
INPUT /usr/share/texmf-dist/tex/latex/biblatex-phys/phys.bbx
INPUT /usr/share/texmf-dist/tex/latex/biblatex-phys/phys.bbx
INPUT /usr/share/texmf-dist/tex/latex/biblatex/bbx/numeric-comp.bbx
INPUT /usr/share/texmf-dist/tex/latex/biblatex/bbx/numeric-comp.bbx
INPUT /usr/share/texmf-dist/tex/latex/biblatex/bbx/numeric.bbx
INPUT /usr/share/texmf-dist/tex/latex/biblatex/bbx/numeric.bbx
INPUT /usr/share/texmf-dist/tex/latex/biblatex/bbx/standard.bbx
INPUT /usr/share/texmf-dist/tex/latex/biblatex/bbx/standard.bbx
INPUT /usr/share/texmf-dist/tex/latex/biblatex/lbx/english.lbx
INPUT /usr/share/texmf-dist/tex/latex/biblatex-phys/phys.cbx
INPUT /usr/share/texmf-dist/tex/latex/biblatex-phys/phys.cbx
INPUT /usr/share/texmf-dist/tex/latex/biblatex/cbx/numeric-comp.cbx
INPUT /usr/share/texmf-dist/tex/latex/biblatex/cbx/numeric-comp.cbx
INPUT /usr/share/texmf-dist/tex/latex/biblatex/biblatex.cfg
INPUT /usr/share/texmf-dist/tex/latex/biblatex/biblatex.cfg
INPUT /usr/share/texmf-dist/tex/latex/hyperxmp/hyperxmp.sty
INPUT /usr/share/texmf-dist/tex/latex/hyperxmp/hyperxmp.sty
INPUT /usr/share/texmf-dist/tex/latex/hyperxmp/hyperxmp.sty
INPUT /usr/share/texmf-dist/tex/generic/pdfescape/pdfescape.sty
INPUT /usr/share/texmf-dist/tex/generic/pdfescape/pdfescape.sty
INPUT /usr/share/texmf-dist/tex/generic/pdfescape/pdfescape.sty
INPUT /usr/share/texmf-dist/tex/generic/stringenc/stringenc.sty
INPUT /usr/share/texmf-dist/tex/generic/stringenc/stringenc.sty
INPUT /usr/share/texmf-dist/tex/generic/stringenc/stringenc.sty
INPUT /usr/share/texmf-dist/tex/generic/intcalc/intcalc.sty
INPUT /usr/share/texmf-dist/tex/generic/intcalc/intcalc.sty
INPUT /usr/share/texmf-dist/tex/generic/intcalc/intcalc.sty
INPUT /usr/share/texmf-dist/tex/lualatex/luacode/luacode.sty
INPUT /usr/share/texmf-dist/tex/lualatex/luacode/luacode.sty
INPUT /usr/share/texmf-dist/tex/lualatex/luacode/luacode.sty
INPUT /usr/share/texmf-dist/tex/latex/oberdiek/ifdraft.sty
INPUT /usr/share/texmf-dist/tex/latex/oberdiek/ifdraft.sty
INPUT /usr/share/texmf-dist/tex/latex/oberdiek/ifdraft.sty
INPUT /usr/share/texmf-dist/tex/latex/hyperref/hyperref.sty
INPUT /usr/share/texmf-dist/tex/latex/hyperref/hyperref.sty
INPUT /usr/share/texmf-dist/tex/latex/hyperref/hyperref.sty
INPUT /usr/share/texmf-dist/tex/generic/kvdefinekeys/kvdefinekeys.sty
INPUT /usr/share/texmf-dist/tex/generic/kvdefinekeys/kvdefinekeys.sty
INPUT /usr/share/texmf-dist/tex/generic/kvdefinekeys/kvdefinekeys.sty
INPUT /usr/share/texmf-dist/tex/latex/hycolor/hycolor.sty
INPUT /usr/share/texmf-dist/tex/latex/hycolor/hycolor.sty
INPUT /usr/share/texmf-dist/tex/latex/hycolor/hycolor.sty
INPUT /usr/share/texmf-dist/tex/latex/letltxmacro/letltxmacro.sty
INPUT /usr/share/texmf-dist/tex/latex/letltxmacro/letltxmacro.sty
INPUT /usr/share/texmf-dist/tex/latex/letltxmacro/letltxmacro.sty
INPUT /usr/share/texmf-dist/tex/latex/auxhook/auxhook.sty
INPUT /usr/share/texmf-dist/tex/latex/auxhook/auxhook.sty
INPUT /usr/share/texmf-dist/tex/latex/auxhook/auxhook.sty
INPUT /usr/share/texmf-dist/tex/latex/hyperref/pd1enc.def
INPUT /usr/share/texmf-dist/tex/latex/hyperref/pd1enc.def
INPUT /usr/share/texmf-dist/tex/latex/hyperref/hyperref-langpatches.def
INPUT /usr/share/texmf-dist/tex/latex/hyperref/hyperref-langpatches.def
INPUT /usr/share/texmf-dist/tex/generic/etexcmds/etexcmds.sty
INPUT /usr/share/texmf-dist/tex/generic/etexcmds/etexcmds.sty
INPUT /usr/share/texmf-dist/tex/generic/etexcmds/etexcmds.sty
INPUT /usr/share/texmf-dist/tex/latex/hyperref/puenc.def
INPUT /usr/share/texmf-dist/tex/latex/hyperref/puenc.def
INPUT /usr/share/texmf-dist/tex/generic/bitset/bitset.sty
INPUT /usr/share/texmf-dist/tex/generic/bitset/bitset.sty
INPUT /usr/share/texmf-dist/tex/generic/bitset/bitset.sty
INPUT /usr/share/texmf-dist/tex/generic/bigintcalc/bigintcalc.sty
INPUT /usr/share/texmf-dist/tex/generic/bigintcalc/bigintcalc.sty
INPUT /usr/share/texmf-dist/tex/generic/bigintcalc/bigintcalc.sty
INPUT /usr/share/texmf-dist/tex/latex/base/atbegshi-ltx.sty
INPUT /usr/share/texmf-dist/tex/latex/base/atbegshi-ltx.sty
INPUT /usr/share/texmf-dist/tex/latex/base/atbegshi-ltx.sty
INPUT /usr/share/texmf-dist/tex/latex/hyperref/hluatex.def
INPUT /usr/share/texmf-dist/tex/latex/hyperref/hluatex.def
INPUT /usr/share/texmf-dist/tex/latex/base/atveryend-ltx.sty
INPUT /usr/share/texmf-dist/tex/latex/base/atveryend-ltx.sty
INPUT /usr/share/texmf-dist/tex/latex/base/atveryend-ltx.sty
INPUT /usr/share/texmf-dist/tex/latex/rerunfilecheck/rerunfilecheck.sty
INPUT /usr/share/texmf-dist/tex/latex/rerunfilecheck/rerunfilecheck.sty
INPUT /usr/share/texmf-dist/tex/latex/rerunfilecheck/rerunfilecheck.sty
INPUT /usr/share/texmf-dist/tex/generic/uniquecounter/uniquecounter.sty
INPUT /usr/share/texmf-dist/tex/generic/uniquecounter/uniquecounter.sty
INPUT /usr/share/texmf-dist/tex/generic/uniquecounter/uniquecounter.sty
INPUT /usr/share/texmf-dist/tex/latex/circuitikz/circuitikz.sty
INPUT /usr/share/texmf-dist/tex/latex/circuitikz/circuitikz.sty
INPUT /usr/share/texmf-dist/tex/latex/circuitikz/circuitikz.sty
INPUT /usr/share/texmf-dist/tex/generic/pgf/libraries/pgflibraryarrows.meta.code.tex
INPUT /usr/share/texmf-dist/tex/generic/pgf/libraries/pgflibraryarrows.meta.code.tex
INPUT /usr/share/texmf-dist/tex/generic/pgf/libraries/pgflibraryarrows.meta.code.tex
INPUT /usr/share/texmf-dist/tex/generic/pgf/frontendlayer/tikz/libraries/tikzlibrarybending.code.tex
INPUT /usr/share/texmf-dist/tex/generic/pgf/frontendlayer/tikz/libraries/tikzlibrarybending.code.tex
INPUT /usr/share/texmf-dist/tex/generic/pgf/modules/pgfmodulebending.code.tex
INPUT /usr/share/texmf-dist/tex/generic/pgf/modules/pgfmodulenonlineartransformations.code.tex
INPUT /usr/share/texmf-dist/tex/generic/pgf/libraries/pgflibrarycurvilinear.code.tex
INPUT /usr/share/texmf-dist/tex/generic/pgf/libraries/pgflibrarycurvilinear.code.tex
INPUT /usr/share/texmf-dist/tex/generic/pgf/frontendlayer/tikz/libraries/tikzlibraryfpu.code.tex
INPUT /usr/share/texmf-dist/tex/generic/pgf/frontendlayer/tikz/libraries/tikzlibraryfpu.code.tex
INPUT /usr/share/texmf-dist/tex/generic/circuitikz/pgfcirc.defines.tex
INPUT /usr/share/texmf-dist/tex/generic/circuitikz/pgfcircutils.tex
INPUT /usr/share/texmf-dist/tex/generic/circuitikz/pgfcircpath.tex
INPUT /usr/share/texmf-dist/tex/generic/circuitikz/pgfcircshapes.tex
INPUT /usr/share/texmf-dist/tex/generic/circuitikz/pgfcircmonopoles.tex
INPUT /usr/share/texmf-dist/tex/generic/circuitikz/pgfcircbipoles.tex
INPUT /usr/share/texmf-dist/tex/generic/circuitikz/pgfcirctripoles.tex
INPUT /usr/share/texmf-dist/tex/generic/circuitikz/pgfcircquadpoles.tex
INPUT /usr/share/texmf-dist/tex/generic/circuitikz/pgfcircmultipoles.tex
INPUT /usr/share/texmf-dist/tex/generic/circuitikz/pgfcirclabel.tex
INPUT /usr/share/texmf-dist/tex/generic/circuitikz/pgfcircvoltage.tex
INPUT /usr/share/texmf-dist/tex/generic/circuitikz/pgfcirccurrent.tex
INPUT /usr/share/texmf-dist/tex/generic/circuitikz/pgfcircflow.tex
INPUT ./main.aux
INPUT ./main.aux
OUTPUT main.aux
INPUT /usr/share/texmf-dist/tex/latex/base/ts1cmr.fd
INPUT /usr/share/texmf-dist/tex/latex/base/ts1cmr.fd
INPUT /usr/share/texmf-dist/tex/context/base/mkii/supp-pdf.mkii
INPUT /usr/share/texmf-dist/tex/context/base/mkii/supp-pdf.mkii
INPUT /usr/share/texmf-dist/tex/latex/epstopdf-pkg/epstopdf-base.sty
INPUT /usr/share/texmf-dist/tex/latex/epstopdf-pkg/epstopdf-base.sty
INPUT /usr/share/texmf-dist/tex/latex/epstopdf-pkg/epstopdf-base.sty
INPUT /usr/share/texmf-dist/tex/latex/latexconfig/epstopdf-sys.cfg
INPUT /usr/share/texmf-dist/tex/latex/latexconfig/epstopdf-sys.cfg
INPUT /usr/share/texmf-dist/tex/latex/pdflscape/pdflscape.sty
INPUT /usr/share/texmf-dist/tex/latex/pdflscape/pdflscape.sty
INPUT /usr/share/texmf-dist/tex/latex/pdflscape/pdflscape.sty
INPUT /usr/share/texmf-dist/tex/latex/graphics/lscape.sty
INPUT /usr/share/texmf-dist/tex/latex/graphics/lscape.sty
INPUT /usr/share/texmf-dist/tex/latex/graphics/lscape.sty
INPUT /usr/share/texmf-dist/tex/latex/translations/translations-basic-dictionary-spanish.trsl
INPUT /usr/share/texmf-dist/tex/latex/translations/translations-basic-dictionary-spanish.trsl
INPUT /usr/share/texmf-dist/tex/latex/biblatex/lbx/spanish.lbx
INPUT /usr/share/texmf-dist/tex/latex/biblatex/lbx/spanish.lbx
INPUT /usr/share/texmf-dist/tex/latex/biblatex/blx-case-expl3.sty
INPUT /usr/share/texmf-dist/tex/latex/biblatex/blx-case-expl3.sty
INPUT /usr/share/texmf-dist/tex/latex/biblatex/blx-case-expl3.sty
OUTPUT main.bcf
INPUT ./main.bbl
INPUT ./main.bbl
INPUT ./main.bbl
INPUT ./main.bbl
INPUT /usr/share/texmf-dist/tex/latex/hyperref/nameref.sty
INPUT /usr/share/texmf-dist/tex/latex/hyperref/nameref.sty
INPUT /usr/share/texmf-dist/tex/latex/hyperref/nameref.sty
INPUT /usr/share/texmf-dist/tex/latex/refcount/refcount.sty
INPUT /usr/share/texmf-dist/tex/latex/refcount/refcount.sty
INPUT /usr/share/texmf-dist/tex/latex/refcount/refcount.sty
INPUT /usr/share/texmf-dist/tex/generic/gettitlestring/gettitlestring.sty
INPUT /usr/share/texmf-dist/tex/generic/gettitlestring/gettitlestring.sty
INPUT /usr/share/texmf-dist/tex/generic/gettitlestring/gettitlestring.sty
INPUT ./main.out
INPUT ./main.out
INPUT ./main.out
INPUT ./main.out
INPUT ./main.out
OUTPUT main.out
OUTPUT main.pdf
INPUT /usr/share/texmf-dist/tex/latex/bookmark/bookmark.sty
INPUT /usr/share/texmf-dist/tex/latex/bookmark/bookmark.sty
INPUT /usr/share/texmf-dist/tex/latex/bookmark/bookmark.sty
INPUT /usr/share/texmf-dist/tex/latex/bookmark/bkm-pdftex.def
INPUT /usr/share/texmf-dist/tex/latex/bookmark/bkm-pdftex.def
INPUT /var/lib/texmf/fonts/tfm/pctex/mtpro2/mt2mit.tfm
INPUT /var/lib/texmf/fonts/tfm/pctex/mtpro2/mt2mis.tfm
INPUT /var/lib/texmf/fonts/tfm/pctex/mtpro2/mt2mif.tfm
INPUT /var/lib/texmf/fonts/tfm/pctex/mtpro2/mt2syt.tfm
INPUT /var/lib/texmf/fonts/tfm/pctex/mtpro2/mt2sys.tfm
INPUT /var/lib/texmf/fonts/tfm/pctex/mtpro2/mt2syf.tfm
INPUT /var/lib/texmf/fonts/tfm/pctex/mtpro2/mt2exa.tfm
INPUT /var/lib/texmf/fonts/tfm/pctex/mtpro2/mt2exa.tfm
INPUT /var/lib/texmf/fonts/tfm/pctex/mtpro2/mt2exa.tfm
INPUT /var/lib/texmf/fonts/tfm/pctex/mtpro2/mt2syat.tfm
INPUT /var/lib/texmf/fonts/tfm/pctex/mtpro2/mt2syas.tfm
INPUT /var/lib/texmf/fonts/tfm/pctex/mtpro2/mt2syaf.tfm
INPUT /var/lib/texmf/fonts/tfm/pctex/mtpro2/mt2mit.tfm
INPUT /var/lib/texmf/fonts/tfm/pctex/mtpro2/mt2mis.tfm
INPUT /var/lib/texmf/fonts/tfm/pctex/mtpro2/mt2mif.tfm
INPUT /var/lib/texmf/fonts/tfm/pctex/mtpro2/mt2syt.tfm
INPUT /var/lib/texmf/fonts/tfm/pctex/mtpro2/mt2sys.tfm
INPUT /var/lib/texmf/fonts/tfm/pctex/mtpro2/mt2syf.tfm
INPUT /var/lib/texmf/fonts/tfm/pctex/mtpro2/mt2exa.tfm
INPUT /var/lib/texmf/fonts/tfm/pctex/mtpro2/mt2exa.tfm
INPUT /var/lib/texmf/fonts/tfm/pctex/mtpro2/mt2syat.tfm
INPUT /var/lib/texmf/fonts/tfm/pctex/mtpro2/mt2syas.tfm
INPUT /var/lib/texmf/fonts/tfm/pctex/mtpro2/mt2syaf.tfm
INPUT /var/lib/texmf/fonts/tfm/pctex/mtpro2/mt2mif.tfm
INPUT /var/lib/texmf/fonts/tfm/pctex/mtpro2/mt2syf.tfm
INPUT /var/lib/texmf/fonts/tfm/pctex/mtpro2/mt2exa.tfm
INPUT /var/lib/texmf/fonts/tfm/pctex/mtpro2/mt2syaf.tfm
INPUT ./pgfplots/circuit.tex
INPUT ./pgfplots/circuit.tex
INPUT ./pgfplots/gaussian1.tex
INPUT ./pgfplots/gaussian1.tex
INPUT /var/lib/texmf/fonts/tfm/pctex/mtpro2/mt2mit.tfm
INPUT /var/lib/texmf/fonts/tfm/pctex/mtpro2/mt2syt.tfm
INPUT /var/lib/texmf/fonts/tfm/pctex/mtpro2/mt2exa.tfm
INPUT /var/lib/texmf/fonts/tfm/pctex/mtpro2/mt2syat.tfm
INPUT ./pgfplots/gaussian2.tex
INPUT ./pgfplots/gaussian2.tex
INPUT ./pgfplots/gaussian3.tex
INPUT ./pgfplots/gaussian3.tex
INPUT /var/lib/texmf/fonts/map/pdftex/pdftex.map
INPUT /usr/share/texmf-dist/tex/generic/stringenc/se-pdfdoc.def
INPUT /usr/share/texmf-dist/tex/generic/stringenc/se-pdfdoc.def
INPUT /usr/share/texmf-dist/tex/generic/stringenc/se-pdfdoc.def
INPUT /usr/share/texmf-dist/tex/generic/stringenc/se-utf32be.def
INPUT /usr/share/texmf-dist/tex/generic/stringenc/se-utf32be.def
INPUT /usr/share/texmf-dist/tex/generic/stringenc/se-utf32be.def
INPUT /usr/share/texmf-dist/fonts/opentype/public/lm/lmroman10-regular.otf
INPUT /usr/share/texmf-dist/fonts/opentype/public/lm/lmroman10-bold.otf
INPUT /usr/share/texmf-dist/fonts/opentype/public/newtx/TeXGyreTermesX-Regular.otf
INPUT /usr/share/texmf-dist/fonts/opentype/public/newtx/TeXGyreTermesX-Regular.otf
INPUT /usr/share/texmf-dist/fonts/opentype/public/newtx/TeXGyreTermesX-Regular.otf
INPUT /usr/share/texmf-dist/fonts/opentype/public/newtx/TeXGyreTermesX-Bold.otf
INPUT /usr/share/texmf-dist/fonts/opentype/public/newtx/TeXGyreTermesX-Italic.otf
INPUT /usr/share/texmf-dist/fonts/opentype/public/newtx/TeXGyreTermesX-Slanted.otf
INPUT /usr/share/texmf-dist/fonts/opentype/public/newtx/TeXGyreTermesX-BoldItalic.otf
INPUT /usr/share/texmf-dist/fonts/opentype/public/newtx/TeXGyreTermesX-BoldSlanted.otf
INPUT /usr/share/texmf-dist/fonts/opentype/public/newtx/TeXGyreTermesX-Regular.otf
INPUT /usr/share/texmf-dist/fonts/opentype/public/libertinus-fonts/LibertinusSans-Regular.otf
INPUT /usr/share/texmf-dist/fonts/opentype/public/libertinus-fonts/LibertinusSans-Regular.otf
INPUT /usr/share/texmf-dist/fonts/opentype/public/libertinus-fonts/LibertinusSans-Regular.otf
INPUT /usr/share/texmf-dist/fonts/opentype/public/libertinus-fonts/LibertinusSans-Bold.otf
INPUT /usr/share/texmf-dist/fonts/opentype/public/libertinus-fonts/LibertinusSans-Italic.otf
INPUT /usr/share/texmf-dist/fonts/opentype/public/inconsolata/Inconsolatazi4-Regular.otf
INPUT /usr/share/texmf-dist/fonts/opentype/public/inconsolata/Inconsolatazi4-Regular.otf
INPUT /usr/share/texmf-dist/fonts/opentype/public/inconsolata/Inconsolatazi4-Regular.otf
INPUT /usr/share/texmf-dist/fonts/opentype/public/inconsolata/Inconsolatazi4-Bold.otf
INPUT /usr/share/texmf-dist/fonts/opentype/public/newtx/TeXGyreTermesX-Regular.otf
INPUT /usr/share/texmf-dist/fonts/opentype/public/newtx/TeXGyreTermesX-Regular.otf
INPUT /usr/share/texmf-dist/fonts/opentype/public/newtx/TeXGyreTermesX-Regular.otf
INPUT /usr/share/texmf-dist/fonts/opentype/public/newtx/TeXGyreTermesX-Regular.otf
INPUT /usr/share/texmf-dist/fonts/opentype/public/newtx/TeXGyreTermesX-Regular.otf
INPUT /usr/share/texmf-dist/fonts/opentype/public/newtx/TeXGyreTermesX-Bold.otf
INPUT /usr/share/texmf-dist/fonts/opentype/public/newtx/TeXGyreTermesX-Bold.otf
INPUT /usr/share/texmf-dist/fonts/opentype/public/newtx/TeXGyreTermesX-Regular.otf
INPUT /usr/share/texmf-dist/fonts/opentype/public/newtx/TeXGyreTermesX-Regular.otf
INPUT /usr/share/texmf-dist/fonts/opentype/public/newtx/TeXGyreTermesX-Regular.otf
INPUT /usr/share/texmf-dist/fonts/opentype/public/newtx/TeXGyreTermesX-Regular.otf
INPUT /usr/share/texmf-dist/fonts/opentype/public/newtx/TeXGyreTermesX-Regular.otf
INPUT /usr/share/texmf-dist/fonts/opentype/public/newtx/TeXGyreTermesX-Bold.otf
INPUT /usr/share/texmf-dist/fonts/opentype/public/newtx/TeXGyreTermesX-Italic.otf
INPUT /usr/share/texmf-dist/fonts/opentype/public/newtx/TeXGyreTermesX-Italic.otf
INPUT ./main.aux
INPUT ./main.out
INPUT ./main.run.xml
OUTPUT main.run.xml
INPUT /var/lib/texmf/fonts/type1/pctex/mtpro2/mt2exa.pfb
INPUT /var/lib/texmf/fonts/type1/pctex/mtpro2/mt2mif.pfb
INPUT /var/lib/texmf/fonts/type1/pctex/mtpro2/mt2mis.pfb
INPUT /var/lib/texmf/fonts/type1/pctex/mtpro2/mt2mit.pfb
INPUT /var/lib/texmf/fonts/type1/pctex/mtpro2/mt2sys.pfb
INPUT /var/lib/texmf/fonts/type1/pctex/mtpro2/mt2syt.pfb
