; ModuleID = '.\factorial.c'
source_filename = ".\\factorial.c"
target datalayout = "e-m:w-p270:32:32-p271:32:32-p272:64:64-i64:64-f80:128-n8:16:32:64-S128"
target triple = "x86_64-pc-windows-msvc19.37.32822"

$sprintf = comdat any

$vsprintf = comdat any

$_snprintf = comdat any

$_vsnprintf = comdat any

$printf = comdat any

$_vsprintf_l = comdat any

$_vsnprintf_l = comdat any

$__local_stdio_printf_options = comdat any

$_vfprintf_l = comdat any

$"??_C@_0N@GCDOMLDM@Hello?5World?$CB?$AA@" = comdat any

$"??_C@_0L@NEBEBJCK@Number?3?5?$CFd?$AA@" = comdat any

@"??_C@_0N@GCDOMLDM@Hello?5World?$CB?$AA@" = linkonce_odr dso_local unnamed_addr constant [13 x i8] c"Hello World!\00", comdat, align 1
@"??_C@_0L@NEBEBJCK@Number?3?5?$CFd?$AA@" = linkonce_odr dso_local unnamed_addr constant [11 x i8] c"Number: %d\00", comdat, align 1
@__local_stdio_printf_options._OptionsStorage = internal global i64 0, align 8

; Function Attrs: noinline nounwind optnone uwtable
define linkonce_odr dso_local i32 @sprintf(ptr noundef %0, ptr noundef %1, ...) #0 comdat {
  %3 = alloca ptr, align 8
  %4 = alloca ptr, align 8
  %5 = alloca i32, align 4
  %6 = alloca ptr, align 8
  store ptr %1, ptr %3, align 8
  store ptr %0, ptr %4, align 8
  call void @llvm.va_start(ptr %6)
  %7 = load ptr, ptr %6, align 8
  %8 = load ptr, ptr %3, align 8
  %9 = load ptr, ptr %4, align 8
  %10 = call i32 @_vsprintf_l(ptr noundef %9, ptr noundef %8, ptr noundef null, ptr noundef %7)
  store i32 %10, ptr %5, align 4
  call void @llvm.va_end(ptr %6)
  %11 = load i32, ptr %5, align 4
  ret i32 %11
}

; Function Attrs: noinline nounwind optnone uwtable
define linkonce_odr dso_local i32 @vsprintf(ptr noundef %0, ptr noundef %1, ptr noundef %2) #0 comdat {
  %4 = alloca ptr, align 8
  %5 = alloca ptr, align 8
  %6 = alloca ptr, align 8
  store ptr %2, ptr %4, align 8
  store ptr %1, ptr %5, align 8
  store ptr %0, ptr %6, align 8
  %7 = load ptr, ptr %4, align 8
  %8 = load ptr, ptr %5, align 8
  %9 = load ptr, ptr %6, align 8
  %10 = call i32 @_vsnprintf_l(ptr noundef %9, i64 noundef -1, ptr noundef %8, ptr noundef null, ptr noundef %7)
  ret i32 %10
}

; Function Attrs: noinline nounwind optnone uwtable
define linkonce_odr dso_local i32 @_snprintf(ptr noundef %0, i64 noundef %1, ptr noundef %2, ...) #0 comdat {
  %4 = alloca ptr, align 8
  %5 = alloca i64, align 8
  %6 = alloca ptr, align 8
  %7 = alloca i32, align 4
  %8 = alloca ptr, align 8
  store ptr %2, ptr %4, align 8
  store i64 %1, ptr %5, align 8
  store ptr %0, ptr %6, align 8
  call void @llvm.va_start(ptr %8)
  %9 = load ptr, ptr %8, align 8
  %10 = load ptr, ptr %4, align 8
  %11 = load i64, ptr %5, align 8
  %12 = load ptr, ptr %6, align 8
  %13 = call i32 @_vsnprintf(ptr noundef %12, i64 noundef %11, ptr noundef %10, ptr noundef %9)
  store i32 %13, ptr %7, align 4
  call void @llvm.va_end(ptr %8)
  %14 = load i32, ptr %7, align 4
  ret i32 %14
}

; Function Attrs: noinline nounwind optnone uwtable
define linkonce_odr dso_local i32 @_vsnprintf(ptr noundef %0, i64 noundef %1, ptr noundef %2, ptr noundef %3) #0 comdat {
  %5 = alloca ptr, align 8
  %6 = alloca ptr, align 8
  %7 = alloca i64, align 8
  %8 = alloca ptr, align 8
  store ptr %3, ptr %5, align 8
  store ptr %2, ptr %6, align 8
  store i64 %1, ptr %7, align 8
  store ptr %0, ptr %8, align 8
  %9 = load ptr, ptr %5, align 8
  %10 = load ptr, ptr %6, align 8
  %11 = load i64, ptr %7, align 8
  %12 = load ptr, ptr %8, align 8
  %13 = call i32 @_vsnprintf_l(ptr noundef %12, i64 noundef %11, ptr noundef %10, ptr noundef null, ptr noundef %9)
  ret i32 %13
}

; Function Attrs: noinline nounwind optnone uwtable
define dso_local i32 @factorial(i32 noundef %0) #0 {
  %2 = alloca i32, align 4
  %3 = alloca i32, align 4
  %4 = alloca i32, align 4
  store i32 %0, ptr %2, align 4
  store i32 1, ptr %3, align 4
  store i32 1, ptr %4, align 4
  br label %5

5:                                                ; preds = %13, %1
  %6 = load i32, ptr %4, align 4
  %7 = load i32, ptr %2, align 4
  %8 = icmp sle i32 %6, %7
  br i1 %8, label %9, label %16

9:                                                ; preds = %5
  %10 = load i32, ptr %3, align 4
  %11 = load i32, ptr %4, align 4
  %12 = mul nsw i32 %10, %11
  store i32 %12, ptr %3, align 4
  br label %13

13:                                               ; preds = %9
  %14 = load i32, ptr %4, align 4
  %15 = add nsw i32 %14, 1
  store i32 %15, ptr %4, align 4
  br label %5, !llvm.loop !4

16:                                               ; preds = %5
  %17 = load i32, ptr %3, align 4
  ret i32 %17
}

; Function Attrs: noinline nounwind optnone uwtable
define dso_local i32 @main(i32 noundef %0, ptr noundef %1) #0 {
  %3 = alloca i32, align 4
  %4 = alloca ptr, align 8
  %5 = alloca i32, align 4
  store i32 0, ptr %3, align 4
  store ptr %1, ptr %4, align 8
  store i32 %0, ptr %5, align 4
  %6 = call i32 (ptr, ...) @printf(ptr noundef @"??_C@_0N@GCDOMLDM@Hello?5World?$CB?$AA@")
  %7 = call i32 @factorial(i32 noundef 10)
  %8 = call i32 (ptr, ...) @printf(ptr noundef @"??_C@_0L@NEBEBJCK@Number?3?5?$CFd?$AA@", i32 noundef %7)
  ret i32 0
}

; Function Attrs: noinline nounwind optnone uwtable
define linkonce_odr dso_local i32 @printf(ptr noundef %0, ...) #0 comdat {
  %2 = alloca ptr, align 8
  %3 = alloca i32, align 4
  %4 = alloca ptr, align 8
  store ptr %0, ptr %2, align 8
  call void @llvm.va_start(ptr %4)
  %5 = load ptr, ptr %4, align 8
  %6 = load ptr, ptr %2, align 8
  %7 = call ptr @__acrt_iob_func(i32 noundef 1)
  %8 = call i32 @_vfprintf_l(ptr noundef %7, ptr noundef %6, ptr noundef null, ptr noundef %5)
  store i32 %8, ptr %3, align 4
  call void @llvm.va_end(ptr %4)
  %9 = load i32, ptr %3, align 4
  ret i32 %9
}

; Function Attrs: nocallback nofree nosync nounwind willreturn
declare void @llvm.va_start(ptr) #1

; Function Attrs: noinline nounwind optnone uwtable
define linkonce_odr dso_local i32 @_vsprintf_l(ptr noundef %0, ptr noundef %1, ptr noundef %2, ptr noundef %3) #0 comdat {
  %5 = alloca ptr, align 8
  %6 = alloca ptr, align 8
  %7 = alloca ptr, align 8
  %8 = alloca ptr, align 8
  store ptr %3, ptr %5, align 8
  store ptr %2, ptr %6, align 8
  store ptr %1, ptr %7, align 8
  store ptr %0, ptr %8, align 8
  %9 = load ptr, ptr %5, align 8
  %10 = load ptr, ptr %6, align 8
  %11 = load ptr, ptr %7, align 8
  %12 = load ptr, ptr %8, align 8
  %13 = call i32 @_vsnprintf_l(ptr noundef %12, i64 noundef -1, ptr noundef %11, ptr noundef %10, ptr noundef %9)
  ret i32 %13
}

; Function Attrs: nocallback nofree nosync nounwind willreturn
declare void @llvm.va_end(ptr) #1

; Function Attrs: noinline nounwind optnone uwtable
define linkonce_odr dso_local i32 @_vsnprintf_l(ptr noundef %0, i64 noundef %1, ptr noundef %2, ptr noundef %3, ptr noundef %4) #0 comdat {
  %6 = alloca ptr, align 8
  %7 = alloca ptr, align 8
  %8 = alloca ptr, align 8
  %9 = alloca i64, align 8
  %10 = alloca ptr, align 8
  %11 = alloca i32, align 4
  store ptr %4, ptr %6, align 8
  store ptr %3, ptr %7, align 8
  store ptr %2, ptr %8, align 8
  store i64 %1, ptr %9, align 8
  store ptr %0, ptr %10, align 8
  %12 = load ptr, ptr %6, align 8
  %13 = load ptr, ptr %7, align 8
  %14 = load ptr, ptr %8, align 8
  %15 = load i64, ptr %9, align 8
  %16 = load ptr, ptr %10, align 8
  %17 = call ptr @__local_stdio_printf_options()
  %18 = load i64, ptr %17, align 8
  %19 = or i64 %18, 1
  %20 = call i32 @__stdio_common_vsprintf(i64 noundef %19, ptr noundef %16, i64 noundef %15, ptr noundef %14, ptr noundef %13, ptr noundef %12)
  store i32 %20, ptr %11, align 4
  %21 = load i32, ptr %11, align 4
  %22 = icmp slt i32 %21, 0
  br i1 %22, label %23, label %24

23:                                               ; preds = %5
  br label %26

24:                                               ; preds = %5
  %25 = load i32, ptr %11, align 4
  br label %26

26:                                               ; preds = %24, %23
  %27 = phi i32 [ -1, %23 ], [ %25, %24 ]
  ret i32 %27
}

declare dso_local i32 @__stdio_common_vsprintf(i64 noundef, ptr noundef, i64 noundef, ptr noundef, ptr noundef, ptr noundef) #2

; Function Attrs: noinline nounwind optnone uwtable
define linkonce_odr dso_local ptr @__local_stdio_printf_options() #0 comdat {
  ret ptr @__local_stdio_printf_options._OptionsStorage
}

; Function Attrs: noinline nounwind optnone uwtable
define linkonce_odr dso_local i32 @_vfprintf_l(ptr noundef %0, ptr noundef %1, ptr noundef %2, ptr noundef %3) #0 comdat {
  %5 = alloca ptr, align 8
  %6 = alloca ptr, align 8
  %7 = alloca ptr, align 8
  %8 = alloca ptr, align 8
  store ptr %3, ptr %5, align 8
  store ptr %2, ptr %6, align 8
  store ptr %1, ptr %7, align 8
  store ptr %0, ptr %8, align 8
  %9 = load ptr, ptr %5, align 8
  %10 = load ptr, ptr %6, align 8
  %11 = load ptr, ptr %7, align 8
  %12 = load ptr, ptr %8, align 8
  %13 = call ptr @__local_stdio_printf_options()
  %14 = load i64, ptr %13, align 8
  %15 = call i32 @__stdio_common_vfprintf(i64 noundef %14, ptr noundef %12, ptr noundef %11, ptr noundef %10, ptr noundef %9)
  ret i32 %15
}

declare dso_local ptr @__acrt_iob_func(i32 noundef) #2

declare dso_local i32 @__stdio_common_vfprintf(i64 noundef, ptr noundef, ptr noundef, ptr noundef, ptr noundef) #2

attributes #0 = { noinline nounwind optnone uwtable "frame-pointer"="none" "min-legal-vector-width"="0" "no-trapping-math"="true" "stack-protector-buffer-size"="8" "target-cpu"="x86-64" "target-features"="+cx8,+fxsr,+mmx,+sse,+sse2,+x87" "tune-cpu"="generic" }
attributes #1 = { nocallback nofree nosync nounwind willreturn }
attributes #2 = { "frame-pointer"="none" "no-trapping-math"="true" "stack-protector-buffer-size"="8" "target-cpu"="x86-64" "target-features"="+cx8,+fxsr,+mmx,+sse,+sse2,+x87" "tune-cpu"="generic" }

!llvm.module.flags = !{!0, !1, !2}
!llvm.ident = !{!3}

!0 = !{i32 1, !"wchar_size", i32 2}
!1 = !{i32 7, !"PIC Level", i32 2}
!2 = !{i32 7, !"uwtable", i32 2}
!3 = !{!"clang version 15.0.7"}
!4 = distinct !{!4, !5}
!5 = !{!"llvm.loop.mustprogress"}
