id,screen_name
120634721,LuisIvanPacheco
162160302,juan_acosta_a
123116271,rcfloress
1121791488,daniel_nunez_a
4554157155,facusepulveda20
822167290628153344,laura_232314
118376747,carlivilzep
889484426563997697,gaetealtamirano
2962139458,luisotor3
2874463700,CatsLove777
93019519,rodvelizb
586812556,katitaporfia
832202707,NekotsukiKaoru
876946439900995586,cesar_agv
100171909,Margaivo
85542247,bichebiche
4570879167,SuperTrinos
795974077399887872,angelosantagos
828333661489659905,InZayn2017
107230847,pedr0nunez
120437719,ValeMarquezP
920719086635581440,juanramirezTuco
734575806102548485,MGTOW_Chilensis
286450499,psanhuezaech
109591947,PilarHdezFlores
301186085,amartinezjeldrs
60797139,dartwig
2587466937,moverdugo1
214126026,davidgmiranda
447180899,jeannutts
186935667,humbertogom
89761850,MarcelaLarrea
2468453019,CarvajalZuniga
878809625411411968,elvichuquenino1
768609732332511232,PicarteMor
76946234,pauloccl
920454761740230656,supierastusi
197757133,MatiiasDonoso
15623828,IASalas
1575672738,lepton_
101124329,wilfredoaran
721325295723278339,Calyvasquezf
4098137867,IHuaiquimil
842478558694072322,RojasIllesca
580315232,julietaSpace
104169474,JunDevil
137842275,maxhervel
113044982,tambienopino
227556149,Ahormazabal02
108358018,ceardi
2274091869,Metro_Textual
812087695879143424,marcellapv
838131592753201153,alexistalo94
463382926,RojasJaki
46149982,superarpobreza
302685412,vefarlu
498014977,moncadajoseluis
335470595,zongalomix
137920593,karorevolution
2967161747,samueldu_vera
614452720,Dani_Cicardini
208272594,vladimirpizarro
712037799957028865,elresidentearg
276321238,daro33333
110847602,FernandoKursan
102707696,valencocalama
788224882567946240,Mylenuin
27516956,proyectolmue
73125588,EnriqueSanedrac
393529037,gasiber
146973895,marrocchino
82253954,claudiosanper
95556642,YeAHar
406943560,PintaMonos2
62419857,Mi_Echeve
819713966,Gobiernodelasti
2800444748,BaltiMarlon
916348760921378816,SenadoresPPD
576595653,AngolOpina
4121846781,berriosjantonio
572229809,AlePlacenciaC
148344192,Leocadiz
138212018,MabriSolis
410783142,crisant_lopez
612883967,MarcelaHernando
2854128616,NemosPage
714894666563526656,OsvaldoAndradeL
574866482,jvalenzuela_a
3577848568,PonceConcejal
121817749,Jenni_JaraA
915073741029289984,ClaudiaGarcs3
743707646,jebuzeta
887431981474222080,AndresBarra20
3857166137,paulakissling
890688754725384192,HidalgoxAtacama
61789335,cesar_astete
750111167129980929,LABASETUVOZ
10307062,ejopia
585753135,810_herrera
842448603956285440,LigiaRa25377145
id,screen_name
917219056016556032,Lautaro24398678
102121998,carolanaranjo
196139198,sanchezmarcelod
2949646803,Rosty8364
912771768682729478,PReconocimiento
58816771,yurivegar
754877710640508928,janoblamey
911199824183201792,JoseUli52938627
330077280,SRRiffo
153230160,rolovilla
3320368247,Nykolaz_Djat
1223636425,Berichtmanager
883856001740492801,contreraschil9
900853761098346496,Kukurilo1
158185619,Lucia_Fernand
132908575,Ninaguti01
882621534262710274,CiudadanoAG2018
34201888,lrebolledo
1359532927,framol_molina
358935826,JorgeBowieElvis
1179740714,piacruz5
834219986,sintierra76
755736510,_errantes
866732517713473536,LeoSanchezSM
87524772,jimenajara
268053437,nataliacuevasg
135967659,patamoralesn
149140153,Salva_Bonilla
877874173,manuelsantajr
74221462,pilarr87
860861200665632769,GFigueroaAG
724328604,dcortes_paez
237863696,Regulopompilio
435053767,cherodrigoyv
33857467,13isGodsend
739181815387283457,LaviniaParedes1
922379102,silvacisternas
2473196192,Prensa_Abel
894749346129825792,Arnoldoescobar9
125385534,zorrillistica
3684732038,YuniorSosua
1345696602,mmccarquitecta
902237476349235207,EverJoelCMonca4
102293921,HDC2703
9360242,osses
4895435163,CmayerCrismayer
123212154,jmandalerisj
913200666272612352,Edulop735
31182697,robertopolis
918798580151914496,SoledadPea18
836951527717732352,netoaguilaz
196789723,SUNDURRAGAT
136827176,malditorock
380885079,lguillier
67895910,FreddyAlvarado
3325443581,anabarreracord
220497170,GSubiabre7
113722906,patmontero
105895524,andreagarciaorr
128207346,jsoto8
712322447,Calderongalaz
54053548,tamabravolillo
911334514047242241,sebaslexis
856108292522881024,barbara_lenys
716216181829537792,PoloGallegu5
292613820,jacqueline028
107116641,RodrigoTorresL
169246047,marioaoa1959
478209130,cheloskyazul
3424360877,rprieto28
188428250,ccapdevil
31296716,erikamartinez_o
3098235497,CessarBidal
1851428587,juanperezcotap1
912166980299382784,GreenbagChile
621584669,OscarAraya1990
1553063113,merlynnat
102239859,LoreAlejandraCD
884763688212852737,KPuraly
2155786837,CSILQ
910737810281418754,ManuelJ07186842
1321646340,JppdRecoleta
108980210,danielossandon
104563682,iorh22
3004652771,duvicq
382958436,seromiga72
917044920522887168,Alirio_love
870768027305947136,evelasco2018
58662679,TatyCata
99603553,aguilargodoy92
918164583231062016,Spawu345
129531798,hugoestay
2336867378,GonzaloDuran13
64826621,javier695
911201959763431425,Rnunez_N74
616522724,Mari_cris_22
1624117194,Cores_PPD
108480095,cerebrito_cl
4899869758,AleAlembrasil
783451219071303680,InsulzaSenador
id,screen_name
760574472340504576,Insulza
2876448712,gonzalez_r0
1343411935,CipriRD
584779572,tomas6325
917930095590952960,felipecineart
213906373,DidiRiosA
154590454,migatomedomina
101940623,mamadejoseyjuan
175485331,nataliariffo
779358746,kvouriot
1495640604,Pklesse
2892132532,infomargamarga
905926003029135361,snowpera
10866812,Carolonline
370428806,loyola_bravo
512974738,tresmejistos
875717300992827392,lafrenteamplia
950175152,renboso
866837907759386625,CarmenFickar
2449705759,telilimunoz
3379738343,isantosc1
35139654,Kathe_Busel
973879476,lichiii_iii
784986837144203264,TatoAlarconCORE
1138740054,MarcelitaMT
2867387882,afro_samuel
917610232335028224,GatoConBotas_SA
4041681417,creceryprogres1
773675330951413760,lucodis
155768827,Gabosalud
793655972220796928,lpvb1981
2859325929,JojualJorge
3100003583,LeilaLaibe
915243352198713344,TeliasIrene
160001405,JohanaPaola70
70735009,mxmg
518050844,elabullangero
317159627,juliaurquieta
103369924,AmaroZamora
818447104678957056,La_defense2
910760492955721728,CamilaA76722079
118250000,DanytzaGonzalez
916339739120324608,nomastarros
2438543623,PurpleForte
2387422624,miranda_yany
778711578,luttyluz
132554499,ChristianLuco
381555322,AlegriaYaLlego
140951931,DedierAlonso
348727626,PolinneAndrea
747869700504322048,AntonioAxel1953
917117134035193857,coord_x
66152116,GonzaloGuajardo
381861964,RaulVillegasC
59561844,juliolemus
607636973,LilytaOnate
57867652,VMLEIVA
1187656051,claudiocamposb
65207154,CarlaAlvarezY
96206712,juanpablobeca
198287257,cuervodemar
980320711,TwitBakani
764265590,siquieresmelees
537568109,Puros_Problemas
916870678896406528,DavidZapataCore
433823981,est_araya
2990418143,MatiasBarreraZe
899333135367852032,VivianaCSepulv1
570432727,Psi_UrsulaL
105963599,felipevasquezc
761964256120176642,Marcela05195527
911792385205645312,Nancy05432507
802491168672120832,CarolinaVarasC1
165857374,chunchozurdo
713809889173307392,llonaantonio
907773354236674048,groottuitero
91451531,FelipeHernan_
113417918,hjquintana
131744878,AndreitaMerino
905208081658892292,JacanabeGroup
366882970,LonBD
484339503,pabloarancibiap
912754613362806784,nerobug66
1621306981,SFruggonne
926062346,Matteresita
879546378179018752,LucianoRivarosa
878820156637667328,JoseCabreraPer1
134821782,Magallanico1959
915373382673330176,ChilenoBuen
189716824,victoriafarinac
104047629,moni281078
3341810675,elvaldenegro
713045158229622784,paulacensurada
130676796,adrianasanhueza
3218209798,chapulin_1981
940128337,jmarche67
3148761591,javitaisa18
138119848,ClaudioMillaleo
502145108,karinahidalgoz
783285014,EddyMosquera0
id,screen_name
1172268512,SepManu20
95287684,M_theartist
4547725283,TGuillier
251429957,waguilerav
916335299151712256,MelisaSotoB
102215205,elvillamor
61116617,patykuyen
320084404,JoaquinRubioSch
223009833,kote04
600512735,Latalonrajao
915766380712034304,huachiminga_t
915932985001758720,HenriquezPatrix
257297626,rhe100
1110507170,kokePH
459930017,caritoundu
14841269,edualvarez
33224099,juanyper
531563456,LemusChile
912845883250810880,LucioSanchezA2
2174740115,rabrandeis
1866188952,TrostelxConce
85159526,Jana_Ojeda
14812549,javiajera
61557642,cesarwarrior
914137247112450048,Angelesbarbosa6
906909913611427841,IqqxGuillier
321197056,fzuniga91
44457093,Buguna
190374653,__pazpaz
95733944,Tooooi
69163001,valemunozmo
276838969,EricAichele
119599399,pame1978
602301807,Moreaulau
716909517,Freirestuit
1077280692,jorgitoelduro1
88984496,nicolearayaq
100722325,Fab1_Fernandez
3399594502,LaRegionHoy
59331251,iegarcia
67944587,DCastilloGuaita
365631057,quita1868
724971375258128384,mariagamond
520006109,wolf_lp
66743490,MauriGalaz
729579312383447040,PR_LaReina
1334505871,FF_1977
915806548521312256,Javieravg1995
731670370919518208,PanchoDuran_
713095372093145088,basaesvaldivia
915768792743075841,chanypavez
1390505760,moandradea
1340995388,MarciaPanguinao
209168945,josiifunk
706871918960443393,Comunistasmaipu
331049351,CristianPortus
430314950,FernacontrerasJ
190739390,JosefinaAntonia
2808124081,FeelipeAhumada
619377605,jberos75
867784587363192833,Carvajaltoco
40349048,gdelafue
297962422,GianlucaGP
312110209,15151515151514
914868148716916737,AntiSistema5
212632940,NITO_OK
767394563078094852,otelo2009
2179237248,CUAflyfishing
541275051,0salazar00
53260261,clagos77
15485572,jraulmonterob
896564805426974720,jaimevillaroel1
286944848,maazarev
909817341646577664,GalloRojoPC
154591860,FcayulP
2398644770,gustavovarelar
142150704,ChEMarchant
14277268,antonia_fig
283190504,1tiroalblanco1
2387093167,pazmir
874609837681901568,ET_fromhome
912159246275481601,RubenMuozAlfar1
872039126568239104,patron_dubai
107858250,carlos_ruminott
915305751664582656,GuillierExterio
303275448,_villanes_
99941674,SNORAMBUENA
128054073,rubenalexei
68027388,LuisSuazo
256251251,JorgeGoldenberg
351917534,Pato_MorenoB
3344275793,34d7fb962432454
1559043074,gnidne
59943486,natygondiaz
310374979,fransaa21
93007206,casifrrpp
900737476473606146,ternomozo
886408718996340738,JairoLester2
899159175397339140,efrainplazaolme
3969299764,Alexis_Diaz_E
id,screen_name
119991452,nikobece
880869852889702400,DEEP_PUCV
121250647,silcote
211725318,vicenteancaluan
863825383535333377,v_matter
468011422,ValeNicoleD
64773415,sheilakavs
46955050,VecinoAnabalon
91044023,Sherlyn2033
382383334,JavierEscanella
172894976,consuelo_la
576710714,luzmarianino
124301724,Pedrofigueroa70
2187871472,c0nstanzax
337509235,mandarinasour
145514601,Monique8_0
454507655,marrepol
827293682,GLORIAEFG
65398657,CaroVargasR
130564476,tomcrisan
14469995,VictorPintoS
2453460073,CristopherH19
752773056951488512,JJCCVCosta
721400668611821569,jany_tapia
1551857910,MVirumbrales
90810711,CristianAGB
264897782,mvalderrama303
820645698643329024,VictoriaFNV
882275504312786944,jorgecerpa20ya1
914297687117312000,sssvshi
889665861300178944,AlizeeFique
914950957712146432,AShumman
66291168,ilabacaValdivia
228947716,gustavorojob
791642246215073792,CamilaCoiro1
502485941,kenymatus
79182108,ctransparencia
913440012255076355,isabelgarcia251
95115634,pmontecinosc
107856658,Silviamendozai
912366050397876226,atletatocomple
34636193,cuevaspato
80660979,danaeypunto
181718583,polovalenciaa
187371858,Damiang94
914845823854366720,JuanOli1002
2360064443,hernandez7191
901136359863275520,NegoMardones
146588375,meugeahu
909537058779275265,AriasurreaEmile
369898193,MaidsbyTrade
96240303,piukedomo
359680242,boris_barrera
213083713,satleenkaur
67706345,keystor_jorge
146653113,cuesquita
914629982223310849,Educaciongrat
341220306,jagonzale
356571417,tatianuskaya
494391446,galinel2012
855984237085937664,Pmp0000pmp
1481316078,TatianaAlverre
1195662762,xiimval
171193419,DaleLeon12
552665260,omalfanti
186244651,camiliuuucc
3761925148,LaMaggiGatera
1180186717,felinino
772540978230099969,smncrsp
510514891,CentroDeportRen
914536129273229312,Kathy_Mariposa
914515616106676225,Maicolx_x
713793004646043648,ulisessalgadou7
823698730335502338,celularoja
64431018,dondeelcristian
79608780,Esonomas
118386979,nolomadrid
912755865467408384,NANOCORE2017
705084008737153025,patyxnunoa
3784734574,RealCarlos1234
357925512,elsapaez2
820120594712854529,gespinosaibarra
706361756,CristinaEdithSo
15615581,juancarlosvera
891190925631901696,fuerzaguillier
914207459568488448,breton_yeison
1041970171,VeaKarina
909787923318423552,sti_pea
41561552,rickmuir1
850062895861944320,ArriesgadaPaula
136788373,cristi_mendez
205308549,LuisZapatapinto
538646417,ramonroys
2459696028,ximenaveracamp
25506954,Dannyjokes
878076712378130433,ktf_arenohj
904013984394878976,DeYannette
768090813666566145,JavierDurbahnE
225445834,camila_vallejo
116270478,antolapillo
id,screen_name
474108639,carlosminder
1551301771,Prensa_Karol
106473345,vivianaurra
380077515,solar_paula
512329706,FabiParraguezM
911262522103287808,CarolaSolisDipu
119440633,chirimoon
155067704,Alen09cp
191828898,flacoQuintana
118716098,pamfins
1083436934,credlich7
3372239770,c_saffirio
361676496,gleytonc
88691767,Sebasrodri31
708128679407263745,mackita3313
146715940,taniamaldonado
913728984797597697,Nikoceatolei1
2382966420,grafica_s
43359602,Amancai
771464234895106049,ElPapurriUDP
734106494,brokersmaule
273963251,shesholastra
197542021,arturojavierol
454901206,PaoPereiraV
899992654074740739,MartinManterol1
390760019,JosueFuentesG
2735892259,frida_mesah
34316877,camio7eiza
908522135349493761,Robinson_Cid_S
782777324,DANITZAROA
163651143,mandy1155
109895476,Renetorrejon
545555850,karlaletoro
2891401865,VerificadoCL
913591773355757568,CatherineAray13
829442770079211520,IvanAntonioAra3
3388331583,1967pator
149926318,diario_ciudad
264417260,khristianLS
258196768,Jelvecita
85698461,Rfloresh
34367313,aranguiz1
46253156,zaidmaths
232597212,lucytapher
362164537,ifNnoWhen
620712426,jantonioretto
87267333,EveAntinir
107885375,Nathaly_1903
90525323,Alvarolo_25
54123079,renaleyton
3438516449,GWehrt
887143494120288257,Marce_CZM
226015622,MafaldaUA
33382045,MNorambuena
296651517,Sebalmo
104321556,coke_san_martin
225780250,cobo28
492671441,UrzuaPaulina
287438984,hpreisler
911411957974134784,NormitaDiaz6
766669944,kardiel7
829776804898541568,vaniscup34
857234407882719232,sendoalejandro
229923804,oriettareporter
15239513,s_lehuede
156054496,david_beltran1
108100772,RositaGale
393099294,lparra28
57162646,chadufain
43397255,camilacarop
123113433,BuenosDiasValpo
4886446401,Ferra5005
860092594029821952,IndpXGuillier
54226299,Nicolas_Jurado
3308054419,pablo_am7
240704081,lgougain
1370560212,MatiasArisBuch
796169168664072192,WaltValdes
894246406193655809,Esperanz_Salva
1529406907,arlettepress
381706465,cocogutipeu
4819183121,AguilarCbms
74751945,jurogo
913521786888876034,agroalejandro74
74819883,valesaraos
4828003809,xabiermorenoc
141207579,baegex
271660495,jtae1980
120333271,PatoRuizz
749619645481615360,ABELCASTILLOLE1
256301391,gllao
847488691832475649,jjcc_indepe
123341820,negro_vilches
119744158,JaimeElorrieta
894226978840223744,YuriLeiva4
1884911612,Exupery_Rosee
2301654553,Manuel_CORE
2219549786,seba_andrade77
791981773311844352,N_TrenVictoria
4265519902,1449Betzabe
id,screen_name
627937872,SaludOccidente
42093407,McCarena
2353181864,ZoraydaC77
89436865,rickalgo
137863321,MerinoAzulado
313562041,Psicoyennyr
54378228,Andrea_Fernande
913251243811799040,Cecilia46504156
108913652,cltorreo
841711437697413121,EvelynPradel
890378323779616768,Matias75571470
1537542716,JJgonzalezbas
913135894894403589,AporGuillier
838771356,FlorHernndezZaz
1459817503,RupallanVera
166971089,wladypeppers
73003004,Solede5a7
52403721,Alikarrieta
421247220,AriellaOlivares
796504633413955584,carl0sedmv
363945017,pc_leo
250157986,niunsabor
71837909,paulinapazca
2875415501,ultimominutor2
38936880,amandgeorge
1069026241,FelipeUrbina
860592668337897474,Francis6955
96631882,nicobyn
107309842,acontrerasrojo
846813578694930433,claudia93646077
897010308941717504,OscarDe79574152
1210041524,XimGuti
51544732,yuryquiroz
912690157647798272,AlejandraSAAc
90551859,marceloclap
348702136,Duranbaronti
122038763,lusanchez2010
912819880822546434,ReservistasChi1
371588003,diputadoceroni
900528362694860801,comandoguillie4
200521245,gerson_arq
2746563262,Ximena_Onate
526805493,Karlos8918
853410743529742336,BenjaMirandaM1
33056268,ReydeNegras
888045428,fvillatoroo
831905124,carlochestay
91435297,jazzun
62734390,crisisam
2847438652,carlos_fvaldes
3123897063,fa_arriagada
1379408906,GonzaLizana
1255699147,LaUdiPopularsh
910659267295895553,marcelodiaz2017
2580319708,p_castillob
2381100241,madelaillon
904483488530882560,europaxguillier
3003280481,rmarcelic
69136528,FelipeMonarde
160908922,etruriano
194834848,Aldo_tam
124239330,alelumanr
139912890,camiiiiloooo
905800634817019904,AGuillierBiobio
701057344101347329,davedayst
2558895088,angieloyarce
847631637256876033,Andres_lat_
347663747,agroeconomicos
214213006,AleSotomayorc
31600811,FelipeYfigueroa
300307227,waipe_UC_17
4525203857,kenoshields
3068193015,infogatecl
818922959452667906,RadioFusion1063
876927760379281409,Michell90282930
119136693,freddyondo
4444521316,cata_butron
96018622,_ErickAlejandro
734552464540717056,PPD_Maullin
118397436,Jacke_Santander
73290719,fabianpadillar
448322511,RigobertoContr4
96607320,frambuex_
119808394,ahenriqueza
2831803142,ZaydaOrtizA
119159373,Nibaldo_Leon
859283101,Gregormaxpower
847593325511282688,JairSotoBenite2
2429458927,ClaudioFDiazP
118190341,sandraazul4
912306974922088453,PrompterInABox
1137876398,cris_ibarrag
2436114666,VEduContreras
62426850,Victorfern
40520165,Gonza_Sierra
106832876,jopiajorge
117598158,davisan23
78762407,gohan252
797278471852621824,danielzamoranov
54943455,ikimartinez
id,screen_name
851264154333663232,SebaCGG
90404875,oscarlagosb
190113710,jR_sotomayor
910329136052391936,yayibaez
892812542065684480,Alejand58397656
38289276,QuererEsPoder
54355676,condorsebas
51652934,Rvargasv
90547831,OrmeWit
56135030,paulaviano
3300727233,DanielRojasEnos
834257164629835777,DiegoBustosC1
234577225,Baocarcamov
903037735707054080,SenadoraP
123108158,taniatorresb
805971042,PaaabloUCH
151991976,Felipe_Seguel_
96197368,rodamaleh
3229684113,aleperezoportus
2846061201,DesdeNunoa
76868715,marcelrosse
83902249,albertantito
34604068,lriquelme
629772075,fernando161968
867252115,jcoribac
62358430,avo1984
121648396,conydiazp
109921918,danielpiensaque
131875850,barbyplae
42558434,marianovoa
323252125,kaisiga
2641753295,samytonega
3376265691,IPSLosRios
118470029,MACACHANDIA
1659311298,Patoleivahuerta
327379661,LuisAlbertoBus2
33107421,CelesteAmargo
128989166,William_BoothN
33923443,6BillionPeople
51673890,clmunozn
911781005907730432,DamianEnrique64
250321194,Nicolas_UP
902219893881397249,nancygloriaduar
295139442,MSRojasCalcagni
107902386,profeccisternas
95853251,cristobaldlp
911726970056081408,MarroquinPrensa
754311792768196612,CaglierisSandra
758873213287800832,pablosd19
908164569239052288,CoreAguilera
155116907,moalbornoz
378651465,luisastudillop
90280401,jaimevaras
904679547483934720,rogutierz
35876603,ppdlosrios
27143202,imsugarless
277189211,jomitalca
2847027923,paablosiilva27
785500394868867072,Juancar87250809
2432578610,JotaCoquimbo
546093213,VpAmaro
320001797,alexgonzalezch
209878827,_AdrianoVentura
101215199,yedezma
22686121,Moreno
60526206,CristanCornejo
53216310,lfelipzuniga
142805819,ajim43
34992710,hernan_sr
1694580900,danipazpb
1201390634,ricardosotolop
19401345,realcatalan
168796336,MarioMagno10
1534916462,mrchapitas
288802981,mondacaCore
128246549,negrito123
514751256,RodrigoBadillaN
74271824,AINOSTROZAN
911205742857867264,Mary95257802
17489609,PazZamorano
230553965,manriquezcarmen
212086467,tabogonzalez
83009723,williamh_f
599787538,miguelgonzalo14
3355322663,ursulaeggers
2608324477,AccionPaisChile
59176700,raulvaldivia
3181656250,pabloch_a
892202274008829953,guillierbiobio
3156616443,BrujaTrucha
69971278,lucastine
909967080551788547,cofran169
93305769,mark35d
71917298,Coke92
170028958,Coteortega
80848946,ELParisOsorio
380076502,yohisita_
3296078538,LagosEdgard1
844995007174115329,RadicalesNuble
862520592855158785,Cristiangato73
id,screen_name
89084272,DanielaPizarroA
761935481953259520,GaeteHuircao
60327679,DiegoTroncoso
119416162,renatokalise
363218090,dagarridoc
208709802,leecheverriad
51065130,rodrigotrivino
66807938,JuanDazaLizana
1247632632,AndyVeraGmez
782390524317696000,ppdaysen
18704839,marconunez
221174778,maritzachavezmo
104087888,n0tallowed_
186588574,radiosindiall
271735108,Andre_Ita_Marin
26007651,edopac
1713650539,NMayoriaAntofa
61092028,MMolinaA
910779594223050752,EliRosita12
322187567,seba_orellanaz
850947284,elianaisabelflo
233861934,RoussyHuitron
4404689777,Pepesolido
253603425,Pale_2121
161394478,patoramtorres
351100725,Dylan_Bostic
724357062524841984,frango1963
836757428595208192,alamoscelestes
187267965,Fernandasotop
818630042230067201,ClauStocke
910693381285797889,Leonard08581874
2468242321,jsplaza1
64583108,karlitaescobar
34413679,bravosebastian
213023965,Azulvictoria
186988515,alexlimarino
909200369607114753,CotetitaSaaved4
742533523022680064,NuevaStg
410401416,kary_meza21
737819209305083904,silviouc
189242362,harfgp
186130431,ximerivilloo
531581728,Negropelotero
100331785,Ruth__Rodriguez
856634255597748224,PauloGonzalezN1
71019459,Pablo_Bastidas
136836272,Ozcar_Gm
73428007,ComunidadMujer
185442129,PartidoMas_
317498214,nonnacorleone
4503564855,isolina_laprofe
908537576423792640,palomamunozh
380895725,nelson_jofre
383233738,AleZoo
708225122,ValentinaVarGut
890382799798251520,cel_v_diaz
218328980,smillaleo
65758275,KataConstanzo
345966674,BrendaMundakaMo
852276483628335106,JoaquinToncic
709245426,GolgoriaGloria
911299344,PASALUCA
2575785180,elarmy2014
757333430132731905,bigotes2845
433851314,kevinAlvarez_12
1619035172,AgenciaMakro
163138217,riveritax
729446387306237956,MontecinosConi
1628217800,Oscar_Schwaner
954772885,hluengo72
24693285,yasiesmivida
1370980800,nandoe4e
98401181,polinda72
246573031,karmelamaria
43608184,leonardogaretto
122177062,gabrielbosque
1466171971,lorpalomita
167185172,tereelimontero
7854662,danireca
93007006,AVasquez27
346394642,EvE1603
2224041158,Andreachica39
816854072015933440,ElpabloLeon
748256934,VICKYVVN
910209406075392007,Kimberl94472039
54324402,_AlexAraya
150377247,AntiPiranista
2205720882,El__Mota
725183101866004480,Victori47957236
906237528734359553,Joaquin03939073
809451698133549056,A_MendezD
3548545762,Euquenita
265781598,reinaldofdiaz
118523139,marcomorfi
337234753,jose1994osorio
275636817,marciafariasmon
100101695,TaniaHidalgoT
474233063,IraciHassler
338385273,AlejandroRabuco
105813044,rominaayancan
id,screen_name
3379490699,AliciaLiraM
152113826,RommyStock
2387175376,acartamos
1119189451,Marxibonver
999771618,Antonnic1
895437694586810368,factorabsoluto
896508940623728645,milebarriaval1
131896398,Caritomelipulli
113732657,tamitaduran
236403245,pancho_spyder
73253133,marcomboz
2809354377,revistadoscl
890037632541089793,PauliCarrilloO
96014777,vicguajardo
373604003,sebastian_ulloa
1194254670,rmiranda1818
85703659,Kalasjnikov
315051544,_ForceOne_
191510978,Bryjeco
89113798,elandrez
113754182,cokerv
101665862,daniela_leyton
749845091565445120,Sai_Kiran97
156771819,Blancjaguar
2773992441,NicolConG
483355875,JuanBellSantos
903268870571646976,andy97abcp
908818425409089536,JavierE90202899
909795571501813762,Martina56499404
831532574363250689,Encuestas_Full
1246700742,vergaragaete
807995015633010689,carcamodoctor
118254661,MLopezSanFco
4188372988,rtntorres
330691910,alejandroigor
272454642,jlopezsaffie
66363600,alejandrohz
584920913,DonatoCamila
898177649637552129,MickyyRod
196684975,ogbal
3131249362,mujertalca
1345997576,brujadelsure
909144054381780992,Roberto07939
247583122,HectorAracena
897861574685315079,Camiflohez
909570098708537349,XExterior
69088798,Reedhab
156984561,Ericdiazfierro
110874016,a_fr4id
771024918314094597,CarlosRojasB7
284151459,JuriEdo
276160128,Xzeneverse
581775524,Maripi______
2678109396,chocafive
60693063,jpulgart
889205332106457092,FernandaMillaq1
118711875,fangobe_qta
2604557463,fenahormazabal
192689495,oportonto
260840784,leonardocayul
706875265885011969,pedrosaitzs
903723587634384896,Victorgz1958
2557472089,lis_ponce
37302524,jamonroyc
33392564,sbarrien
895702505849487360,AndreaM20973450
185786393,jdiazsaenger
190820275,ximenaborquez
2243884352,ISIR2014
41373684,Gasio
493188388,Rojohocicon
4135715643,Cecilia51187759
235260993,Lor_mag
66389652,Drakkar31
1018267116,SocioyPoliti_UC
61257229,ojobienabierto
1400149472,DonosoEduardo13
257926705,Manecita_82
358359265,witoldlutoslaws
734594345496612864,CapitanAmnesia
3120511120,theedeivids
394606986,PATRICIARocha44
792348750,ignaciaugas
66688195,Boris_Ramirez_P
863581958558896128,daespe1420
118226575,gabipacita
3408782865,Pablo_MelladoV
3293065858,LonomaBar15
118746585,falarconj
772983543152648192,diegogarcesj
384468896,k_zuela
2286575148,escorpion369
4915341646,ecochiquillanes
41920141,jmolina2009
804353339832012801,Fernand130602
2449739946,valemedelz
48932485,ximenarr
62186243,Rhrocco
14861338,kaluko
138419432,mfernandaotero
id,screen_name
101014715,Auloli
273107089,LuisVillegasC
302878190,Clara_Bella_
766482745593823232,GabrielaSepulRo
845098278786154497,DoctoraGenna
42526495,alioshak
1406616926,cynthiaboudon
738605125980196864,cesach_congreso
97718738,olguinvargas
906911277083234304,NucleoMilaTapia
903592659998134272,JorgeAlvialPant
805831028157857792,IndigenasP
104493389,marisolcitasl
17770676,rodrigoelpelao
536755025,jopazoi
2461263778,mov1945
83704138,imaureirac
45932473,Juliangonzalezu
146597683,rolodelrio
901076136,JEDIMAURICIO
227377721,erickfuentesg
388274091,36latitudsur
1027534790,TeresaValdesE
178971929,leslie_nicholls
338928731,jucoriba
2465277688,rapimn
425834956,dalmonacidh
47988576,ffrias9
179955099,ganteraraya
47466216,Marxielo
177688270,SenadorTuma
47370476,andreafera
793975692002205696,S_Orellana_P
87237142,poliDanielaP
37774720,S_URRUTIA_C
123429566,FelipeMedinaM
89000732,erickythman
422700110,porortiz
309746061,elchedelosgays
139570870,gillevargaspohl
115115066,Batigala
2901096508,meIanie5
893523596290785280,xuangzhe2018nm
1109944400,MauricioMolinaL
118518365,DanielVerag
717818352480231425,OctavioMeneses9
2770568079,Jorge_Urz
128487405,jlulloa
1601066106,SowMaese
866495042147549184,castan_paul
866974772,DafneConchaF
3188092203,PRadicalcl
78406488,acevedo_arenas
828518405846212610,APMLOfficial_
182429847,carpediem_dia
850081540478578689,Marie02410254
397363796,RobertoRoaG
309771547,GonSalome
3264792214,AlmendrasJavier
2522035618,z1gm4_v2
467939682,Dr_Paisa
352090393,renatozep
104020962,Karolcariola
211608164,cazuulo
37326502,LeoPlaza
834985804665495555,Zacariascifuen3
492425306,Paulwarab
2184495479,eugenia_schnake
766623204,YukanKappatsu
106447913,JRArdiles
866354822890622977,DiegoCalderonC
394777611,Raam75
67537920,felipegonzalezf
1194446600,ptraslav
2927376670,relatosalbos
207686335,tomasrobertoher
111131259,konuepangue
266201584,silvestrezen
816533376,ANDIMEnacional
195436785,Jessicanunezr
2523573765,marcthor73
1373157006,regdelosvalles
39703233,EnzoPelle11
386811675,gonzalocidv
90870111,morganazurda
35273903,eslo_quehay
589262735,SamuelEscares
247126245,patto_paar
908509859292893184,CarterrCata99
124328932,pepivictoriano
176196734,Ximo_W
161064221,carin_pp
8884542,f_vasquez
392087868,josezavmoy
4472312535,DanielCantoM13
466082366,oscar_oyarzo
155647653,Karinafer76
108505897,MiPropioMantra
87442058,wsau1987
122517942,JorgeUzon
id,screen_name
118782965,JULIOZUNIGA2013
241143987,JoseAlvaradoG
709881477664808960,drupidi3
96650319,mynameiskaaty
21013976,nikicardoch
908172667701866496,CarlosA36666165
715574996958056448,chuncholguin
850701247229423616,Carmenluzespin2
2928995201,CPB_FLORES
771858483423617024,camlota1387
233065346,PilarHidalgoM
40155184,Camc114
1098851124,RalejMG
848334405458382848,Periodi66548805
908500231700074496,Susana20520053
260330110,GomezMaycol
2258187344,BastianPuentes
863145497938231296,JxG_Araucania
32179749,franisca
3339823695,PizarroT_Andres
367021676,PaulinaLopezG1
86440654,Renzoolave
64590381,ansbec
875939506645610498,Fernand17756215
1262832032,jescobarabogado
1679613896,consu_morenof
139890197,naxosilva
96557188,andrespalaciosv
319942046,marioalbertod_
177995682,PedroDavisU
120240109,beavaldivia
67092631,nalegriadiaz
341778037,aukafeJose
99410050,CristiaPalestro
124045046,gjarpa
908486828604428289,LucasBastidas3
331257093,sergioulloa1
223489131,antofamonica
822912761160200192,naturrez
902582420,j_calbullanca
430235389,jmcazcarrac
121467676,cipinzan
961520208,joannamuozjohns
848338386255589378,manudye
799844931984654336,Rocio_92n
123044419,fcasastejeda
893198095303028736,freya_sanhueza
4852548065,MrDada_GC
866466340030361602,GuillierxOsorno
769887998,dante_veraA
1732879669,gabyreyesp
17146533,la_evex
196296696,chicarelampago
908333082599723010,PConomanSenado
273924635,EliasMunozO
870276843114569728,palomiisabel
55927257,JorgeOchoaP
1683890814,LorenaPizarroS
178862215,alediazmaluenda
1109590008,Saxum_JRocha
128743610,Fran_Torrejon
327779978,joseluisgallar2
181713072,eduardoalcayaga
58071935,ocontrerasv
57071259,sebauri
130613447,erickzelada
883876539045171201,Alejand64086478
626306904,DarkPremium
3013798103,Camilokillah
4482594305,Wentruleufu
16970297,guidogirardi
31458586,orlando3000
3438274151,Reg_JotaCoqbo
772601771327950848,cdiazbrain
3187322050,fernandez_stgo
4876423503,fortegaz
2539380070,delpozoalcalde
1319649709,ycomoloexplico
908008648307122178,ITCellHelp
3112216175,NunezSenador
125902985,ErnestoUribe_C
142128384,mtzcanobra
389093454,MauroFidelDiaz
717222038,angel_pesimista
92877353,Cnunezrojas
733481748244238336,FabregaRo
794613164184895488,antonioleallabr
279257644,REINALDOERNESTO
35595347,DaveVescio
96171938,MaxiStone93
129889357,ri_sanfri
90273389,marferam
907765276124618755,SandraMoscatel2
907343329490116608,dipcontreras
2176898318,valkiriaveneno
82996011,naxius
696858854177554433,cigutza
880625623261118464,guillebriceno_
32159476,RodriguezManuel
281217409,liaquintana
id,screen_name
268319976,PC_JAL
902515562634510336,Gladysmariqu20
216758458,crc_gonzalez
536696839,cata_cabzas
575279129,I_Daz
939008659,pcestay
889323785098317824,WillyMo30854589
59669273,Egon_Schmidlin
816838834562465797,BosaStacey
107596717,Dany_Gilberto
54073347,sarmiento510
96843149,nuevaizquierda1
157916956,deadmantetris
118588366,kellyjusticia
274063018,alabarra
41899367,JulioVarela
1425008576,JuanArturoVega
907409739662766080,jjcc_desec
44358141,LaerthSILVA
33911528,Geraldine01
305376925,rodrigortegaf
858787211650764801,Piacastilloaa
628908773,anamar1706
802326704417112064,p9bahamondes
894720192101699586,EnergiaParticip
89207724,LGnzlzH
2885324873,natalepez
66583070,JuanPicand
902982995254108160,NAndree_
145693168,Panchorios08
837041188637114368,wpinfante
367816929,elojoatento
386251321,LarrainAlvaro
1284392318,mack_urtubiar
95961880,abertrandd
1340310607,cron1411
328595748,ZurdoCruzado
3625687937,AxelSugHH
2263408873,GuillerL17
234595372,Sturla26
882694593510346754,AraucaxGuillier
720702656885428224,PezoaDabeat
331426500,bubonico
714882410,RbrtRoberto
31819408,CathynaCathona
160430220,AlamiroCerdaM
109100008,pepnavarr
773537793674977281,PedroSalasE
2893865895,MGuimpert
3216877655,jesusduranw1
118667043,PerroRamos
91851287,CarlosGarcesb
4251182721,OsvaldoVIVE11
548874287,Luciano_Jmz
181804296,crlosparker
431990206,TomasAndres_20
906657187455434753,GenaroSotoA
293219200,FelipeCoronadoS
855813117888135170,RecoletaViva
899041661854109696,GuillieRegional
106855666,Rip_8
126528164,newyorkgrimaldi
126434587,GMPent
123323074,sanchezluengo
877191935991193601,GonzalezLopez_R
168011297,elkurosawa
124876294,Sebinoo
68573131,saragalvezleon
162209093,cogodoy
157187318,atejedaa
905730935332642817,dannycaralf
212057438,L_84_R
611430427,crismora1999
160239047,mnetcl
85699642,josepepe1994
757646887184900096,eduardohuenteo
102656472,veropinilla
68826406,Kenincerda
129774305,MarianaThamar
785401112,Oficinajarpa
63796828,verified
14611550,lizama
156629231,Rodvs23
325718992,DiegoRivera36
4137889150,claudiarhoz
879799293938475015,MunozDesgro
105279654,1panchojimenez
220790015,peter_ossa_
2801202399,CarvajalgomezCa
903334322073165824,ahumadaedo
910258838,JoseFuenzalidaG
34269533,Papertalo
188839099,Aleceresep
358518184,_la41_
884562882,felipeofla
3218262753,SomosBachelet
784447249585668096,rojosigloxxi
770020178,fantasmainad
1395889729,H3ct0r4ndr3s
67505932,pepechacarero
id,screen_name
40951964,Poli_Esperguen
3409531635,Nairbec39
82912654,profehugo
327605126,cricocastillo
70423931,eleytoni
905217440447127552,VincentieVelen1
899662582365245441,juliaphidalgo
182693639,vinostroza88
277664351,undressrm
2464761780,villaroelsergio
872536369628950529,aller_me
741044469789790210,ParisBrunetti
4760470211,Sebasti56327691
871567584860286978,S0l1t4
3351042245,VctorCastilloL2
413608721,enfermero_profe
1143521432,Camilosky22
733347995949883393,chiloe_ancud
4858568368,Ricardo13409614
1659101174,1982_vito46
694653713437294594,panchotorresq
3239784699,AbogadosPC
907075565106147328,danilor50vivas
2857571285,EveMunozq
123723499,alita_ob
48385578,ptapialavin
907061464481107970,Albert_mreal
1195915585,_morgadomelissa
556172145,Marialuisa_56
263348652,hiperick
157191802,paul_araya
3187224346,PS_Osorno
368090055,BarbaraCtalina
734410535094083585,voigt_claus
834426228178300928,AsteSandra
353354481,RICAMPU_TWITT
112825342,Johnquirozcastr
196774962,patricio_max
106493631,lorefurche
538290204,claudiaquilpue
273072795,Comodoro_
97118052,hasa72
763198992486375426,CMargamarga
751801439694053377,PPDlosandes
2438398773,edgardoantoniov
903964519537487872,GuillierChoapa
859567283630419969,ManuelPrezGuer3
126155126,luis_feli_p991
57092821,ignaciopino
76631766,dbeth2001
372005491,caroalvarezzzzz
34787008,peponafink
56500942,eliperiodista
157526752,kmila_hernandez
450108437,Nico_pve
845760788564512774,SecOrganizacion
874402512291450884,ViviNorambuenaB
153220849,paulisoriano
14159461,wakeUPChile
892135155518910465,KatyDiputada
864167508772892672,Axel_Poque
888944232618131456,Luis94188890
145316521,marchelovargas
191108544,RodrigoNikyo
78739629,coneingeniero
896851244698021888,MarioGerman54
52076129,carlagastal
226373739,eugeniobruce
9869722,Alepoints
903026378903343110,Piagutierrezs
857211921191325696,togloriaramirez
123360561,tilocalar
361519645,angepeirano
34516935,cayitu
125213284,samtallon
176984950,GonzaloHenriq
114073364,LUZMY_POBLETE
109452106,paolachavezm
154898073,rodrigogarayp
4863793989,ReginaJimenezG1
726950327681966080,vicvegari
74056625,reinaldoberrios
758261360,LorettoOro
19161501,BulldogV8
552779030,tributoman
108787030,ClaudioNunezC
901674579189534720,CiudadanosxG
888854294254034945,50tonesxG
1627783321,lupalacios_luis
73534414,waldocarrasco
88055985,juanckarlos
8109212,caamano
118486817,dany_acevedo
105492332,Chico_Romero
221098529,PsEFV
4425952048,andoterok
492011384,Jordilt
563438315,zero_ap
104811467,claudiovivog
556981627,Fdo_VasquezD
id,screen_name
54342529,vihucar
100879224,pazmona
35489764,menino28
160373002,JennyFernandezC
68499682,HMorenoY
2562969633,verocristyn12
1273996381,susanaejecutiva
589601785,schulbachjohana
158029366,nenna_li9
573866423,BenitezHC
231971502,cyoyo1
882332978168385537,Angel30379165
3070812177,priffoleiva
883678504742789120,YanezLemus
132212935,palapu
739835145000226816,Mayfrost1SPA
324447694,RNuevoMundo
3088741210,UrriolJose
72655706,rodrigosuazo
530805433,monamonik_
898724439801692160,EddieSherringt1
262009294,jpgajardot
1419171656,GacituaRoberto
3377723703,paulinadardel
487822632,Ptrcm1
120868091,jdberriosm
263635711,jchiffelle
242952490,fischerps
101750384,alejoparedesj
72409231,LouisCattalan
65908333,CarolaMerinoR
4871864068,aclencastillo
135313867,TomasRioseco
2377977947,supreme_klau
813632911429799937,NucleoSAllende
361656518,Vladimirpelao
1169218309,ManuelMartnezS1
164270313,ManuelLeonSaa
4878880365,lcanosilva
308467061,PaulinaMaricel
2709144298,vdjosemiguel
903268838355107840,portuscore
124887784,munozvillasenor
97722284,ehn777
2253213650,VozDeToco
902179642802622464,QhapaqNan_Chile
102259085,jhuidobr
426687720,ale_romo6
284101731,purpleamichi
2421175117,Quekacle
877557070203113472,Profesonalpr
1470491688,castillo_edw
349358429,SandroGaete
337294810,M_riveraM
85494941,ignaciocaceres
572294715,poshita3
90258385,AlejandraPozo
152098344,hugoreyesbaez
323997018,LuisLopez161
85907650,garridocrino
182216139,scheloooo
4787303439,politicaflor
197548246,pbaezazamorano
350518034,El_Copernico
214267950,julio_farias_
57539563,Corvalan_Crist
903602082883751940,PrensaEdson
93399861,paikea02
880182535174709249,RosaBarraRojas1
340660371,NucleoMBachelet
723527882,VladtePestVevl
133124076,jlcisternash
1217206650,tayvasilando
4267368155,CulturalGM
352023216,Pancha1964
1273139708,jota_ese_
77291686,flopezpalma
633036376,Antonio3spinosa
69704201,Estefota
43779286,purospalos
161776331,RxPey
420151839,_Dimelo_Bonito
2820311853,walle753
118815630,ddelpiano
124491071,palomapicasso9
894408119400398852,Pino_Victor_4
621386279,krescente
465560229,sole_cjara
820411535302463492,lvaroheredia
3110791389,edodelnorte
34040694,janolivares
139699855,Piureman
851959382749450240,IndCiudadano
102706866,ElSebadelTuiter
550328027,Fergajardom
893527349681160193,CCouratier
3198083657,gabopalmaojeda
307083909,RositaLux
78781517,roarco
118550057,Nati_NH
id,screen_name
2549329689,BascuanRossana
849059833127030785,Claudia58809783
902331783596953601,RosaSaav1967
904473321445711872,marisel47450989
102360638,jvalencialab
526521128,gonchoph
177810943,hardymuller
8216252,ManuelParedes
253661329,epistemolo
870779331613741056,VirginiaGzlz
106285575,trinitroni
1270029518,pamemarpau
170083781,shamuelolate
136438161,mabsal23
137973012,7poleras
705195302,evemagdaleno
820411015988912128,Alfredomontane7
580493674,psanchezbarria
222439734,Js_Recoleta
55351229,CALU_PEREZ
153596787,Anibeckm
350409189,JulioManques
43651619,JaimeVidalAroca
90066214,Netoli
34170171,osanhueza
223928191,raulgarcialagos
116614956,EstebanPerezB
99797552,Miguel_Jano
496321112,Vitoko351
1155856945,hpozod
88725424,jorcastaneda92
49776548,elpato_sandoval
102756603,andreealeiturra
126154836,mpazcasanova
129051590,GoliardoMayor
460717208,giani_hernandez
80752732,nicogss
1570872440,LuisCaprioglioR
4854050669,lbo_noticias
819004183915429888,RedGuillier
1729527570,jalberto2208
81469372,Moniartista
59952112,MarceloMoralesV
48008445,Gabanargo
2584769496,AndreaRosson
150252018,zamoracarmen
142112849,Sonnia_Elena
1167233264,EleiShagy
2515933746,Alvaro_SepTap
10882072,maviles
717330170131177472,NathalySeplved2
44632616,chika_camila
159938178,adolfeduardo
236939988,danirosasf
30857923,aldoduce
4872140788,CamusSergio
297590931,GarabitoLuz
742342220418846720,amantedemimisma
570295798,ValeriaManriqu3
3114534675,fabimarill
18926710,gzamorano
844196876941492229,YolandaEster07
40196265,RicardoScheleff
78153321,alejandrosajor
108949386,pilarcis
178849800,eduardo_vitalp
759263536572923904,elquenoespastor
708671320,claudioviajes
2784119199,claudiomoyag
96049229,athos911
150230549,fermontoyag
185495489,EliseoHuencho
3351482836,AraosFernando
2828726070,PS_Antof
104570716,taromercado
1163643884,luisretamal2020
889172421386940416,ApoderadosxG
754071020831670273,cristianonateq
105166293,lzentenom
371890073,liliortizbreve
239920430,ISADICE
122829551,kras_18
378393483,luuuzbella
756210414170415105,AcunaBarri
901873696020811778,GutierresAmanda
92541516,gabrvu
2562080563,McoVtrio
631381926,LALOANDRES1987
109019884,briones_roberta
74827156,jenunezv
150377319,robcanc
101525131,pancho_riquelme
4659048683,HectorLigarius
1952505474,polombina
305947412,Sofia_lma
104918852,patoquiroga
897993994701090817,AntonietaLueng1
160188777,gatopardo51
890915320084541440,FredyCanales4
423019007,Kelinagarcia
id,screen_name
116848379,JChilote
302375832,Milodon30
46669273,fseguel
904431657826078720,HayatiMarcela
205906332,Salvadorconcha
143616685,patita_51
18104066,manesalamanca
15663205,vmontellano
43243488,arbasualto
155322260,VioleDevia
2681440749,pdelafuentej
865522045,mayteo1969
148572345,rulospierre
100021767,hugo_mora_c
181966247,MarcoAntonioTR
393480407,marcosv75
1331789846,MPialfaro
700810469729292288,psriobueno
79884634,pedroaburto
61293162,Batalle
737119806885924864,Nicoechevers
92592477,afuentealbaf
326391379,caroruizrod
59374836,bernaic
130958064,mtoledoa
233331261,gmoraleszamo
1020525121,_benja_miranda_
51887937,Usuario106
219800313,Mileva21
524411318,patyrovira
772961738513874944,luiarpi
791660978207358976,jovenesconlagos
80939686,Catalinamoyas
344968541,Melinapax
96662877,elpeka1967
838712252,franzmohorp
903971239194226688,MarinkeNercam
96889467,Mauricio_Galleg
97566295,felixmercado
140953488,MigD2010
45205132,paulijimenez
173314504,Mellbita
129992341,Directoalgrano
874071912149917697,Primas_Guillier
314259527,daflorencia
119265563,gc_marines
885914386073870336,educacionps
196802994,ivanexxx69
104357575,humanoide_sss
972607124,cesarhuenukeo
712410126234337280,mas_estudiantil
884917328831533056,Margari61362415
712251639445516288,SecundariosMas
778674493,andipaza
712415380573184002,Diversidad_mas
712412635292106754,masmujeres_
732294973639565312,Claudia17701861
379504226,mariosergiou1
884164224393637888,ClaudioSilvaGo5
39945889,Marce_Delgado
586602733,rubenast2012
889595544515076096,GiglioHyatt
70846520,danielsalas27
881116827350429696,CarlosFleite
876877221599866881,OscarAn54237345
730828293109366785,RayenEspinoz
157128883,IgnacioIriarte
4839634337,parrhesiazomai
134921712,mariostappung
1918753087,msandoverges
47769594,Worges
583504191,arubilar19
166239053,DavidHHenriquez
4889433903,MarcelinaPez
1368603847,ElSalgadoS
34632650,miriamvn
892935665062686722,Atria_Diputado
62419006,Anitaprensa
634941318,AracelliGomezG
55339853,diegnico
72453989,victormandujano
275234191,oscaromass
67489554,maryghenriquez
887833482218680320,Edo_Castro_PC
3048257804,SeronPancho
66273656,Markuta
325291568,Scatears
791666293741129728,NublexGuillier
1463562672,cherkan77
158764524,macamedranov
89339294,fredda1
792525946578501632,AgripinaDulce
860149180907565057,pulso_said
2352431484,Solertm
226610146,JParadaHoyl
103884640,Renemaster1
762012341277982720,Monse_EscobarC
3370174191,rodriguzricard2
195354054,soledadbarria
459413222,jazmingrid1
id,screen_name
106121999,harrybaileyv
218936293,paulinelissetch
786753991485091840,GuillierJovenes
611298954,jmpenailillo
3090351,emaldonadoayala
21748578,rodrigorivera
2448601957,SusanLetelier
216700270,Bfreirea
517950295,LorenaPohl
819008307805491200,OrlandoRetamal
710316313231671296,fdh_2016
26775629,BorisDevoto
899617781758427136,HurtadoYarella
224039209,lucaas_22
218847622,cristian_arave
65131520,pmecklenburg
3052711135,gecarvajalm
174935879,gime_berrueta
891128496159936512,Alejand84154224
263116852,ISENTISP
241275292,estefabs
871509463425048576,mejias_rozas
2368017723,javitaylosreyes
119187011,juacorobles
2317656774,jplefian
181559563,RutAleD
226256673,romi_bajbuj
1367616582,paty_arandad
2442153124,samufer21
903712345641320448,PDemama
904431443753000964,VictorLlanquil1
890813640592502784,olgamyriamdiaz3
58965697,andresoyanedel
2242897992,VxHerradura
327434542,claudio_laram
574991103,anmavimal
61122107,cristianruizc
96683727,jalvaradof
216019646,jpujadot
64826965,PECasanova
256471266,tamborfuentes
170530785,laforch
899657715106140161,Jacquel449976
3004164202,benjanunez6
90298952,Mityviveros
891995996632363009,JoaquinMch1977
890920505208975361,GuillermoHuent3
904162891179462656,ShariffManzur
625769213,FkoVaras
1406511858,Rutgia
556400560,NoradelPilar2
355077324,lettiane10
906241555534684166,JoseMuo02664026
903726306407403520,SiasAldo
122117393,oherrerag
50137912,AdrianEduardo
345634178,rodrigo_quiroz
847687249701388289,IinoArquero
89509059,Viriato_74
98019611,AntonioArancio
69366857,Maricela1925
735659697643114496,ElWereRadical
379546560,NuevoRecoleta
1339784155,rodrigoleytono
900853060108529664,centraldongaby
237110206,Wilsonparachute
1248064796,guillier
125742076,OrellanAntofa
123674861,pablo211219
117567861,JulioUribe_Ing
1096143636,Pomelito77
622364175,ingridespinozal
119166310,Miguel_Rojas_A
52276485,rojasmesina
905101449465667585,AlonsoSaz1
227799536,mapache33
827256339197894657,VictoriaNegrn2
486904088,ltuitpredispone
817143117170221059,FredyHans124
817878350559584256,pardoquinones
409652948,ChaniRossana
1388547853,Kalydanita
12451172,voceandoutopias
193102574,FANSCAR
538525576,Felipe_C_D
1096883989,Rosamel77
905100275328929794,troncosocristia
24567948,panchovelez
1176606018,panchoguerreroc
72151996,brigadachacon
357548239,arturocqg
209595501,cucho_saravia
352736415,Rgonzalezoyarce
153509272,H_Soto
827324298884947970,ayalasaez84
3352738798,HdezGarces
110439677,TatianaValpo
1936204944,cristian2671
264802697,carrenoleo
863445622191534082,MaculxGuillier
id,screen_name
104040386,FcoJManzanoUC
2701266920,JPPDMacul
742074592328585217,Plutoniia
1173933768,XimenaIsrael
252679927,crisotog
370980405,rsaureyes
214261329,ccofrelota
142789511,Tirolocomcquake
165816103,Rodrigo_bcerra
201954091,damblucy
335601740,Ilieol
776888134223003649,ricardoparrach
3012139217,Fneiraa49A
325786098,UjagainLopez
424221768,IvanCifuentesG
330120717,DagobertoGarces
1018730526,tatiana94516038
848402601687298048,IgnacioNikolic
337191857,PedroCordovaC
58566278,ftorralbo
53439367,pamelarivero
50884545,csilvag
169392214,Taniamaca
60632181,CarlosGCT
154527640,Lajismo
317342231,dafneulloaperez
85487870,rvillegash
3363905589,CoppoGalaz
177286796,gabriel_benelli
1592095813,chileninos_org
151080412,Toto_Torres
179266155,vinadenuncia
304786658,SepulvedaReyes
844610602345615360,milenaeldan
402967031,AlvaroChamaca
22796970,marielahm
90985318,Ale_Basulto
2187344640,RobertoValder10
129695166,Ariadnazu
1510922288,pmonjereyes
856816809151954944,alejo_alediazcl
882868968721182720,vitoalvarado89
104210159,sam_navarro_c
2719883923,tangueroDF
136264313,erikas_soledad
44734353,dbenitezpiraino
248258062,juanforch
17651588,fitoyin
330694820,Alexisflores21
211872050,altoramirez
770304371536134144,GaeteConcejala
103755120,rodrigooyarzun
166613687,jorgeivanpalma
851080372481912832,MarcelaA1R
896725969138053120,Lucia57752691
69401174,MelissaMallega
71650076,lysetteh
900794413663780864,IrmaDiputada
4153977735,jakito_vo
536808501,ChilotePs
2185117925,snorambuenas
137879547,Rodrigooleafaz
865306060470571008,LReinaxGuillier
1695543680,hardis92
167062557,Fernandorapc
106506120,enriqueinostroz
6274332,onetabo
15482218,titomedinaneira
277804378,tatymacarena
2312091,huichalaf
58880708,IvanFranchi
1887115826,Kaunaz_
150885428,pablomartinezn
4302642132,holasoy_eldiego
56446159,MilenkoFranulic
872044130,EmmaMaldonado12
58089828,Munoz_Baeza
38006923,sebarivasv
70999559,mmanriquezc
80126490,Bjul
51787678,lalo_deferrari
118231392,arlettegay
73232563,Danielmelochile
2921603188,jose_chemane111
156314989,joaquinbascunan
189702499,Ge_thO
18097205,pepepoblete
148889661,charolastar
274507310,melisacarva
74196078,stefanlarenas
37008868,PatricioTalca
182843681,guzmanclauale
4423641497,jp_alarconV
764493016283357184,thefomest
3437368247,padmegabriela
244245709,enoch314
350040424,cami_carrascoh
83933812,melissavarasm
2245435722,dprp1447
167338096,andreadesnaits
id,screen_name
744558842311237632,tessadevincy
96150433,MVMNews
804054757551775744,CelestinoSauced
753269619066929152,SellsCameron
89535293,jc_292
60369259,veroaguilera
859608273841991680,CamiBrunaF
870647259318423554,frnmrls
3921535276,makreve1981
4764962875,Bespinosariq
348852657,Reca_Andreita
394674318,AhumadaCTC
26254113,fipebm
300499402,JUCA_ZAVALA
40881938,difamadores
76982124,raguayor
129076105,j_molina_a
3063139553,claudiofasenjo
704318019762266112,InternacionalJS
150105555,Angelicampos
3432854260,daltoncamposs
179772666,BRINDODIJO
165580924,mavargasa
44655088,cesarchillan
1327117268,rodrigo_cosso
887102135577530368,Seba_Gonza90
353121402,Cejoand
793152978,FINCHCLAUDIO
312084580,mjvgch
728019655302897664,polletcilla
149637519,cborquezg
88556839,lanicolabarca
1439010001,AThaaN_Adel
177716653,javieraeq
577262604,HectorUrbano3
904887342665781248,X_Guillier
335102262,LaraMarcial
50188731,RodrigoAtenas
117630247,dhojman
2363365448,PLEMUNAO
537229464,koopel1981
2737826566,Dani_RivasE
75205450,LOPEZMATAMALA
1345107902,UrizarDiputado
93295837,gabrielromob
2976240586,_alfaro__
186050242,TitinaAlcantara
902923674646450176,Mayali_Guerrero
333782542,GiovanniSemeria
61195119,pancho_pizarro
75390844,cmonges1981
300035810,rasteban74
1550628373,Estevez_Seba
135609631,Barbara_figue
184938889,rolohl
903034623239884801,Claudio19soza
3394704551,frmtbz
263659261,cdiazruiz
52226422,Jose_Roa
103317758,Vianca7
796465369321877504,BastianBB2016
59877199,maboxp
877033195451154434,ProvixGuillier
3222682402,PCPROVIDENCIA
53710820,Alexisahumada
123905001,jessymorin
155053712,manueldaniel9
133151836,JCPradoG
1667558616,sole_40
1388536680,PPDNunoa
64507472,felipejeldres
3397140389,jplaluz
88314275,lornavi73
90529583,LeoPerezGalvez
1355163655,martinezleivacl
939572970,misabel_diaz
51646534,halbornoz
382291516,IriarteCORE
730746356390895618,PPDLoPrado
109282281,dr_lopez_mv
289907813,ortegahernan
256286483,morales_1326
827623586844311553,efeneptuno
502307685,nicovegab
175903790,rsandovalgangas
119242589,IsaRojas13
1500126607,rgomezmarchant
52245227,dmanoucheri
270120826,jotapinoruiz
80428102,vramosfonseca
169979854,Hugo_Gutierrez_
113618190,pazdelamaza
776669010,MerinoLF
896817100752379905,Polladominga
207317830,CristobalEnryG
225592440,Noise_Head
2173379471,mortega98
344843055,EriccamposB
898692832961196033,donjorgito1
50499909,ruben_munoz
id,screen_name
264135552,alarconsanhueza
895795619180285952,faguirre0281
97795321,aleriquelme
890285428665987073,Claudio74754094
100475514,palomasanz
105172249,Kari_Ace
1311828840,anibaldonoso1
100593792,suechenique
67580462,pipocarvajal
146542753,danieljadue
4120649002,Felipe_Munoz_H
31154046,smaturana
129532816,roberto_carcamo
53381352,veronicaacha
51694363,cmatam
51300927,nicolashurtado
2668393594,SenadoresPS
195544527,karydelfino
58517813,yerson_soto
263803286,misheitor
56408263,rsilvaje
381085505,aus1_
62373091,walsaez
40872015,PaulaMendoza
55066273,guillemarin
352059535,rasphius
18635133,jorgeggporaqui
88192142,SIEBELIS
166848569,daraujomorales
37978929,tv_mauricio
42545082,AShieldsM
182688989,ovallino77
343138251,car1osvarga
902990134521585669,nunoaxguillier
2852955527,Carancho_veloz
516844848,dkubotarojas
899854097536491520,ChileDespiert0
1945176036,Munozortega1999
956390911,carmenelecaro
100128187,riffo_marce
754466015258476544,brujamargarita
154375417,Daniel_olguinv
158588730,compa_pablo
58557652,alejopeci
2726697225,rodrigoparr1
1656173400,mv_libre
524488231,nnenick23
614481085,jano1376
119587612,ManuelTalka
464881454,edsilma
99274124,FelipeAlvearov
70442935,CristianValle
126414195,ejurevics
146153278,_JoseAlvarez_
135300575,mafeku
122065565,HRVV
883044637149147137,MaxiMoralesss
89250279,AlonsoFerreiraV
66170421,mverdugos
1202518794,nielapax
48723052,SergioBazaes
3667059387,EVAGABRIELABT
20684934,hera1561
66748971,joeheimg
39182648,RomiCampusano
155718146,zarrizarri
52113198,scf312
3385440183,jbaltrac
1891485091,JuanManuelMino_
237955018,rgf1946
366858424,Faby_Fuentes
300698252,romachile
185837860,givartigas
66488544,AVargasConchali
46305902,cathyleon
182854815,lauripizarro
56173061,dmlynarz
179294643,enfermera_PM
154140333,ernestsepulveda
107302116,a__herrera
37739920,angieoyarzun
40350888,mberriosh
36156654,edgarmanuel
105559105,matome56
348704663,serge_qu
73312997,marcelobersano
271682602,RomySaav
1095646153,La_Verota
186269405,iborcoski
94892741,Any_BS
73235757,jaimemondaca
763225890461454336,NellyArriaran
1378179463,VtapiaTapia
231912995,Pablocister
227561560,californiano20
167974585,franciscomeloJS
223018376,marcelogestrada
875100564140445696,AndinoXGuillier
1316153833,WilfredoHuM
230290213,JoseChacin017
id,screen_name
58936960,JuancaSoto
15757330,jaimearaya
339135538,Juventud_PPD
791408762577879041,soyadricaro
106185184,jaimelopezg
258895053,oficinaprensapc
3387682366,NuevaMayoriaRM
365769645,NuevaMayoriacl
977107987,JaviHausdorf
875041012653199360,FuerzaGcl
4514239108,FDLA2018
778253057788354560,SecGral_PPD
240632827,Solonia59
866697001207037952,GonzaNavarreteM
2529893524,alemarquezcl
55355806,alibuyc
104871735,cuervo1975
1072054842,Elagostapia
2916268066,pschile
139835896,prensaps
724886060,OdioRabia
857456971,Neo_liberal
2546173602,MarmadukeGrove
3289409261,llegosocialismo
168765564,JS_Chile
103594537,IndymediaChile
534810481,EnemigoInterno
286009719,Donde_Estan
710831396584034305,diceladerecha
2957427785,CuicosCuliaos
150811515,ColectivoJS
9005192,tomasoski
196767160,PabloReyes_F
889175258686779392,GloriaVerdugom
215285523,mariocontador_t
903771756191784960,ProfesXGuillier
81949573,priquelmestepke
2950052621,alyhr3
91250705,CarreraConchali
783869830692823040,JovenesGuillier
898387783,Josetosarmiento
110032215,PauloSaldivar
73150579,edusan1979
300874121,PPD_Chile
2500105259,AlejandraPCarra
3114711195,pichubast
1104021420,PCdeChile
110742271,katherinea26
369862186,didierlucero
321541892,MarcelaCovacich
121604993,jjcc_chile
1356760598,FRIDAKALHO
876897866387738630,campana_radical
888866435560329216,pcarcamoo
118175314,SofiaVaisman
454453662,alfadeltagama
369253179,barbitcast
866473474230976512,JJCCSanFdo
705278228,ElPeriodistucho
865015941654040576,CoquimbGuillier
901622187530100737,CastroxGuillier
36225846,OviArroyo
812462023,RebecaGaeteS
367776813,BPulidoSalinas
501807701,FDIAZDELFIERRO
380926280,pattytaxista
83085904,ramonlobosvasq
889847628686659585,GPresidenta
46203804,rreisberg
745011051524145152,doriskern65
177351382,godness_bunny
899798950978387969,AnglicaVillarN1
70193121,lapizmina
302370230,Maly_Jeldes
3431683011,IcampusanoL
774492082841018368,eldiablochileno
111021073,cfuentesveliz
1635858990,messinagodoy
700753983330131973,norteradical
22309781,FelipeParadaM
130568989,josefinadamaria
773499173320744960,Ninisawa2
703792830901313536,AF_Medina
844775869600051200,lalo_1944
849456124696854529,Guillierdiver
188131190,crhidalgo
88955940,lauralbornoz
794613426140180483,patocerdaciudad
819579711856738304,Cgloria10000
12098842,cadaunante
724417149301874688,UrsulaHidalgoR
221464431,yaznapaola
35997764,patoibarra
54297966,Pekosalinda
155226692,LeoSotoChile
120314537,Javireyesj
43950920,PabloBivort
66792329,VictorTapiaA
109998408,TANACHILE
375424802,m_isotomayor
id,screen_name
519914658,Viejachucheta
2644622109,Alfredo1996Asce
904346295598493696,BiobioGuillier
59592010,urielgonzalez
835719074,esesantosce
68050614,flaviodiazbrion
2886910959,rzlukas07
70491672,juanucolautaro
383027066,hespinozatalca
548757389,bancadaPSchile
162742969,valeskanaranjo
461738667,Danrebolledo22
893024167968346112,ClementiJuanfra
137133866,dsancheztoledo
59671286,jobecerra
195265860,gpfalcon_cine
104521651,CLAUDIAVARAS
82553230,fharomeneses
54432192,Polatown
377355940,GMODONOSOR
112416401,tfasching
587656803,fco050479
264458164,Clodoaldo1970
2570125658,Axelndey
19720057,artefuckto
72602563,ehtoledo
572228090,loregiachino
174331827,echaparror
337842560,jppacevedo
3430771857,jrwernerm
76078565,israferreira
788209308056031232,Gus_Rodriguez26
26075163,romirandao
444381011,NachoRojasC
99747000,RggaeWary
33561233,ipaez
3392737169,Grillojuris
38749183,Sebix_ultra_p
3328574543,morenonaturaI
294887038,Fel_Vargas
108705773,nelsm1
132776347,ALEMATURANAC
142227500,susana_zz
778777630443184128,PintoCaterin
104175029,SERGIOBURGOSA
733955941,gallardobarria
890739231395635200,FrenteSD
294638486,JTapiaRodriguez
2802678860,elsiglochile
106787205,alioshama
88851639,pbmartinez
1479544514,danielc672000
433032050,ita92007
319894472,WladimirPulgarG
62047319,nicogagliardi
827968889942323200,JuanQuinchavil3
103421965,Pameva72
103689129,pequelu24
750948128543612928,rusakovaelvira3
954562885,SofiaMunoz_R
133033837,Jorgedelpozop
612733280,ppaillacar
1340410524,IturrietaLuis
3019782501,YYGUZMANN
1968303236,JSLosLagos
139947252,strokes_1251
2784256912,juanhernan23011
904357319848456194,MaryMarq2017
144296654,NCBelloO
3233955371,BascurChile
47625823,OscarGodoyH
729008955150761986,VRA2016
1335228152,PPDStgoCentro
3095014429,PSGuillierArica
904150206924685312,PCastroCerruti
1434023324,pepelaboralista
2423081856,Amaya_Elgarca
743101726044098560,JMAS_Region
231415338,javiera_oliv
264453735,johannwegmann
718220514515427328,Mario21405205
106203734,robertomissene
351873853,max_stevenson
776509892349857792,JRRBiobio
146951190,marifull
864514655305289728,DigitalGuillier
43752418,Dani_CabreraC
88478494,mauriciosaezo
302127831,MarciaDiputada
10256312,ciberclaude
123279280,carolina_tamara
871556380003622912,PriGuerraCa
47483420,nachoerra_
