<?xml version="1.0" encoding="UTF-8" standalone="no"?>
<!-- Created with Inkscape (http://www.inkscape.org/) -->

<svg
   version="1.1"
   id="svg48"
   width="1016.9821"
   height="1016.9821"
   viewBox="0 0 1016.9821 1016.9821"
   sodipodi:docname="logo_Ǧ1_01_clair_sur_sombre.svg"
   inkscape:version="1.2.2 (b0a8486541, 2022-12-01)"
   xml:space="preserve"
   inkscape:export-filename="logo_Ǧ1_fond_Duniter.png"
   inkscape:export-xdpi="96"
   inkscape:export-ydpi="96"
   xmlns:inkscape="http://www.inkscape.org/namespaces/inkscape"
   xmlns:sodipodi="http://sodipodi.sourceforge.net/DTD/sodipodi-0.dtd"
   xmlns="http://www.w3.org/2000/svg"
   xmlns:svg="http://www.w3.org/2000/svg"><defs
     id="defs52"><filter
       style="color-interpolation-filters:sRGB"
       inkscape:label="Invert"
       id="filter345"
       x="0"
       y="0"
       width="1"
       height="1"><feColorMatrix
         type="hueRotate"
         values="180"
         result="color1"
         id="feColorMatrix341" /><feColorMatrix
         values="-1 0 0 0 1 0 -1 0 0 1 0 0 -1 0 1 -0.21 -0.72 -0.07 2 0 "
         result="fbSourceGraphic"
         id="feColorMatrix343" /><feColorMatrix
         result="fbSourceGraphicAlpha"
         in="fbSourceGraphic"
         values="0 0 0 -1 0 0 0 0 -1 0 0 0 0 -1 0 0 0 0 1 0"
         id="feColorMatrix347" /><feColorMatrix
         id="feColorMatrix349"
         type="hueRotate"
         values="180"
         result="color1"
         in="fbSourceGraphic" /><feColorMatrix
         id="feColorMatrix351"
         values="-1 0 0 0 1 0 -1 0 0 1 0 0 -1 0 1 -0.21 -0.72 -0.07 2 0 "
         result="fbSourceGraphic" /><feColorMatrix
         result="fbSourceGraphicAlpha"
         in="fbSourceGraphic"
         values="0 0 0 -1 0 0 0 0 -1 0 0 0 0 -1 0 0 0 0 1 0"
         id="feColorMatrix353" /><feColorMatrix
         id="feColorMatrix355"
         type="hueRotate"
         values="180"
         result="color1"
         in="fbSourceGraphic" /><feColorMatrix
         id="feColorMatrix357"
         values="-1 0 0 0 1 0 -1 0 0 1 0 0 -1 0 1 -0.21 -0.72 -0.07 2 0 "
         result="color2" /></filter><linearGradient
       id="linearGradient6689"
       inkscape:swatch="solid"><stop
         style="stop-color:#40b2ff;stop-opacity:1;"
         offset="0"
         id="stop6691" /></linearGradient><linearGradient
       id="linearGradient4372"
       inkscape:swatch="solid"><stop
         style="stop-color:#dca900;stop-opacity:1;"
         offset="0"
         id="stop4374" /></linearGradient><linearGradient
       id="linearGradient4140"
       inkscape:swatch="gradient"><stop
         style="stop-color:#000000;stop-opacity:1;"
         offset="0"
         id="stop4142" /><stop
         style="stop-color:#000000;stop-opacity:0;"
         offset="1"
         id="stop4144" /></linearGradient><filter
       height="1.5899251"
       width="1.5899239"
       y="-0.29496257"
       x="-0.29496193"
       style="color-interpolation-filters:sRGB"
       inkscape:label="Blur"
       id="filter1475"><feGaussianBlur
         stdDeviation="50 50"
         result="blur"
         id="feGaussianBlur1469" /><feColorMatrix
         values="1 0 0 0 0 0 1 0 0 0 0 0 1 0 0 0 0 0 50 0 "
         result="colormatrix"
         id="feColorMatrix1471" /><feComposite
         in="colormatrix"
         in2="SourceGraphic"
         operator="in"
         id="feComposite1473"
         result="fbSourceGraphic" /><feColorMatrix
         result="fbSourceGraphicAlpha"
         in="fbSourceGraphic"
         values="0 0 0 -1 0 0 0 0 -1 0 0 0 0 -1 0 0 0 0 1 0"
         id="feColorMatrix1477" /><feGaussianBlur
         id="feGaussianBlur1479"
         stdDeviation="50 50"
         result="blur"
         in="fbSourceGraphic" /><feColorMatrix
         id="feColorMatrix1481"
         values="1 0 0 0 0 0 1 0 0 0 0 0 1 0 0 0 0 0 50 0 "
         result="colormatrix" /><feComposite
         in2="fbSourceGraphic"
         id="feComposite1483"
         in="colormatrix"
         operator="in" /></filter><filter
       style="color-interpolation-filters:sRGB"
       inkscape:label="Drop Shadow"
       id="filter1507"
       x="-0.0072246937"
       y="-0.0072246937"
       width="1.02047"
       height="1.02047"><feFlood
         flood-opacity="0.498039"
         flood-color="rgb(0,0,0)"
         result="flood"
         id="feFlood1497" /><feComposite
         in="flood"
         in2="SourceGraphic"
         operator="in"
         result="composite1"
         id="feComposite1499" /><feGaussianBlur
         in="composite1"
         stdDeviation="3"
         result="blur"
         id="feGaussianBlur1501" /><feOffset
         dx="6"
         dy="6"
         result="offset"
         id="feOffset1503" /><feComposite
         in="SourceGraphic"
         in2="offset"
         operator="over"
         result="composite2"
         id="feComposite1505" /></filter><filter
       style="color-interpolation-filters:sRGB;"
       inkscape:label="Invert"
       id="filter345-7"
       x="0"
       y="0"
       width="1"
       height="1"><feColorMatrix
         type="hueRotate"
         values="180"
         result="color1"
         id="feColorMatrix341-5" /><feColorMatrix
         values="-1 0 0 0 1 0 -1 0 0 1 0 0 -1 0 1 -0.21 -0.72 -0.07 2 0 "
         result="fbSourceGraphic"
         id="feColorMatrix343-3" /><feColorMatrix
         result="fbSourceGraphicAlpha"
         in="fbSourceGraphic"
         values="0 0 0 -1 0 0 0 0 -1 0 0 0 0 -1 0 0 0 0 1 0"
         id="feColorMatrix347-5" /><feColorMatrix
         id="feColorMatrix349-6"
         type="hueRotate"
         values="180"
         result="color1"
         in="fbSourceGraphic" /><feColorMatrix
         id="feColorMatrix351-2"
         values="-1 0 0 0 1 0 -1 0 0 1 0 0 -1 0 1 -0.21 -0.72 -0.07 2 0 "
         result="fbSourceGraphic" /><feColorMatrix
         result="fbSourceGraphicAlpha"
         in="fbSourceGraphic"
         values="0 0 0 -1 0 0 0 0 -1 0 0 0 0 -1 0 0 0 0 1 0"
         id="feColorMatrix353-9" /><feColorMatrix
         id="feColorMatrix355-1"
         type="hueRotate"
         values="180"
         result="color1"
         in="fbSourceGraphic" /><feColorMatrix
         id="feColorMatrix357-2"
         values="-1 0 0 0 1 0 -1 0 0 1 0 0 -1 0 1 -0.21 -0.72 -0.07 2 0 "
         result="color2" /></filter></defs><sodipodi:namedview
     id="namedview50"
     pagecolor="#7f7f7f"
     bordercolor="#000000"
     borderopacity="0.25"
     inkscape:showpageshadow="2"
     inkscape:pageopacity="0"
     inkscape:pagecheckerboard="false"
     inkscape:deskcolor="#404040"
     showgrid="false"
     inkscape:zoom="0.4305"
     inkscape:cx="-29.036005"
     inkscape:cy="508.7108"
     inkscape:window-width="1920"
     inkscape:window-height="1011"
     inkscape:window-x="1920"
     inkscape:window-y="32"
     inkscape:window-maximized="1"
     inkscape:current-layer="g54" /><g
     inkscape:groupmode="layer"
     id="layer1"
     inkscape:label="fond (gris 90%)"
     transform="translate(5.4910196,5.491018)"
     style="display:inline"><circle
       style="display:inline;fill:#1a1a1a;fill-opacity:1;stroke:none;stroke-width:54.4511;stroke-dasharray:none"
       id="circle881"
       cx="500"
       cy="500"
       r="439.86523"
       inkscape:label="circle881" /></g><g
     inkscape:groupmode="layer"
     inkscape:label="Ǧ (blanc)"
     id="g54"
     transform="translate(5.4910196,5.491018)"
     style="display:inline"><path
       id="path579"
       style="display:inline;fill:#ffffff;stroke-width:1.7545"
       d="M 500,1.7089844 C 367.85657,1.7089844 241.0938,54.21478 147.6543,147.6543 54.21478,241.0938 1.7089844,367.85657 1.7089844,500 c 0,132.14343 52.5057956,258.9062 145.9453156,352.3457 93.4395,93.43952 220.20227,145.94532 352.3457,145.94532 132.14343,0 258.9062,-52.5058 352.3457,-145.94532 C 945.78522,758.9062 998.29102,632.14343 998.29102,500 998.29102,367.85657 945.78522,241.0938 852.3457,147.6543 758.9062,54.21478 632.14343,1.7089844 500,1.7089844 Z m 0,58.4257816 c 116.67063,0 228.53265,46.335384 311.03125,128.833984 82.4986,82.4986 128.83398,194.36062 128.83398,311.03125 0,116.67063 -46.33538,228.53265 -128.83398,311.03125 C 728.53265,893.52985 616.67063,939.86523 500,939.86523 383.32937,939.86523 271.46735,893.52985 188.96875,811.03125 106.47015,728.53265 60.134766,616.67063 60.134766,500 60.134766,383.32937 106.47015,271.46735 188.96875,188.96875 271.46735,106.47015 383.32937,60.134766 500,60.134766 Z m -62.48633,22.863281 c -33.0933,24.296263 -27.29762,19.307783 -57.23633,42.021483 31.79289,43.30165 84.27085,66.3541 137.66797,60.47461 43.13076,-4.75117 78.2721,-26.33707 101.74024,-56.38281 L 564.24414,84.669922 c -12.38675,16.111538 -31.07628,27.712798 -54.07422,30.248048 -28.18179,3.10222 -55.87795,-9.06548 -72.65625,-31.919923 z m 64.35352,131.728513 c -216.63634,0 -352.02896,234.52736 -243.6836,422.14258 50.22069,87.04228 143.16154,140.67969 243.6836,140.67969 81.1928,0 150.95771,-33.00022 200.80469,-84.05078 l 88.5371,90.43359 0.7461,-284.13476 -270.7832,0.80078 87.46679,98.89453 c -26.32446,27.44557 -63.49139,45.20312 -106.76953,45.20312 -53.05069,0 -102.09821,-28.35712 -128.63672,-74.27929 -57.16322,-99.029 14.31027,-222.80664 128.63672,-222.80664 50.46127,-0.004 97.46765,25.63095 124.79102,68.05468 L 744.0293,352.81641 C 693.35421,267.29878 601.37517,214.72656 501.86719,214.72656 Z M 506,813.05664 c -29.66274,-2.1e-4 -53.70919,24.04624 -53.70898,53.70898 -2.2e-4,29.66274 24.04624,53.7092 53.70898,53.70899 29.66274,2.1e-4 53.7092,-24.04625 53.70898,-53.70899 C 559.70919,837.10288 535.66274,813.05643 506,813.05664 Z"
       sodipodi:nodetypes="sssssssssssssssssscccccccscscccccsccccsccccc" /></g></svg>
