(kicad_symbol_lib (version 20220914) (generator kicad_symbol_editor)
  (symbol "Quiachip_433MHz" (in_bom no) (on_board yes)
    (property "Reference" "U" (at -3.81 -2.54 0)
      (effects (font (size 1.27 1.27)))
    )
    (property "Value" "" (at 0 0 0)
      (effects (font (size 1.27 1.27)))
    )
    (property "Footprint" "Local_Random_Stuff:Qiachip_433MHz" (at 1.27 -5.08 0)
      (effects (font (size 1.27 1.27)) hide)
    )
    (property "Datasheet" "" (at 0 0 0)
      (effects (font (size 1.27 1.27)) hide)
    )
    (symbol "Quiachip_433MHz_1_1"
      (rectangle (start 0 17.78) (end 8.89 -2.54)
        (stroke (width 0) (type default))
        (fill (type background))
      )
      (text "Qiachip 433 MHz" (at 6.35 7.62 900)
        (effects (font (size 1.27 1.27)))
      )
      (pin passive line (at -2.54 0 0) (length 2.54)
        (name "GND" (effects (font (size 1.27 1.27))))
        (number "1" (effects (font (size 1.27 1.27))))
      )
      (pin passive line (at -2.54 2.54 0) (length 2.54)
        (name "Vcc" (effects (font (size 1.27 1.27))))
        (number "2" (effects (font (size 1.27 1.27))))
      )
      (pin passive line (at -2.54 5.08 0) (length 2.54)
        (name "D0" (effects (font (size 1.27 1.27))))
        (number "3" (effects (font (size 1.27 1.27))))
      )
      (pin passive line (at -2.54 7.62 0) (length 2.54)
        (name "D1" (effects (font (size 1.27 1.27))))
        (number "4" (effects (font (size 1.27 1.27))))
      )
      (pin passive line (at -2.54 10.16 0) (length 2.54)
        (name "D2" (effects (font (size 1.27 1.27))))
        (number "5" (effects (font (size 1.27 1.27))))
      )
      (pin passive line (at -2.54 12.7 0) (length 2.54)
        (name "D3" (effects (font (size 1.27 1.27))))
        (number "6" (effects (font (size 1.27 1.27))))
      )
      (pin passive line (at -2.54 15.24 0) (length 2.54)
        (name "VT" (effects (font (size 1.27 1.27))))
        (number "7" (effects (font (size 1.27 1.27))))
      )
    )
  )
  (symbol "choice_3" (pin_names (offset 0) hide) (in_bom yes) (on_board yes)
    (property "Reference" "SW" (at 0 5.08 0)
      (effects (font (size 1.27 1.27)))
    )
    (property "Value" "choice_3" (at 0 -5.08 0)
      (effects (font (size 1.27 1.27)) hide)
    )
    (property "Footprint" "Local_Random_Stuff:config_3" (at 0 -9.525 0)
      (effects (font (size 1.27 1.27)) hide)
    )
    (property "Datasheet" "~" (at 0 -7.62 0)
      (effects (font (size 1.27 1.27)) hide)
    )
    (property "choice1" "choice1" (at 6.985 4.445 0)
      (effects (font (size 1.27 1.27)))
    )
    (property "choice3" "choice3" (at 6.985 -4.445 0)
      (effects (font (size 1.27 1.27)))
    )
    (property "ki_description" "Switch, config_3" (at 0 0 0)
      (effects (font (size 1.27 1.27)) hide)
    )
    (symbol "choice_3_0_1"
      (circle (center -2.032 0) (radius 0.4572)
        (stroke (width 0) (type default))
        (fill (type none))
      )
      (polyline
        (pts
          (xy -1.651 0.254)
          (xy 1.651 2.286)
        )
        (stroke (width 0) (type default))
        (fill (type none))
      )
      (circle (center 2.032 -2.54) (radius 0.4572)
        (stroke (width 0) (type default))
        (fill (type none))
      )
      (circle (center 2.032 2.54) (radius 0.4572)
        (stroke (width 0) (type default))
        (fill (type none))
      )
    )
    (symbol "choice_3_1_1"
      (rectangle (start -3.175 3.81) (end 3.175 -3.81)
        (stroke (width 0) (type default))
        (fill (type background))
      )
      (pin passive line (at 5.08 2.54 180) (length 2.54)
        (name "A" (effects (font (size 1.27 1.27))))
        (number "1" (effects (font (size 1.27 1.27))))
      )
      (pin passive line (at -5.08 0 0) (length 2.54)
        (name "B" (effects (font (size 1.27 1.27))))
        (number "2" (effects (font (size 1.27 1.27))))
      )
      (pin passive line (at 5.08 -2.54 180) (length 2.54)
        (name "C" (effects (font (size 1.27 1.27))))
        (number "3" (effects (font (size 1.27 1.27))))
      )
    )
  )
)
