(footprint "D_SOD-123FL" (version 20221018) (generator pcbnew)
  (layer "F.Cu")
  (descr "SOD-123")
  (tags "SOD-123")
  (attr smd)
  (fp_text reference "REF**" (at 0 -2) (layer "F.SilkS")
      (effects (font (size 1 1) (thickness 0.15)))
    (tstamp e94e66b9-8176-45bb-b78b-cd3e48b6b58f)
  )
  (fp_text value "D_SOD-123FL" (at 0 2.1) (layer "F.Fab")
      (effects (font (size 1 1) (thickness 0.15)))
    (tstamp 4e5ee80b-3f51-4cff-8b5e-46550f620d92)
  )
  (fp_text user "${REFERENCE}" (at 0 -2) (layer "F.Fab")
      (effects (font (size 1 1) (thickness 0.15)))
    (tstamp 19bd4560-3773-4520-bc7d-4e23a3003dc8)
  )
  (fp_line (start -2.46 -1) (end -2.46 1)
    (stroke (width 0.12) (type solid)) (layer "F.SilkS") (tstamp 6f7b3ddd-ca49-4aa4-8399-528b1f03e05b))
  (fp_line (start -2.46 -1) (end 1.65 -1)
    (stroke (width 0.12) (type solid)) (layer "F.SilkS") (tstamp eb06bb23-e329-41e8-839d-b09eaa5e77c4))
  (fp_line (start -2.46 1) (end 1.65 1)
    (stroke (width 0.12) (type solid)) (layer "F.SilkS") (tstamp 3754a241-be41-4ffe-bd6f-55de8b5f9fa0))
  (fp_line (start -2.45 -1.15) (end -2.45 1.15)
    (stroke (width 0.05) (type solid)) (layer "F.CrtYd") (tstamp 8f3e8b4d-74da-44bb-8ada-bd63f1de6370))
  (fp_line (start -2.45 -1.15) (end 2.45 -1.15)
    (stroke (width 0.05) (type solid)) (layer "F.CrtYd") (tstamp 88bbe2b2-2491-4c25-a8c5-bafd6319bba4))
  (fp_line (start 2.45 -1.15) (end 2.45 1.15)
    (stroke (width 0.05) (type solid)) (layer "F.CrtYd") (tstamp 3427c1fb-ac13-4e37-aea0-6a70aaed6af0))
  (fp_line (start 2.45 1.15) (end -2.45 1.15)
    (stroke (width 0.05) (type solid)) (layer "F.CrtYd") (tstamp cb6f4983-4a62-43bb-b4e0-40e2ee58c456))
  (fp_line (start -1.4 -0.9) (end 1.4 -0.9)
    (stroke (width 0.1) (type solid)) (layer "F.Fab") (tstamp d951ca2a-b012-48d4-a13a-5be54f200185))
  (fp_line (start -1.4 0.9) (end -1.4 -0.9)
    (stroke (width 0.1) (type solid)) (layer "F.Fab") (tstamp aab413aa-f3e7-4136-9b2f-e9f32ce3426e))
  (fp_line (start -0.75 0) (end -0.35 0)
    (stroke (width 0.1) (type solid)) (layer "F.Fab") (tstamp 08957e2e-b866-410c-a960-51306e061dd3))
  (fp_line (start -0.35 0) (end -0.35 -0.55)
    (stroke (width 0.1) (type solid)) (layer "F.Fab") (tstamp 146115cb-d662-4732-bf81-150e6eca37c2))
  (fp_line (start -0.35 0) (end -0.35 0.55)
    (stroke (width 0.1) (type solid)) (layer "F.Fab") (tstamp b57cefe3-3420-452d-99f9-e605b2174911))
  (fp_line (start -0.35 0) (end 0.25 -0.4)
    (stroke (width 0.1) (type solid)) (layer "F.Fab") (tstamp 6a1f3db3-8e74-4fdb-a559-82dc09365cf1))
  (fp_line (start 0.25 -0.4) (end 0.25 0.4)
    (stroke (width 0.1) (type solid)) (layer "F.Fab") (tstamp 49dce4bd-bf83-4cd1-b8d1-f606ae6e187e))
  (fp_line (start 0.25 0) (end 0.75 0)
    (stroke (width 0.1) (type solid)) (layer "F.Fab") (tstamp fa760bdc-f9c4-4618-8852-8c196f611ced))
  (fp_line (start 0.25 0.4) (end -0.35 0)
    (stroke (width 0.1) (type solid)) (layer "F.Fab") (tstamp 8de3adcc-d1e0-4a88-9cac-939a1c0420d7))
  (fp_line (start 1.4 -0.9) (end 1.4 0.9)
    (stroke (width 0.1) (type solid)) (layer "F.Fab") (tstamp e4fde9de-6ec8-4957-8398-db019b4f9c46))
  (fp_line (start 1.4 0.9) (end -1.4 0.9)
    (stroke (width 0.1) (type solid)) (layer "F.Fab") (tstamp 06dd3bed-208c-4e36-966e-7bc4a90b5718))
  (pad "1" smd roundrect (at -1.6 0) (size 1.2 1.2) (layers "F.Cu" "F.Paste" "F.Mask") (roundrect_rratio 0.25) (tstamp 124aaee6-91f9-4a9e-a27c-49046d66db28))
  (pad "2" smd roundrect (at 1.6 0) (size 1.2 1.2) (layers "F.Cu" "F.Paste" "F.Mask") (roundrect_rratio 0.25) (tstamp 0d4d5320-5f74-43a7-a4e5-9f8db2e22c0e))
  (model "${KICAD6_3DMODEL_DIR}/Diode_SMD.3dshapes/D_SOD-123.wrl"
    (offset (xyz 0 0 0))
    (scale (xyz 1 1 1))
    (rotate (xyz 0 0 0))
  )
)
