(footprint "antenna_bt_st_an5129" (version 20221018) (generator pcbnew)
  (layer "F.Cu")
  (attr smd)
  (fp_text reference "REF**" (at 1.9 -8 unlocked) (layer "F.SilkS") hide
      (effects (font (size 1 1) (thickness 0.15)))
    (tstamp bc8cb2a1-1037-447e-9184-aee567bf9658)
  )
  (fp_text value "antenna_bt_st_an5129" (at 7.62 5.08 unlocked) (layer "F.Fab")
      (effects (font (size 1 1) (thickness 0.15)))
    (tstamp f33345a1-c314-448c-b32c-0032f89ba0c5)
  )
  (fp_text user "${REFERENCE}" (at 0 2.5 unlocked) (layer "F.Fab")
      (effects (font (size 1 1) (thickness 0.15)))
    (tstamp 1e531443-8dd4-4f5b-a2ac-b2ea93d0716d)
  )
  (fp_rect (start -2.7 -5.1) (end -2.3 -3.5)
    (stroke (width 0) (type solid)) (fill solid) (layer "F.Cu") (tstamp 67f35463-0ba1-4a1d-83c2-34aa4bb31c01))
  (fp_rect (start -2.7 -4.7) (end 6.6 -5.1)
    (stroke (width 0) (type solid)) (fill solid) (layer "F.Cu") (tstamp 26887f9c-4e73-48e9-9968-93719174b881))
  (fp_rect (start -2.7 -3.5) (end 6.6 -3.9)
    (stroke (width 0) (type solid)) (fill solid) (layer "F.Cu") (tstamp 454965a8-02c1-4f8f-a488-34ed17b56fa5))
  (fp_rect (start -2.7 -2.7) (end -2.3 -1.1)
    (stroke (width 0) (type solid)) (fill solid) (layer "F.Cu") (tstamp 74168b64-c022-4ee7-b242-b91ad59320cb))
  (fp_rect (start -2.7 -2.3) (end 6.6 -2.7)
    (stroke (width 0) (type solid)) (fill solid) (layer "F.Cu") (tstamp 22d48871-2fc2-48fe-8679-e2484dbf0c64))
  (fp_rect (start -0.2 -0.5) (end 0.2 -1.5)
    (stroke (width 0) (type solid)) (fill solid) (layer "F.Cu") (tstamp 0811fe71-b353-44d2-af1a-c2cff1cbf396))
  (fp_rect (start 0 -5.9) (end 6.6 -6.3)
    (stroke (width 0) (type solid)) (fill solid) (layer "F.Cu") (tstamp 6d39392d-a753-41d1-a88a-8e8944b279bf))
  (fp_rect (start 0.2 -1.5) (end -2.7 -1.1)
    (stroke (width 0) (type solid)) (fill solid) (layer "F.Cu") (tstamp 3e192817-28fe-426d-992f-954e49bb1274))
  (fp_rect (start 6.2 -6.3) (end 6.6 -4.7)
    (stroke (width 0) (type solid)) (fill solid) (layer "F.Cu") (tstamp 50354e24-a216-4837-9ea8-314f046fb16a))
  (fp_rect (start 6.2 -3.9) (end 6.6 -2.3)
    (stroke (width 0) (type solid)) (fill solid) (layer "F.Cu") (tstamp b2a47db0-9aaa-4813-803d-f2593765bcb2))
  (pad "1" smd roundrect (at 0 -0.2) (size 0.4 0.8) (layers "F.Cu") (roundrect_rratio 0)
    (chamfer_ratio 0.5) (chamfer bottom_left bottom_right) (tstamp b9e07ec9-bf62-4bbe-a34a-a6908ab0a932))
  (zone (net 0) (net_name "") (layers "F.Cu" "Eco1.User") (tstamp 2816e2eb-dcc5-4d8b-9eb2-1d8b149c1587) (hatch full 0.508)
    (connect_pads (clearance 0))
    (min_thickness 0.254) (filled_areas_thickness no)
    (keepout (tracks not_allowed) (vias not_allowed) (pads not_allowed) (copperpour not_allowed) (footprints not_allowed))
    (fill (thermal_gap 0.508) (thermal_bridge_width 0.508))
    (polygon
      (pts
        (xy 19 0)
        (xy 0.2 0)
        (xy 0.2 -0.6)
        (xy -0.2 -0.6)
        (xy -0.2 0)
        (xy -3.5 0)
        (xy -3.5 -11)
        (xy 19 -11)
      )
    )
  )
  (zone (net 0) (net_name "") (layers "In1.Cu" "In2.Cu" "In3.Cu" "In4.Cu" "In5.Cu" "In6.Cu" "In7.Cu" "In8.Cu" "In9.Cu" "In10.Cu" "In11.Cu" "In12.Cu" "In13.Cu" "In14.Cu" "In15.Cu" "In16.Cu" "In17.Cu" "In18.Cu" "In19.Cu" "In20.Cu" "In21.Cu" "In22.Cu" "In23.Cu" "In24.Cu" "In25.Cu" "In26.Cu" "In27.Cu" "In28.Cu" "In29.Cu" "In30.Cu" "B.Cu") (tstamp a82e4f99-9b16-4ff1-9f2d-54e43d130756) (hatch full 0.508)
    (connect_pads (clearance 0))
    (min_thickness 0.254) (filled_areas_thickness no)
    (keepout (tracks not_allowed) (vias not_allowed) (pads not_allowed) (copperpour not_allowed) (footprints not_allowed))
    (fill (thermal_gap 0.508) (thermal_bridge_width 0.508))
    (polygon
      (pts
        (xy 19 0)
        (xy -3.5 0)
        (xy -3.5 -11)
        (xy 19 -11)
      )
    )
  )
)
