(footprint "config_3" (version 20221018) (generator pcbnew)
  (layer "F.Cu")
  (attr smd)
  (fp_text reference "REF**" (at 0 2 unlocked) (layer "F.SilkS") hide
      (effects (font (size 1 1) (thickness 0.15)))
    (tstamp 4fed386c-4058-4623-a95c-edb887461267)
  )
  (fp_text value "config_3" (at -2 2 unlocked) (layer "F.Fab") hide
      (effects (font (size 1 1) (thickness 0.15)))
    (tstamp 625408d8-9f53-47c7-ac82-6db19a4ff91a)
  )
  (fp_text user "${choice3}" (at 2 -1 90) (layer "F.SilkS")
      (effects (font (size 1 1) (thickness 0.15)) (justify left bottom))
    (tstamp 185540e2-6ac5-4104-bc00-19d9065bb8ef)
  )
  (fp_text user "${choice1}" (at -1 -1 90) (layer "F.SilkS")
      (effects (font (size 1 1) (thickness 0.15)) (justify left bottom))
    (tstamp 2e2330e3-f5cb-4b86-8d10-e7a495fa7253)
  )
  (fp_text user "${REFERENCE}" (at 2 4 unlocked) (layer "F.Fab") hide
      (effects (font (size 1 1) (thickness 0.15)))
    (tstamp 639ac6bf-20b0-40af-88f2-eca85ed09dda)
  )
  (fp_rect (start -2.875 -1) (end 2.875 1)
    (stroke (width 0.12) (type default)) (fill none) (layer "F.SilkS") (tstamp 3ee5dbd0-cbb2-41fe-81ee-f729b328098c))
  (fp_rect (start -2.875 -1) (end 2.875 1)
    (stroke (width 0.05) (type default)) (fill none) (layer "F.CrtYd") (tstamp 3fad4e08-c2fa-4300-b146-54c3736d4796))
  (pad "1" smd roundrect (at -1.817 0) (size 1.617 1.5) (layers "F.Cu" "F.Mask") (roundrect_rratio 0.25)
    (thermal_bridge_angle 45) (tstamp 342b1b75-4a38-49d5-a527-3df9f45e9e69))
  (pad "2" smd roundrect (at 0 0) (size 1.617 1.5) (layers "F.Cu" "F.Mask") (roundrect_rratio 0.25)
    (thermal_bridge_angle 45) (tstamp 52fd156d-f1f6-413b-b492-817f2c6c4808))
  (pad "3" smd roundrect (at 1.817 0) (size 1.617 1.5) (layers "F.Cu" "F.Mask") (roundrect_rratio 0.25)
    (thermal_bridge_angle 45) (tstamp 8c001525-5003-497b-bb95-033b25010a6b))
)
