(footprint "PinHeader_1x01_P2.00mm_with_value" (version 20221018) (generator pcbnew)
  (layer "F.Cu")
  (descr "Through hole straight pin header, 1x01, 2.00mm pitch, single row")
  (tags "Through hole pin header THT 1x01 2.00mm single row")
  (attr through_hole)
  (fp_text reference "REF**" (at 0 -2.06) (layer "F.SilkS") hide
      (effects (font (size 1 1) (thickness 0.15)))
    (tstamp c0c03bbe-5341-4fce-84b0-1506fd4f9439)
  )
  (fp_text value "PinHeader_1x01_P2.00mm_with_value" (at 1 0) (layer "F.SilkS")
      (effects (font (size 1 1) (thickness 0.15)) (justify left))
    (tstamp 17df68fd-f931-4c88-b49b-73ddd52f847b)
  )
  (fp_text user "${REFERENCE}" (at 0 0 90) (layer "F.Fab")
      (effects (font (size 1 1) (thickness 0.15)))
    (tstamp 37bf9e5d-4a5d-4944-bffc-7d13193ca5f9)
  )
  (fp_line (start -1.06 -1.06) (end 0 -1.06)
    (stroke (width 0.12) (type solid)) (layer "F.SilkS") (tstamp 4fc7cabf-938c-4ee3-a627-02f4769fca79))
  (fp_line (start -1.06 0) (end -1.06 -1.06)
    (stroke (width 0.12) (type solid)) (layer "F.SilkS") (tstamp db1cad2c-2217-4d44-bf52-03253ad26d7c))
  (fp_line (start -1.06 1) (end -1.06 1.06)
    (stroke (width 0.12) (type solid)) (layer "F.SilkS") (tstamp 367688ec-0942-43e4-8cb0-f70f581c836f))
  (fp_line (start -1.06 1) (end 1.06 1)
    (stroke (width 0.12) (type solid)) (layer "F.SilkS") (tstamp 840f754c-8ea7-4b2f-a332-045e00ec54d6))
  (fp_line (start -1.06 1.06) (end 1.06 1.06)
    (stroke (width 0.12) (type solid)) (layer "F.SilkS") (tstamp 301e511e-0661-4655-ac1c-1315e5de454b))
  (fp_line (start 1.06 1) (end 1.06 1.06)
    (stroke (width 0.12) (type solid)) (layer "F.SilkS") (tstamp d1295647-be51-40d7-a5a9-7f07149ed942))
  (fp_line (start -1.5 -1.5) (end -1.5 1.5)
    (stroke (width 0.05) (type solid)) (layer "F.CrtYd") (tstamp 059f0289-45f2-41c5-9f20-a2834222193e))
  (fp_line (start -1.5 1.5) (end 1.5 1.5)
    (stroke (width 0.05) (type solid)) (layer "F.CrtYd") (tstamp e93e50c9-b2c3-444e-9a34-ddc991b931c7))
  (fp_line (start 1.5 -1.5) (end -1.5 -1.5)
    (stroke (width 0.05) (type solid)) (layer "F.CrtYd") (tstamp 3d60736e-d4ab-4a5a-8c75-ab0a13e6e13e))
  (fp_line (start 1.5 1.5) (end 1.5 -1.5)
    (stroke (width 0.05) (type solid)) (layer "F.CrtYd") (tstamp 714fab42-6c90-4277-802a-904b1592671b))
  (fp_line (start -1 -0.5) (end -0.5 -1)
    (stroke (width 0.1) (type solid)) (layer "F.Fab") (tstamp f0d15bed-103f-45ce-9f8c-f6fa681b5956))
  (fp_line (start -1 1) (end -1 -0.5)
    (stroke (width 0.1) (type solid)) (layer "F.Fab") (tstamp 2de45379-4ef6-4c3e-bab4-dc34116da34c))
  (fp_line (start -0.5 -1) (end 1 -1)
    (stroke (width 0.1) (type solid)) (layer "F.Fab") (tstamp 255aa603-28ad-4abc-a2b6-f8d2975a80ef))
  (fp_line (start 1 -1) (end 1 1)
    (stroke (width 0.1) (type solid)) (layer "F.Fab") (tstamp 8f6848ce-3ed5-4473-9e79-0a39bc377062))
  (fp_line (start 1 1) (end -1 1)
    (stroke (width 0.1) (type solid)) (layer "F.Fab") (tstamp 0d8428d4-63e7-4fc9-91f3-78ca6894a9eb))
  (pad "1" thru_hole rect (at 0 0) (size 1.35 1.35) (drill 0.8) (layers "*.Cu" "*.Mask") (tstamp 21f3b547-b566-4949-8a52-bd8a0676580f))
  (model "${KICAD6_3DMODEL_DIR}/Connector_PinHeader_2.00mm.3dshapes/PinHeader_1x01_P2.00mm_Vertical.wrl"
    (offset (xyz 0 0 0))
    (scale (xyz 1 1 1))
    (rotate (xyz 0 0 0))
  )
)
