(footprint "PinHeader_1x02_P2.00mm_with_value" (version 20221018) (generator pcbnew)
  (layer "F.Cu")
  (descr "Through hole straight pin header, 1x02, 2.00mm pitch, single row")
  (tags "Through hole pin header THT 1x02 2.00mm single row")
  (attr through_hole)
  (fp_text reference "REF**" (at 0 -2.06) (layer "F.SilkS") hide
      (effects (font (size 1 1) (thickness 0.15)))
    (tstamp 6b6666d3-55a6-4bb3-8dff-f6f99f492cd8)
  )
  (fp_text value "PinHeader_1x02_P2.00mm_with_value" (at 2.5 1 -90) (layer "F.SilkS")
      (effects (font (size 1 1) (thickness 0.15)) (justify bottom))
    (tstamp 2920c3af-73ed-424f-b368-543dcdfa3f8f)
  )
  (fp_text user "${REFERENCE}" (at 0 1 90) (layer "F.Fab")
      (effects (font (size 1 1) (thickness 0.15)))
    (tstamp 14e05c8e-a0d7-4d85-8b61-838c8df9181b)
  )
  (fp_line (start -1.06 -1.06) (end 0 -1.06)
    (stroke (width 0.12) (type solid)) (layer "F.SilkS") (tstamp 947a9805-cdbb-49b8-96f4-86d7de019b07))
  (fp_line (start -1.06 0) (end -1.06 -1.06)
    (stroke (width 0.12) (type solid)) (layer "F.SilkS") (tstamp 874d1b2b-2fb4-4886-9275-cedc2dfc3f0e))
  (fp_line (start -1.06 1) (end -1.06 3.06)
    (stroke (width 0.12) (type solid)) (layer "F.SilkS") (tstamp e4c5ccba-bd6a-489a-ab23-a9eff3248f99))
  (fp_line (start -1.06 1) (end 1.06 1)
    (stroke (width 0.12) (type solid)) (layer "F.SilkS") (tstamp b7ee966e-09a5-42cc-a6ce-c3104c924f68))
  (fp_line (start -1.06 3.06) (end 1.06 3.06)
    (stroke (width 0.12) (type solid)) (layer "F.SilkS") (tstamp cdd6323f-4551-4047-ab34-eb41ab1b6854))
  (fp_line (start 1.06 1) (end 1.06 3.06)
    (stroke (width 0.12) (type solid)) (layer "F.SilkS") (tstamp 1f3f1ec2-987d-4d12-8eca-234affc1da89))
  (fp_line (start -1.5 -1.5) (end -1.5 3.5)
    (stroke (width 0.05) (type solid)) (layer "F.CrtYd") (tstamp 81a43697-3a64-4e9d-84a0-112ca2511085))
  (fp_line (start -1.5 3.5) (end 1.5 3.5)
    (stroke (width 0.05) (type solid)) (layer "F.CrtYd") (tstamp 38c4f747-4469-4873-9f4f-533cc777cf2a))
  (fp_line (start 1.5 -1.5) (end -1.5 -1.5)
    (stroke (width 0.05) (type solid)) (layer "F.CrtYd") (tstamp 95466178-01c1-4c2c-b290-3e77f00de91a))
  (fp_line (start 1.5 3.5) (end 1.5 -1.5)
    (stroke (width 0.05) (type solid)) (layer "F.CrtYd") (tstamp 93c7fcde-ec7e-434e-b89c-6ba073ef0fb7))
  (fp_line (start -1 -0.5) (end -0.5 -1)
    (stroke (width 0.1) (type solid)) (layer "F.Fab") (tstamp 819aebea-5e6d-433c-b124-3e43258bd6d1))
  (fp_line (start -1 3) (end -1 -0.5)
    (stroke (width 0.1) (type solid)) (layer "F.Fab") (tstamp b46b645d-252e-4c7c-b91c-723272d527c9))
  (fp_line (start -0.5 -1) (end 1 -1)
    (stroke (width 0.1) (type solid)) (layer "F.Fab") (tstamp 863abae5-3489-4f22-951d-40fc851706f9))
  (fp_line (start 1 -1) (end 1 3)
    (stroke (width 0.1) (type solid)) (layer "F.Fab") (tstamp 252f49b5-5525-413b-86f2-e0b7de539428))
  (fp_line (start 1 3) (end -1 3)
    (stroke (width 0.1) (type solid)) (layer "F.Fab") (tstamp d2b75b5b-40b6-440a-8892-d88d40a30427))
  (pad "1" thru_hole rect (at 0 0) (size 1.35 1.35) (drill 0.8) (layers "*.Cu" "*.Mask") (tstamp 7b000ec1-4dd6-4c90-b830-1309894104e7))
  (pad "2" thru_hole oval (at 0 2) (size 1.35 1.35) (drill 0.8) (layers "*.Cu" "*.Mask") (tstamp 47bf8256-28d2-43c3-8582-7d6c7bb45c22))
  (model "${KICAD6_3DMODEL_DIR}/Connector_PinHeader_2.00mm.3dshapes/PinHeader_1x02_P2.00mm_Vertical.wrl"
    (offset (xyz 0 0 0))
    (scale (xyz 1 1 1))
    (rotate (xyz 0 0 0))
  )
)
