Division,WeightClassKg,Place,Name,Team,BodyweightKg,Best3SquatKg,Best3BenchKg,Best3DeadliftKg,TotalKg,Equipment,Event,Sex,BirthDate
Girls,44.23,1,Samantha Sepulveda,Monahans,43.54,104.33,38.56,79.38,222.26,Unlimited,SBD,F,
Girls,44.23,2,Leah Mancillas,Andrews,36.56,63.5,34.02,74.84,172.37,Unlimited,SBD,F,
Girls,47.85,1,Leslie Espadas,Monahans,46.36,90.72,47.63,95.25,233.6,Unlimited,SBD,F,
Girls,47.85,2,Michelle Mendoza,Monahans,45.81,77.11,36.29,81.65,195.04,Unlimited,SBD,F,
Girls,51.94,1,Nivea Marmolejo,Monahans,51.26,102.06,61.23,104.33,267.62,Unlimited,SBD,F,
Girls,51.94,2,Audi Cota,Monahans,51.62,99.79,49.9,95.25,244.94,Unlimited,SBD,F,
Girls,51.94,3,Viviana Mendoza,Monahans,51.07,95.25,40.82,92.99,229.06,Unlimited,SBD,F,
Girls,51.94,4,Kaydence Sanchez,Monahans,48.81,79.38,34.02,77.11,190.51,Unlimited,SBD,F,
Girls,56.02,1,Isabella Rodriguez,Andrews,54.98,77.11,38.56,102.06,217.72,Unlimited,SBD,F,
Girls,60.1,1,Lizbeth Delgadillo,Monahans,58.97,68.04,38.56,81.65,188.24,Unlimited,SBD,F,
Girls,67.36,1,Madison Lee,Monahans,66.59,138.35,74.84,129.27,342.46,Unlimited,SBD,F,
Girls,67.36,2,Alondra De Luna,Andrews,63.32,106.59,54.43,124.74,285.76,Unlimited,SBD,F,
Girls,67.36,3,Arielle Viera,Big Spring,66.95,95.25,40.82,90.72,226.8,Unlimited,SBD,F,
Girls,67.36,DQ,Lyleanna Chavarria,Andrews,65.95,,,,,Unlimited,SBD,F,
Girls,75.07,1,Mya Tefertiller,Monahans,68.76,117.93,72.57,122.47,312.98,Unlimited,SBD,F,
Girls,75.07,2,Tara Porter,Big Spring,75.02,111.13,58.97,120.2,290.3,Unlimited,SBD,F,
Girls,75.07,3,Zoe Cigarroa,Big Spring,73.39,120.2,58.97,104.33,283.5,Unlimited,SBD,F,
Girls,75.07,4,Allison Hillhouse,Big Spring,73.8,104.33,52.16,113.4,269.89,Unlimited,SBD,F,
Girls,82.33,DQ,Angel Evans,Big Spring,75.98,,,,,Unlimited,SBD,F,
Girls,90.04,1,Rilee Gonzales,Big Spring,84.05,120.2,61.23,117.93,299.37,Unlimited,SBD,F,
Girls,90.04,2,Khloe Martinez,Andrews,83.1,95.25,49.9,102.06,247.21,Unlimited,SBD,F,
Girls,100.02,1,Alliana Chavarria,Big Spring,92.44,117.93,54.43,113.4,285.76,Unlimited,SBD,F,
Girls,110,1,Adryana DeFranco,Monahans,101.97,188.24,106.59,158.76,453.59,Unlimited,SBD,F,
Girls,110,2,Cloey Hughes,Andrews,107.32,111.13,61.23,108.86,281.23,Unlimited,SBD,F,
Girls,110,3,Alexsandra Gallegos,Andrews,106.5,104.33,63.5,108.86,276.69,Unlimited,SBD,F,
Girls,110+,1,Violet Calderon,Big Spring,123.83,219.99,88.45,170.1,478.54,Unlimited,SBD,F,
Girls,110+,2,Isabel Gomez,Monahans,113.85,122.47,79.38,131.54,333.39,Unlimited,SBD,F,
