Division,WeightClassKg,Place,Name,Team,BodyweightKg,Best3SquatKg,Best3BenchKg,Best3DeadliftKg,TotalKg,Equipment,Event,Sex,BirthDate
Girls,44.23,1,Jennifer Lopez,Ferris,42.64,99.79,49.9,106.59,256.28,Unlimited,SBD,F,
Girls,44.23,2,Presley Delva,Pollok Central,42.82,61.23,43.09,77.11,181.44,Unlimited,SBD,F,
Girls,44.23,3,Faith Lum,Sunnyvale,41.91,63.5,36.29,79.38,179.17,Unlimited,SBD,F,
Girls,44.23,4,Elsabeth Weldegebriel,Everman,40.78,61.23,34.02,70.31,165.56,Unlimited,SBD,F,
Girls,44.23,5,Brooklyn De La Torre,Dallas Highland Park,43.27,58.97,24.95,72.57,156.49,Unlimited,SBD,F,
Girls,44.23,6,Allison Valles,Quinlan Ford,39.83,56.7,27.22,68.04,151.95,Unlimited,SBD,F,
Girls,44.23,7,Kadmiel Godoy,Wylie,41.1,52.16,29.48,68.04,149.69,Unlimited,SBD,F,
Girls,44.23,8,Kimberly Jones,Pollok Central,40.82,40.82,20.41,61.23,122.47,Unlimited,SBD,F,
Girls,47.85,1,Alecs Burch,Quinlan Ford,45.63,127.01,65.77,136.08,328.85,Unlimited,SBD,F,
Girls,47.85,2,Allison Gonzales,Sunnyvale,47.36,92.99,45.36,86.18,224.53,Unlimited,SBD,F,
Girls,47.85,3,Natalie Hernandez,Everman,46.81,54.43,43.09,74.84,172.37,Unlimited,SBD,F,
Girls,47.85,4,Juliet Clay,Wylie,47.63,63.5,22.68,81.65,167.83,Unlimited,SBD,F,
Girls,47.85,5,Khloe Jackson,Crandall,45.99,47.63,24.95,72.57,145.15,Unlimited,SBD,F,
Girls,51.94,1,Bella Beltran,Ferris,49.08,131.54,58.97,117.93,308.44,Unlimited,SBD,F,
Girls,51.94,2,Sheyla Flores,Corsicana,51.26,113.4,49.9,99.79,263.08,Unlimited,SBD,F,
Girls,51.94,3,Cecilia Rodriguez,Quinlan Ford,50.98,99.79,47.63,113.4,260.82,Unlimited,SBD,F,
Girls,51.94,4,Allison Lopez,Wills Point,51.89,79.38,38.56,99.79,217.72,Unlimited,SBD,F,
Girls,51.94,5,Gwendolyn Morales,Everman,49.99,68.04,36.29,81.65,185.97,Unlimited,SBD,F,
Girls,51.94,6,Soledad Perez-Paz,Terrell,49.99,68.04,31.75,77.11,176.9,Unlimited,SBD,F,
Girls,51.94,7,Azaleah Duenez,Terrell,51.89,65.77,24.95,77.11,167.83,Unlimited,SBD,F,
Girls,51.94,8,Arly Gonzalez,Crandall,49.99,43.09,20.41,58.97,122.47,Unlimited,SBD,F,
Girls,56.02,1,Jocelyn Aguirre,Crandall,54.61,124.74,70.31,122.47,317.51,Unlimited,SBD,F,
Girls,56.02,2,Rebekah Seder,Forney,54.34,104.33,68.04,115.67,288.03,Unlimited,SBD,F,
Girls,56.02,3,Arabella Chavarria,Ferris,54.25,113.4,52.16,104.33,269.89,Unlimited,SBD,F,
Girls,56.02,4,Melanie Garcia,Corsicana,52.89,106.59,52.16,99.79,258.55,Unlimited,SBD,F,
Girls,56.02,5,Tamia Bankhead,Wylie,54.43,92.99,38.56,117.93,249.48,Unlimited,SBD,F,
Girls,56.02,6,Valeria Hernandez,Wylie,55.52,90.72,47.63,99.79,238.14,Unlimited,SBD,F,
Girls,56.02,6,Roxana López,Corsicana,55.97,104.33,45.36,111.13,260.82,Unlimited,SBD,F,
Girls,56.02,7,Hailee Foley,Pollok Central,55.97,81.65,49.9,106.59,238.14,Unlimited,SBD,F,
Girls,56.02,8,Tristan Staley,Sunnyvale,55.88,88.45,47.63,90.72,226.8,Unlimited,SBD,F,
Girls,56.02,9,Madison McCleery,Terrell,53.8,90.72,34.02,79.38,204.12,Unlimited,SBD,F,
Girls,56.02,10,Lexi States,Terrell,55.07,83.91,36.29,83.91,204.12,Unlimited,SBD,F,
Girls,56.02,11,Elle Noonan,Dallas Highland Park,54.25,77.11,40.82,81.65,199.58,Unlimited,SBD,F,
Girls,56.02,12,Amelia Ewins,Wills Point,54.25,68.04,31.75,77.11,176.9,Unlimited,SBD,F,
Girls,60.1,1,Isabella Ortega,Wylie,58.42,154.22,70.31,129.27,353.8,Unlimited,SBD,F,
Girls,60.1,2,Kara Pride,Canton,59.96,117.93,47.63,124.74,290.3,Unlimited,SBD,F,
Girls,60.1,3,Kristina Restrepo,Wylie,60.06,111.13,45.36,129.27,285.76,Unlimited,SBD,F,
Girls,60.1,4,Trinity Westlake,Quinlan Ford,59.33,102.06,70.31,104.33,276.69,Unlimited,SBD,F,
Girls,60.1,5,Ruby Sandoval,Everman,58.97,99.79,47.63,115.67,263.08,Unlimited,SBD,F,
Girls,60.1,7,Felicity Lyons,Crandall,58.97,81.65,61.23,117.93,260.82,Unlimited,SBD,F,
Girls,60.1,8,Zaria Smallwood,Everman,59.87,95.25,52.16,111.13,258.55,Unlimited,SBD,F,
Girls,60.1,9,Hannah Kearney,Sunnyvale,58.42,102.06,43.09,106.59,251.74,Unlimited,SBD,F,
Girls,60.1,10,Jada Major,Ennis,58.51,88.45,54.43,108.86,251.74,Unlimited,SBD,F,
Girls,60.1,11,Summer Posey,Terrell,59.69,104.33,40.82,104.33,249.48,Unlimited,SBD,F,
Girls,60.1,12,Pearl Uguru,Crandall,57.52,77.11,45.36,104.33,226.8,Unlimited,SBD,F,
Girls,60.1,13,Amna Kiyani,Wylie,57.97,97.52,47.63,81.65,226.8,Unlimited,SBD,F,
Girls,60.1,14,Liz Collins,Ennis,59.06,86.18,47.63,92.99,226.8,Unlimited,SBD,F,
Girls,60.1,15,Autumn McKeehan,Canton,59.33,92.99,40.82,92.99,226.8,Unlimited,SBD,F,
Girls,60.1,16,Estefana Ceja-Solis,Terrell,57.52,95.25,38.56,74.84,208.65,Unlimited,SBD,F,
Girls,60.1,17,Valleria Campos,Terrell,60.06,90.72,34.02,81.65,206.38,Unlimited,SBD,F,
Girls,60.1,18,Sheila Ortega,Terrell,59.51,77.11,40.82,86.18,204.12,Unlimited,SBD,F,
Girls,60.1,19,Mia Walker,Forney,57.15,92.99,38.56,70.31,201.85,Unlimited,SBD,F,
Girls,60.1,20,Brianna Angeles,McKinney,60.06,72.57,34.02,90.72,197.31,Unlimited,SBD,F,
Girls,60.1,21,Sharris Trees,Crandall,57.24,77.11,38.56,79.38,195.04,Unlimited,SBD,F,
Girls,60.1,22,Stephanie Arvizu,Wills Point,58.33,70.31,34.02,88.45,192.78,Unlimited,SBD,F,
Girls,60.1,23,Itunnuoluwa Coker,North Forney,57.33,52.16,34.02,83.91,170.1,Unlimited,SBD,F,
Girls,60.1,24,Kayce Small,Crandall,57.24,52.16,31.75,63.5,147.42,Unlimited,SBD,F,
Girls,60.1,25,Annabelle Thomas,Canton,59.15,45.36,34.02,61.23,140.61,Unlimited,SBD,F,
Girls,60.1,26,Kindall Tally,Crandall,58.88,43.09,27.22,43.09,113.4,Unlimited,SBD,F,
Girls,60.1,DQ,Yisel Barajas,Ennis,57.88,65.77,,,,Unlimited,SBD,F,
Girls,60.1,DQ,Madison Smith,Sunnyvale,59.15,115.67,,,,Unlimited,SBD,F,
Girls,67.36,1,Brooke Roby,Quinlan Ford,64.77,145.15,77.11,174.63,396.89,Unlimited,SBD,F,
Girls,67.36,2,Caitlin Everett,Forney,67.04,165.56,77.11,147.42,390.09,Unlimited,SBD,F,
Girls,67.36,3,Fiona Harlan,Forney,63.59,145.15,83.91,136.08,365.14,Unlimited,SBD,F,
Girls,67.36,4,Venessa Egorah,North Forney,63.05,124.74,61.23,129.27,315.25,Unlimited,SBD,F,
Girls,67.36,5,Sarai Martinez,Mesquite Horn,67.04,117.93,58.97,133.81,310.71,Unlimited,SBD,F,
Girls,67.36,6,Sarah Wiechman,Ferris,61.42,117.93,63.5,127.01,308.44,Unlimited,SBD,F,
Girls,67.36,7,Saniyah Jacks,Ferris,61.87,111.13,45.36,113.4,269.89,Unlimited,SBD,F,
Girls,67.36,8,Merry Gebreselassie,Wylie,64.23,97.52,47.63,124.74,269.89,Unlimited,SBD,F,
Girls,67.36,9,Madison Aldama,Ennis,66.86,88.45,61.23,117.93,267.62,Unlimited,SBD,F,
Girls,67.36,10,Caroline Moore,Sunnyvale,64.59,99.79,54.43,102.06,256.28,Unlimited,SBD,F,
Girls,67.36,11,Sophia Lara,Corsicana,62.78,97.52,54.43,102.06,254.01,Unlimited,SBD,F,
Girls,67.36,12,Mia Hernandez,Terrell,66.32,104.33,40.82,104.33,249.48,Unlimited,SBD,F,
Girls,67.36,13,Liliana Kirk,Wylie,64.68,102.06,43.09,102.06,247.21,Unlimited,SBD,F,
Girls,67.36,14,Kerrington Allen,Everman,64.68,88.45,38.56,104.33,231.33,Unlimited,SBD,F,
Girls,67.36,15,Karen Gonzalez,Terrell,65.5,90.72,38.56,97.52,226.8,Unlimited,SBD,F,
Girls,67.36,16,Alliyah Rojas,McKinney,60.87,79.38,38.56,86.18,204.12,Unlimited,SBD,F,
Girls,67.36,17,Savannah Garcia-Ruiz,Terrell,62.69,77.11,34.02,92.99,204.12,Unlimited,SBD,F,
Girls,67.36,18,Anyeli Farales,Corsicana,66.22,70.31,36.29,86.18,192.78,Unlimited,SBD,F,
Girls,67.36,19,Valerie Seeders,Wills Point,62.05,68.04,29.48,79.38,176.9,Unlimited,SBD,F,
Girls,67.36,20,Lindie Gilmore,Wills Point,67.22,70.31,24.95,77.11,172.37,Unlimited,SBD,F,
Girls,67.36,21,Emily Meraz,Wills Point,63.05,56.7,36.29,74.84,167.83,Unlimited,SBD,F,
Girls,67.36,22,Melody Ortiz,North Forney,67.22,52.16,29.48,70.31,151.95,Unlimited,SBD,F,
Girls,67.36,DQ,Kerstyn Cook,Pollok Central,60.87,,,,,Unlimited,SBD,F,
Girls,75.07,1,Sara Lopez,Corsicana,72.94,147.42,79.38,140.61,367.41,Unlimited,SBD,F,
Girls,75.07,2,Ryann Brooks,Pollok Central,73.94,129.27,61.23,136.08,326.59,Unlimited,SBD,F,
Girls,75.07,3,Dani Miller,Ferris,73.12,124.74,61.23,133.81,319.78,Unlimited,SBD,F,
Girls,75.07,4,Clara Fuller,Quinlan Ford,71.03,113.4,63.5,124.74,301.64,Unlimited,SBD,F,
Girls,75.07,5,Morgan Myers,Canton,72.48,122.47,58.97,117.93,299.37,Unlimited,SBD,F,
Girls,75.07,6,Marivel Ojeda,Crandall,74.39,115.67,43.09,127.01,285.76,Unlimited,SBD,F,
Girls,75.07,7,Alyssa Rutherford,Ennis,73.03,106.59,61.23,106.59,274.42,Unlimited,SBD,F,
Girls,75.07,8,Julissa Garcia,Forney,71.4,102.06,61.23,108.86,272.16,Unlimited,SBD,F,
Girls,75.07,9,Olivia Tanner,Forney,68.95,104.33,56.7,108.86,269.89,Unlimited,SBD,F,
Girls,75.07,10,Rylee Owens,Canton,74.3,99.79,49.9,104.33,254.01,Unlimited,SBD,F,
Girls,75.07,11,Olivia Phan,Sunnyvale,68.58,124.74,56.7,113.4,294.84,Unlimited,SBD,F,
Girls,75.07,12,Luz Lam,Garland Naaman Forest,67.95,92.99,38.56,92.99,224.53,Unlimited,SBD,F,
Girls,75.07,13,Eva Englade,Forney,68.04,61.23,40.82,92.99,195.04,Unlimited,SBD,F,
Girls,75.07,14,Paulina Lopez,Everman,70.94,70.31,34.02,88.45,192.78,Unlimited,SBD,F,
Girls,75.07,15,Dariela Quintanilla,Wills Point,67.77,54.43,27.22,83.91,165.56,Unlimited,SBD,F,
Girls,75.07,DQ,Isabella Soto,Forney,74.98,,,,,Unlimited,SBD,F,
Girls,75.07,DQ,Avina Yazmin,Ferris,70.67,,,,,Unlimited,SBD,F,
Girls,82.33,1,Yeranli Lopez-Bonilla,Everman,78.65,140.61,92.99,115.67,349.27,Unlimited,SBD,F,
Girls,82.33,2,Bailey Koonce,Canton,80.01,147.42,52.16,149.69,349.27,Unlimited,SBD,F,
Girls,82.33,3,Daisy Cardona,Ennis,78.47,145.15,54.43,124.74,324.32,Unlimited,SBD,F,
Girls,82.33,4,Jada Richardson,Crandall,80.47,120.2,65.77,136.08,322.05,Unlimited,SBD,F,
Girls,82.33,5,Payton Perez,Quinlan Ford,76.29,122.47,68.04,127.01,317.51,Unlimited,SBD,F,
Girls,82.33,6,Daniela Cano,Corsicana,81.28,127.01,74.84,115.67,317.51,Unlimited,SBD,F,
Girls,82.33,7,Grace Miles,Sunnyvale,81.83,136.08,52.16,120.2,308.44,Unlimited,SBD,F,
Girls,82.33,8,Lily Cabrera,Sunnyvale,77.84,117.93,65.77,115.67,299.37,Unlimited,SBD,F,
Girls,82.33,9,Sophia McCaleb,Mesquite Poteet,80.47,113.4,54.43,124.74,292.57,Unlimited,SBD,F,
Girls,82.33,10,Estrella Plaza,Crandall,78.02,102.06,49.9,131.54,283.5,Unlimited,SBD,F,
Girls,82.33,11,Alondra Silva,Corsicana,77.11,113.4,52.16,113.4,278.96,Unlimited,SBD,F,
Girls,82.33,12,Elizabeth Vogel,Wylie,76.75,99.79,49.9,124.74,274.42,Unlimited,SBD,F,
Girls,82.33,13,Jordyn Neustupa,Quinlan Ford,79.74,108.86,70.31,95.25,274.42,Unlimited,SBD,F,
Girls,82.33,14,Camryon Redding,Wills Point,80.29,104.33,38.56,113.4,256.28,Unlimited,SBD,F,
Girls,82.33,15,Isabelle Williams,Canton,75.52,77.11,34.02,86.18,197.31,Unlimited,SBD,F,
Girls,82.33,16,Sarai Granados,Wills Point,79.65,56.7,27.22,97.52,181.44,Unlimited,SBD,F,
Girls,82.33,17,Madison Warren,North Forney,80.01,47.63,43.09,88.45,179.17,Unlimited,SBD,F,
Girls,82.33,DQ,Baylee Rosenthal,Ferris,81.56,,,,,Unlimited,SBD,F,
Girls,90.04,1,Rosy Munoz,Everman,84.46,151.95,81.65,147.42,381.02,Unlimited,SBD,F,
Girls,90.04,2,Lilian Rodas,Ferris,84.37,151.95,79.38,147.42,378.75,Unlimited,SBD,F,
Girls,90.04,3,Lily Webb,Ennis,88.72,149.69,83.91,138.35,371.95,Unlimited,SBD,F,
Girls,90.04,4,Delaney Fulgham,Quinlan Ford,87.82,151.95,70.31,120.2,342.46,Unlimited,SBD,F,
Girls,90.04,5,Esmeralda Guillen,North Forney,87.45,122.47,61.23,129.27,312.98,Unlimited,SBD,F,
Girls,90.04,6,Esther Emokpae,Wylie,82.64,122.47,45.36,136.08,303.91,Unlimited,SBD,F,
Girls,90.04,7,Katie Derleth,Sunnyvale,89.09,117.93,63.5,120.2,301.64,Unlimited,SBD,F,
Girls,90.04,8,McKinzie Helton,Pollok Central,83.73,113.4,63.5,113.4,290.3,Unlimited,SBD,F,
Girls,90.04,9,Makayla Tolliver,Everman,89.72,115.67,52.16,115.67,283.5,Unlimited,SBD,F,
Girls,90.04,10,Mia Garcia,Forney,87.63,108.86,43.09,111.13,263.08,Unlimited,SBD,F,
Girls,90.04,11,Makayla Warren,North Forney,87.63,86.18,61.23,113.4,260.82,Unlimited,SBD,F,
Girls,90.04,12,Haylei Bond,McKinney,83.46,95.25,45.36,104.33,244.94,Unlimited,SBD,F,
Girls,90.04,13,Cheyenne Horn,Wills Point,87.18,90.72,43.09,95.25,229.06,Unlimited,SBD,F,
Girls,90.04,14,Madeline Garcia,Ennis,84.59,88.45,40.82,83.91,213.19,Unlimited,SBD,F,
Girls,90.04,DQ,Abigail Zuniga,Corsicana,87.54,131.54,61.23,,,Unlimited,SBD,F,
Girls,100.02,1,Hanna Omosigho,Crandall,95.44,145.15,81.65,183.7,410.5,Unlimited,SBD,F,
Girls,100.02,2,Ellie OMara,Canton,94.98,147.42,79.38,127.01,353.8,Unlimited,SBD,F,
Girls,100.02,3,Hailey Ramirez,Ferris,98.07,142.88,70.31,115.67,328.85,Unlimited,SBD,F,
Girls,100.02,4,Jacelyn Van Syckle,Canton,92.17,99.79,70.31,102.06,272.16,Unlimited,SBD,F,
Girls,100.02,5,Gioia Folefack,North Forney,94.35,56.7,43.09,108.86,208.65,Unlimited,SBD,F,
Girls,110,1,Leslee Jones,Corsicana,108.5,179.17,104.33,176.9,460.4,Unlimited,SBD,F,
Girls,110,2,Meraly Martinez,Everman,107.59,127.01,65.77,131.54,324.32,Unlimited,SBD,F,
Girls,110,3,Makayla Davis,Wylie,109.68,127.01,63.5,127.01,317.51,Unlimited,SBD,F,
Girls,110,4,Ximena Montoya,Everman,109.86,88.45,47.63,111.13,247.21,Unlimited,SBD,F,
Girls,110,5,Marley Ramirez,McKinney,104.24,97.52,58.97,86.18,242.67,Unlimited,SBD,F,
Girls,110+,1,Laikahs Kelly,Corsicana,122.56,226.8,124.74,183.7,535.24,Unlimited,SBD,F,
Girls,110+,2,Codi Miller,Ferris,,195.04,104.33,142.88,442.25,Unlimited,SBD,F,
Girls,110+,3,Peyton Grady,Mesquite Horn,126.64,179.17,97.52,151.95,428.64,Unlimited,SBD,F,
Girls,110+,4,Rachel Ragsdale,Mesquite Horn,123.92,129.27,74.84,124.74,328.85,Unlimited,SBD,F,
Girls,110+,5,Emma Hubbard,Pollok Central,110.59,127.01,65.77,131.54,324.32,Unlimited,SBD,F,
Girls,110+,DQ,Chloee Starnes,Mesquite Horn,114.4,,,,,Unlimited,SBD,F,
Girls,110+,DQ,Bailee Brown,Nevada Community,122.74,,,,,Unlimited,SBD,F,
