{
  "project_info": {
    "project_number": "93804490148",
    "firebase_url": "https://tafnews-15b64.firebaseio.com",
    "project_id": "tafnews-15b64",
    "storage_bucket": "tafnews-15b64.appspot.com"
  },
  "client": [
    {
      "client_info": {
        "mobilesdk_app_id": "1:93804490148:android:68ad06f730fb453c",
        "android_client_info": {
          "package_name": "com.ta.news"
        }
      },
      "oauth_client": [
        {
          "client_id": "93804490148-483rjhqu4rfa97hij008dmmeu5v1tsho.apps.googleusercontent.com",
          "client_type": 1,
          "android_info": {
            "package_name": "com.ta.news",
            "certificate_hash": "996db9acb3d01f6097ae965bdd208eddf6a38ebc"
          }
        },
        {
          "client_id": "93804490148-qvdgvmi0eo6g9ck2pi0eqpranffdnak3.apps.googleusercontent.com",
          "client_type": 1,
          "android_info": {
            "package_name": "com.ta.news",
            "certificate_hash": "abde7ca993979d253115fb36000f1aa4f26b5dee"
          }
        },
        {
          "client_id": "93804490148-0f2j5guu1vst1qvjs2scfsqn41idu4v7.apps.googleusercontent.com",
          "client_type": 1,
          "android_info": {
            "package_name": "com.ta.news",
            "certificate_hash": "7649e9de90bd2a6929979615bab9fd775a4c40e7"
          }
        },
        {
          "client_id": "93804490148-uu83aq563bt6us7182igh8n6fv85f760.apps.googleusercontent.com",
          "client_type": 1,
          "android_info": {
            "package_name": "com.ta.news",
            "certificate_hash": "f00187b35b459e8f7beaf9d06484082898deec42"
          }
        },
        {
          "client_id": "93804490148-02pjpgeqjfmcggrg8iqm5381drjeaqv7.apps.googleusercontent.com",
          "client_type": 3
        }
      ],
      "api_key": [
        {
          "current_key": "AIzaSyCnAXX4XgyF6wReadD1-iAe2hbBi0pAovY"
        }
      ],
      "services": {
        "analytics_service": {
          "status": 1
        },
        "appinvite_service": {
          "status": 2,
          "other_platform_oauth_client": [
            {
              "client_id": "93804490148-02pjpgeqjfmcggrg8iqm5381drjeaqv7.apps.googleusercontent.com",
              "client_type": 3
            }
          ]
        },
        "ads_service": {
          "status": 2
        }
      }
    }
  ],
  "configuration_version": "1"
}