
{
  "nodes": [{ "id": "A" }, { "id": "B" }, { "id": "C" }, { "id": "D" }, { "id": "E" }],
  "links": [
    { "source": "A", "target": "B", "label": "A To B" },
    { "source": "B", "target": "A", "label": "B To A" },
    { "source": "D", "target": "A", "label": "D To A" },
    { "source": "C", "target": "D", "label": "C To D" },
    { "source": "B", "target": "D", "label": "B To D" }
  ]
}