<svg width="48" height="48" viewBox="0 0 48 48" fill="none" xmlns="http://www.w3.org/2000/svg">
<path d="M41.1445 6.02339C40.4798 5.95289 39.7573 6.0567 39.0312 6.3437C38.1313 6.6977 24.0288 12.63 10.8828 18.164L6.53906 19.9921C4.85706 20.6741 4.00781 21.7833 4.00781 23.2773C4.00781 24.3233 4.4505 25.7421 6.5625 26.5781L13.8945 29.5156C14.5285 31.4176 16.0011 35.8338 16.3711 37.0078C16.5911 37.7038 17.1468 39.4571 18.5508 39.8671C18.8388 39.9651 19.1393 40.0156 19.4453 40.0156C20.3313 40.0156 20.9692 39.6032 21.2812 39.3632L25.9414 35.4218L31.6016 40.6562C31.8196 40.8782 32.9734 41.9999 34.5234 41.9999C36.4574 41.9999 37.9245 40.39 38.2305 38.832C38.3965 37.978 43.8555 10.5741 43.8555 10.5781C44.3455 8.38007 43.4644 7.23986 42.8984 6.75386C42.4134 6.33886 41.8093 6.09389 41.1445 6.02339ZM39.8203 10.3437C39.0663 14.1237 34.956 34.7564 34.332 37.7304L26.0586 30.0781L20.4453 34.832L22 28.7499C22 28.7499 32.7251 17.8937 33.3711 17.2617C33.8911 16.7557 34 16.5783 34 16.4023C34 16.1683 33.8796 15.9999 33.6016 15.9999C33.3516 15.9999 33.012 16.2395 32.832 16.3515C30.5453 17.7771 20.8082 23.3244 16.0156 26.0507L9.0625 23.2734L12.4375 21.8554C21.0355 18.2354 36.3483 11.7877 39.8203 10.3437Z" fill="black"/>
</svg>
