<svg width="513" height="48" viewBox="0 0 513 48" fill="none" xmlns="http://www.w3.org/2000/svg">
<path d="M24.7096 45.7628C21.6012 45.7628 18.7219 45.1902 16.0552 44.0614C13.3885 42.9325 11.0982 41.3947 9.16769 39.4315C7.23722 37.4683 5.71575 35.1616 4.63599 32.5113C3.53988 29.8446 3 27.0143 3 23.9877V23.8732C3 20.8466 3.53988 18.0164 4.63599 15.3824C5.73211 12.7485 7.23722 10.4254 9.16769 8.42945C11.0982 6.43354 13.4213 4.86299 16.1207 3.71779C18.82 2.5726 21.8139 2 25.0695 2C27.0491 2 28.8487 2.1636 30.4847 2.4908C32.1207 2.818 33.5931 3.25971 34.9346 3.81595C36.2597 4.38855 37.4867 5.0593 38.6155 5.8773C39.7444 6.67894 40.7914 7.57873 41.7566 8.54397L35.8344 15.3824C34.1984 13.8446 32.5133 12.683 30.7955 11.8323C29.0777 10.9816 27.1636 10.5562 25.0205 10.5562C23.2536 10.5562 21.6012 10.8998 20.0961 11.5869C18.591 12.274 17.2822 13.2229 16.2025 14.4335C15.1063 15.6442 14.272 17.0511 13.6667 18.638C13.0614 20.225 12.7669 21.9264 12.7669 23.7423V23.8569C12.7669 25.6728 13.0614 27.3906 13.6667 28.9939C14.272 30.6135 15.1063 32.0205 16.1861 33.2311C17.2495 34.4417 18.5419 35.407 20.0634 36.1104C21.5685 36.8139 23.2372 37.1738 25.0532 37.1738C27.4744 37.1738 29.5194 36.7321 31.1881 35.8487C32.8569 34.9652 34.5256 33.7546 36.1779 32.2168L42.1002 38.2045C41.0041 39.3661 39.8753 40.4294 38.7137 41.3456C37.5522 42.2618 36.2597 43.0634 34.8691 43.7342C33.4785 44.4049 31.9571 44.9121 30.3047 45.2393C28.6524 45.5665 26.771 45.7628 24.7096 45.7628Z" stroke="black" stroke-width="1.51"/>
<path d="M48.4314 2.70337H67.7852C73.1512 2.70337 77.2576 4.14304 80.1206 7.00603C82.5418 9.4273 83.7525 12.6502 83.7525 16.6911V16.8056C83.7525 20.2412 82.9181 23.0224 81.2494 25.1819C79.5807 27.3414 77.3885 28.9283 74.6891 29.9263L85.0285 45.0428H74.1328L65.0531 31.4968H64.9386H57.7402V45.0428H48.4314V2.70337ZM67.1799 23.2678C69.4866 23.2678 71.2371 22.7279 72.4805 21.6318C73.7075 20.5357 74.3292 19.096 74.3292 17.2801V17.1655C74.3292 15.1533 73.6911 13.6318 72.3987 12.6338C71.1062 11.6195 69.3067 11.1287 67.0163 11.1287H57.7566V23.2841H67.1799V23.2678Z" stroke="black" stroke-width="1.51"/>
<path d="M91.0654 2.70337H122.951V10.9978H100.26V19.5868H120.219V27.8813H100.26V36.7647H123.245V45.0592H91.0654V2.70337Z" stroke="black" stroke-width="1.51"/>
<path d="M145.021 2.39258H153.61L171.753 45.0429H162.019L158.141 35.5541H140.243L136.366 45.0429H126.877L145.021 2.39258ZM154.82 27.3251L149.192 13.5991L143.565 27.3251H154.82Z" stroke="black" stroke-width="1.51"/>
<path d="M187.065 11.2923H174.174V2.70337H209.266V11.2923H196.374V45.0428H187.065V11.2923Z" stroke="black" stroke-width="1.51"/>
<path d="M215.319 2.70337H247.188V10.9978H224.497V19.5868H244.456V27.8813H224.497V36.7647H247.483V45.0592H215.303V2.70337H215.319Z" stroke="black" stroke-width="1.51"/>
<path d="M274.591 45.7628C271.483 45.7628 268.603 45.1902 265.937 44.0614C263.27 42.9325 260.98 41.3947 259.049 39.4315C257.119 37.4683 255.597 35.1616 254.517 32.5113C253.421 29.8446 252.881 27.0143 252.881 23.9877V23.8732C252.881 20.8466 253.421 18.0164 254.517 15.3824C255.613 12.7485 257.119 10.4254 259.049 8.42945C260.98 6.43354 263.303 4.86299 266.002 3.71779C268.701 2.5726 271.695 2 274.951 2C276.93 2 278.73 2.1636 280.366 2.4908C282.002 2.818 283.474 3.25971 284.816 3.81595C286.141 4.38855 287.384 5.0593 288.513 5.8773C289.642 6.67894 290.689 7.57873 291.654 8.54397L285.732 15.3824C284.08 13.8937 282.395 12.7157 280.677 11.8814C278.959 11.0307 277.029 10.6053 274.902 10.6053C273.135 10.6053 271.483 10.9489 269.977 11.636C268.472 12.3231 267.164 13.272 266.084 14.4826C264.988 15.6933 264.153 17.1002 263.548 18.6871C262.943 20.274 262.648 21.9755 262.648 23.7914V23.9059C262.648 25.7219 262.943 27.4397 263.548 29.0429C264.153 30.6626 264.988 32.0695 266.051 33.2802C267.114 34.4908 268.407 35.456 269.928 36.1595C271.433 36.863 273.102 37.2229 274.918 37.2229C277.339 37.2229 279.384 36.7812 281.053 35.8978C282.722 35.0143 284.391 33.8037 286.043 32.2659L291.965 38.2536C290.869 39.4151 289.74 40.4785 288.579 41.3947C287.401 42.3272 286.125 43.1125 284.734 43.7832C283.344 44.454 281.822 44.9611 280.17 45.2883C278.501 45.5992 276.652 45.7628 274.591 45.7628Z" fill="black"/>
<path d="M298.296 2.70337H307.605V19.4559H324.783V2.70337H334.092V45.0428H324.783V28.0449H307.605V45.0428H298.296V2.70337Z" fill="black"/>
<path d="M360.857 45.7136C355.164 45.7136 350.697 44.143 347.425 41.0019C344.153 37.8608 342.517 33.1655 342.517 26.8997V2.70337H351.826V26.6543C351.826 30.1226 352.628 32.7402 354.247 34.4907C355.867 36.2412 358.092 37.1246 360.955 37.1246C363.818 37.1246 366.059 36.2739 367.663 34.5888C369.282 32.8874 370.084 30.3516 370.084 26.9651V2.70337H379.393V26.5888C379.393 29.8118 378.967 32.6093 378.1 34.9978C377.233 37.3864 375.99 39.3659 374.386 40.9529C372.767 42.5398 370.82 43.734 368.513 44.5193C366.239 45.321 363.671 45.7136 360.857 45.7136Z" fill="black"/>
<path d="M387.834 2.70337H407.188C412.554 2.70337 416.66 4.14304 419.523 7.00603C421.945 9.4273 423.155 12.6502 423.155 16.6911V16.8056C423.155 20.2412 422.321 23.0224 420.652 25.1819C418.984 27.3414 416.791 28.9283 414.092 29.9263L424.431 45.0428H413.536L404.456 31.4968H404.341H397.143V45.0428H387.834V2.70337V2.70337ZM406.583 23.2678C408.889 23.2678 410.64 22.7279 411.883 21.6318C413.11 20.5357 413.732 19.096 413.732 17.2801V17.1655C413.732 15.1533 413.094 13.6318 411.802 12.6338C410.509 11.6195 408.71 11.1287 406.419 11.1287H397.159V23.2841H406.583V23.2678Z" fill="black"/>
<path d="M450.313 45.7628C447.204 45.7628 444.325 45.1902 441.658 44.0614C438.992 42.9325 436.701 41.3947 434.755 39.4315C432.824 37.4683 431.303 35.1616 430.223 32.5113C429.127 29.8446 428.587 27.0143 428.587 23.9877V23.8732C428.587 20.8466 429.127 18.0164 430.223 15.3824C431.319 12.7485 432.824 10.4254 434.755 8.42945C436.685 6.43354 439.008 4.86299 441.708 3.71779C444.407 2.5726 447.384 2 450.656 2C452.636 2 454.436 2.1636 456.072 2.4908C457.708 2.818 459.18 3.25971 460.521 3.81595C461.847 4.38855 463.09 5.0593 464.219 5.8773C465.348 6.67894 466.395 7.57873 467.36 8.54397L461.438 15.3824C459.785 13.8937 458.1 12.7157 456.382 11.8814C454.665 11.0307 452.75 10.6053 450.607 10.6053C448.84 10.6053 447.188 10.9489 445.683 11.636C444.178 12.3231 442.869 13.272 441.789 14.4826C440.693 15.6933 439.859 17.1002 439.254 18.6871C438.648 20.274 438.354 21.9755 438.354 23.7914V23.9059C438.354 25.7219 438.665 27.4397 439.254 29.0429C439.859 30.6626 440.693 32.0695 441.757 33.2802C442.82 34.4908 444.112 35.456 445.634 36.1595C447.139 36.863 448.808 37.2229 450.624 37.2229C453.045 37.2229 455.09 36.7812 456.759 35.8978C458.427 35.0143 460.096 33.8037 461.748 32.2659L467.671 38.2536C466.575 39.4151 465.446 40.4785 464.284 41.3947C463.106 42.3272 461.83 43.1125 460.44 43.7832C459.049 44.454 457.528 44.9611 455.875 45.2883C454.223 45.6155 452.374 45.7628 450.313 45.7628Z" fill="black"/>
<path d="M474.018 2.70337H483.327V19.4559H500.505V2.70337H509.814V45.0428H500.505V28.0449H483.327V45.0428H474.018V2.70337Z" fill="black"/>
</svg>
