Name,Sex,Equipment,Event,Division,BodyweightKg,WeightClassKg,Squat1Kg,Squat2Kg,Squat3Kg,Best3SquatKg,Bench1Kg,Bench2Kg,Bench3Kg,Best3BenchKg,Deadlift1Kg,Deadlift2Kg,Deadlift3Kg,Best3DeadliftKg,TotalKg,Place
Marina Cornwall,F,Raw,SBD,F-Open,45.4,47,72.5,77.5,-82.5,77.5,47.5,50,51.5,51.5,110,117.5,125.5,125.5,254.5,1
Michelle Trench,F,Raw,SBD,F-Open,46.1,47,45,-55,-55,45,30,-35,-35,30,100,105,-110,105,180,2
Emma Goodwin,F,Raw,SBD,F-Open,52,52,85,-95,-95,85,55,60,62.5,62.5,110,-120,-120,110,257.5,1
Lucy Rayner,F,Raw,SBD,F-Open,56.7,57,95,102.5,107.5,107.5,60,65,70,70,100,110,117.5,117.5,295,1
Susie Butler,F,Raw,SBD,F-Open,56,57,90,95,-97.5,95,52.5,57.5,-60,57.5,110,115,120,120,272.5,2
Beverley Rodgers,F,Raw,SBD,F-Open,62.9,63,105,-112.5,112.5,112.5,72.5,77.5,80,80,125,135,137.5,137.5,330,1
Jodie Driver,F,Raw,SBD,F-Open,62,63,90,97.5,-100,97.5,45,47.5,52.5,52.5,115,130,135,135,285,2
Yasmina Couty,F,Raw,SBD,F-Open,62.1,63,80,85,90,90,35,40,47.5,47.5,120,127.5,135,135,272.5,3
Danielle Broom,F,Raw,SBD,F-Open,61.5,63,80,85,92.5,92.5,42.5,47.5,-50,47.5,120,125,130,130,270,4
Megan Batchelor,F,Raw,SBD,F-Open,71.5,72,100,110,117.5,117.5,70,77.5,82.5,82.5,130,145,-155,145,345,1
Megan Davies,F,Raw,SBD,F-Open,70.5,72,90,95,100,100,45,50,52.5,52.5,130,135,-140,135,287.5,2
Claire Dimmock,F,Raw,SBD,F-Open,65.3,72,77.5,82.5,-87.5,82.5,45,52.5,-57.5,52.5,105,110,117.5,117.5,252.5,3
Lizzie Havers,F,Raw,SBD,F-Open,69.3,72,80,85,-90,85,52.5,57.5,60,60,95,100,-105,100,245,4
Sara Dawn Hearne,F,Raw,SBD,F-Open,67.7,72,45,50,60,60,42.5,47.5,52.5,52.5,80,90,95,95,207.5,5
Charlie Chester,F,Raw,SBD,F-Open,82,84,130,140,145,145,52.5,57.5,-60,57.5,150,157.5,-165,157.5,360,1
Jean Maton,F,Raw,SBD,F-Open,83.4,84,100,110,-120,110,75,80,82.5,82.5,130,140,150,150,342.5,2
Julia Fabrizi,F,Raw,SBD,F-Open,81.3,84,80,90,95,95,67.5,72.5,-77.5,72.5,130,140,-145,140,307.5,3
Meryll Paterson,F,Raw,SBD,F-Open,82.1,84,80,-90,-90,80,40,45,50,50,100,110,-115,110,240,4
Katie Long,F,Raw,SBD,F-Open,80.6,84,70,75,80,80,42.5,47.5,50,50,87.5,95,100,100,230,5
Abbie Gjoka,F,Raw,SBD,F-Open,90.4,84+,135,145,150,150,65,70,-75,70,150,160,170,170,390,1
Vicky Cherry,F,Raw,SBD,F-Open,98.3,84+,-115,115,125,125,42.5,47.5,-52.5,47.5,120,135,145,145,317.5,2
Laura Shea,F,Raw,SBD,F-Open,125.9,84+,100,105,112.5,112.5,62.5,67.5,72.5,72.5,100,115,125,125,310,3
Hannah Newby,F,Raw,SBD,F-Open,89.1,84+,80,90,95,95,42.5,52.5,55,55,100,110,115,115,265,4
Izzy Mckerracher,F,Raw,SBD,F-Open,107.8,84+,70,80,90,90,37.5,45,-50,45,100,110,120,120,255,5
Catherine Higgs,F,Raw,SBD,F-Open,91.2,84+,30,37.5,45,45,30,35,40,40,55,65,75,75,160,6
Shasha Bowers,F,Raw,SBD,F-O-E,77.5,84,-142.5,-152.5,152.5,152.5,72.5,75,77.5,77.5,137.5,145,-152.5,145,375,1
Jack Suljevic,M,Raw,SBD,M-Open,66,66,165,175,-182.5,175,95,102.5,107.5,107.5,205,217.5,227.5,227.5,510,1
Amrik Mehta,M,Raw,SBD,M-Open,63.3,66,150,160,165,165,95,100,105,105,185,195,202.5,202.5,472.5,2
Roger Hamilton-Smith,M,Raw,SBD,M-Open,64.5,66,125,137.5,142.5,142.5,97.5,105,110,110,170,190,200,200,452.5,3
Kin-sang Westwood,M,Raw,SBD,M-Open,61.1,66,100,-107.5,-110,100,75,80,-85,80,150,160,165,165,345,4
James Dewar-Haggart,M,Raw,SBD,M-Open,65.1,66,80,85,90,90,65,70,-75,70,122.5,130,135,135,295,5
Steven Tyers,M,Raw,SBD,M-Open,73.9,74,185,200,210,210,125,132.5,137.5,137.5,225,245,-255,245,592.5,1
Daniel Smith,M,Raw,SBD,M-Open,73.5,74,190,200,210,210,125,132.5,-140,132.5,190,200,210,210,552.5,2
Corey Wiggins,M,Raw,SBD,M-Open,68.9,74,185,197.5,-205,197.5,105,112.5,120,120,205,215,-222.5,215,532.5,3
Henry Clark,M,Raw,SBD,M-Open,73.5,74,120,130,-140,130,52.5,57.5,-60,57.5,150,160,-165,160,347.5,4
Eze Erediauwa,M,Raw,SBD,M-Open,82.7,83,180,200,205,205,140,150,-160,150,260,280,-292.5,280,635,1
Alistair Cannings,M,Raw,SBD,M-Open,82.3,83,215,225,-232.5,225,140,147.5,152.5,152.5,225,240,-250,240,617.5,2
Matt Rowe,M,Raw,SBD,M-Open,81.9,83,190,,,190,130,,,130,235,,,235,555,3
Jasvinder Singh,M,Raw,SBD,M-Open,83,83,170,180,187.5,187.5,135,145,-155,145,190,202.5,212.5,212.5,545,4
Ross Mitchell,M,Raw,SBD,M-Open,78.2,83,150,170,180,180,100,110,115,115,170,190,-205,190,485,5
Jake Leach,M,Raw,SBD,M-Open,81.9,83,170,180,185,185,100,110,-117.5,110,170,180,190,190,485,6
Phillip Wood,M,Raw,SBD,M-Open,80.1,83,140,150,-155,150,100,107.5,112.5,112.5,200,210,217.5,217.5,480,7
Farris Collins,M,Raw,SBD,M-Open,80.9,83,140,-150,-150,140,100,105,110,110,160,170,175,175,425,8
Lewi Bell,M,Raw,SBD,M-Open,77.3,83,110,120,130,130,70,90,-97.5,90,140,152.5,160,160,380,9
Ian Kendrick,M,Raw,SBD,M-Open,92.6,93,230,240,250,250,135,145,-150,145,260,270,-280,270,665,1
Jaswinder Singh Cheema,M,Raw,SBD,M-Open,93,93,210,-225,225,225,150,160,165,165,240,260,-270,260,650,2
Jamie Lee Price,M,Raw,SBD,M-Open,91.3,93,190,200,210,210,100,110,112.5,112.5,205,222.5,232.5,232.5,555,3
Jonathan Marks,M,Raw,SBD,M-Open,88.6,93,175,-185,185,185,115,120,-125,120,215,-225,-225,215,520,4
Eddie Summers,M,Raw,SBD,M-Open,87.6,93,185,190,-200,190,125,-130,-130,125,190,-195,,190,505,5
Keith Blacknell,M,Raw,SBD,M-Open,89.2,93,155,162.5,170,170,100,105,110,110,182.5,190,-195,190,470,6
Jack Barber,M,Raw,SBD,M-Open,89.4,93,125,140,155,155,95,107.5,115,115,160,180,192.5,192.5,462.5,7
Tom Peters,M,Raw,SBD,M-Open,84.2,93,115,122.5,125,125,77.5,82.5,-87.5,82.5,160,170,177.5,177.5,385,8
Michael Patterson,M,Raw,SBD,M-Open,96.9,105,195,205,215,215,130,-135,,130,230,240,-255,240,585,1
Mitchell Dodman,M,Raw,SBD,M-Open,100,105,160,175,182.5,182.5,110,125,130,130,195,225,230,230,542.5,2
Stuart Ackerman,M,Raw,SBD,M-Open,100.9,105,150,160,170,170,110,115,120,120,180,195,205,205,495,3
Lee Yeates,M,Raw,SBD,M-Open,97.3,105,130,140,150,150,85,95,100,100,150,165,-175,165,415,4
Adam Gisby,M,Raw,SBD,M-Open,119.1,120,220,230,240,240,140,145,147.5,147.5,220,230,240,240,627.5,1
Jack Powell,M,Raw,SBD,M-Open,134.3,120+,175,182.5,187.5,187.5,100,105,107.5,107.5,175,185,200,200,495,1
Jack Howlett,M,Raw,SBD,M-Open,120.5,120+,135,150,-170,150,75,82.5,-87.5,82.5,160,170,-180,170,402.5,2
Manoj Chahal,M,Single-ply,SBD,M-O-E,74,74,-205,-205,205,205,130,137.5,142.5,142.5,210,220,230,230,577.5,1
TS Adewale,M,Single-ply,SBD,M-O-E,81.7,83,-200,-200,200,200,120,132.5,140,140,200,235,,235,575,1
R Allen,M,Single-ply,SBD,M-O-E,83,83,-150,-150,150,150,-100,100,-107.5,100,175,-185,185,185,435,2
