                                                     USPA KOGYM Back Yard Brawl July 28-29, 2018 Ventura, CA

                                    Wt                                                                  Total   Wilks     McC                                Total
             Name          State            Weight       Age       SQ Kg        BP Kg       DL Kg
                                   class                                                                 Kg     Total     Total   SQ Lbs   BP Lbs   DL Lbs    Lbs
    Women Raw Powerlifting
    48kg Jr 20-23
1   Lisa Abarca            CA      48kg      45.6         22         87.5        67.5        117.5      272.5   374.442           192.9    148.8     259     600.8
2   Marilyn Zapata         CA      48kg       48          20          90          45          115        250     331.1            198.4     99.2    253.5    551.2

    67.5kg Jr 20-23
1   Sophia Zatorski         CA     67.5kg    62.2         21         87.5        47.5        112.5      247.5   268.389           192.9    104.7     248     545.6
2   Ana Flores              CA     67.5kg     64          22          95          35         117.5      247.5   262.672           209.4     77.2     259     545.6

    82.5kg Jr 16-17
1   Bryana Washington       CA     82.5kg    79.8         17         125          75          140         340   311.542           275.6    165.3    308.6    749.6

    56kg Open
1   Valarie Chavez          CA     56kg      53.8         31         62.5        37.5        107.5      207.5   251.926           137.8     82.7     237     457.5

    60kg Open
1   Anne Escobedo           CA     60kg      57.4         28         125         62.5         160       347.5   401.05            275.6    137.8    352.7    766.1

    75kg Open
1   Monica Benavides        CA     75kg      68.8         28        122.5        77.5         130         330   332.277           270.1    170.9    286.6    727.5

    82.5kg Open
1   Dana Narez              CA     82.5kg    78.8         25         160        102.5         155       417.5   385.311           352.7     226     341.7    920.4
2   Bryana Washington       CA     82.5kg    79.8         17         125          75          140        340    311.542           275.6    165.3    308.6    749.6
3   Stephanie Morrow        CA     82.5kg    77.6         31        122.5        62.5        137.5      322.5    300.28           270.1    137.8    303.1     711

    82.5kg Submaster
1   Carol Soto              CA     82.5kg    77.4         37         120          65         122.5      307.5   286.775           264.6    143.3    270.1    677.9

    52kg Master 40-44
1   Chrissy Belo            CA     52kg      50.4         42          95         62.5        112.5        270   344.763 351.658   209.4    137.8     248     595.2

    67.5kg Master 45-49
1   Jennifer Vaughn         CA     67.5kg    62.4         49        117.5         60         142.5        320   346.176 385.294    259     132.3    314.2    705.5

    Men Raw Powerlifting
    60kg Jr 20-23
1   Phillip Nguyen          CA     60kg       60          20          90         57.5        112.5        260   221.754           198.4    126.8     248     573.2

    75kg Jr 20-23
1   Adan Arenas             CA     75kg       72          21         175         125         227.5      527.5   387.027           385.8    275.6    501.5    1162.9
2   Benjamin Her            CA     75kg      68.4         20          95         72.5        142.5       310     236.53           209.4    159.8    314.2     683.4
                                                    USPA KOGYM Back Yard Brawl July 28-29, 2018 Ventura, CA

                                   Wt                                                                  Total   Wilks     McC                                Total
              Name        State            Weight       Age       SQ Kg        BP Kg       DL Kg
                                  class                                                                 Kg     Total     Total   SQ Lbs   BP Lbs   DL Lbs    Lbs
     82.5kg Jr 20-23
1    Oswaldo Utrera        CA     82.5kg    79.8         20         120         92.5        167.5        380   259.844           264.6    203.9    369.3    837.7

     100kg Jr 20-23
1    Xavier Burse          CA     100kg     91.2         20         225        152.5        272.5       650     412.23            496     336.2    600.8     1433
2    Cristian Ruiz         CA     100kg     94.2         20        197.5       157.5        247.5      602.5   376.201           435.4    347.2    545.6    1328.3
3    Koby Mallon           CA     100kg      94          21        202.5       137.5         250        590     368.75           446.4    303.1    551.2    1300.7

     125kg Jr 18-19
1    Edwar Hernandez       CA     125kg    110.8         19         235          150         260         645   378.744           518.1    330.7    573.2    1422

     SHW Jr 20-23
1    Jesus Amezcua         CA     SHW      140.8         23         310          195         265         770   429.891           683.4    429.9    584.2    1697.5

     60kg Open
1    Gemo Madrigal         CA     60kg      58.2         24        122.5        82.5        172.5      377.5   331.181           270.1    181.9    380.3    832.2

     67.5kg Open
1    Tony Nunez            CO     67.5kg    63.8         29        122.5        92.5         155         370   298.886           270.1    203.9    341.7    815.7

     82.5kg Open
1    Kris Mccauley         CA     82.5kg    79.8         28         200        152.5        252.5       605    413.699           440.9    336.2    556.7    1333.8
2    Jordan Bryson         CA     82.5kg    82.5         28        197.5       157.5        247.5      602.5   403.615           435.4    347.2    545.6    1328.3
3    Greg Kiddie           CA     82.5kg     80          28         200         150          250        600     409.62           440.9    330.7    551.2    1322.8
4    Brent Hronik          CA     82.5kg    78.4         27        192.5        130          230       552.5   382.109           424.4    286.6    507.1     1218
5    Eric Kirschenmann     CA     82.5kg    79.4         25        227.5        100         222.5       550      377.3           501.5    220.5    490.5    1212.5

     90kg Open
1    Jason Zecchini        ND     90kg      87.4         24        227.5       177.5        252.5      657.5   426.257           501.5    391.3    556.7    1449.5
2    Joseph Cammarota      CA     90kg      88.4         31         140         90           170        400     257.76           308.6    198.4    374.8     881.8
3    Alexander Young       CA     90kg      87.4         26         125        102.5        167.5       395    256.079           275.6     226     369.3     870.8

     100kg Open
 1   Christopher Cooley    CA     100kg     95.2         29        227.5       162.5        272.5      662.5   411.678           501.5    358.2    600.8    1460.5
 2   Xavier Burse          CA     100kg     91.2         20         225        152.5        272.5       650     412.23            496     336.2    600.8     1433
 3   Raymond Lugo          CA     100kg     95.8         25        232.5        160          250       642.5   398.157           512.6    352.7    551.2    1416.5
 4   Stephen Paranal       CA     100kg     91.8         34        222.5       152.5        242.5      617.5   390.322           490.5    336.2    534.6    1361.3
DQ   Glenn Ryder           CA     100kg      95          29          0         137.5        182.5        0        0                0      303.1    402.3       0

     110kg Open
1    Bradley Mc Clellan    CA     110kg    106.6         34         255        192.5         290       737.5   438.444           562.2    424.4    639.3    1625.9
2    Martin Lopez          CA     110kg    103.8         25        222.5        140         247.5       610      366             490.5    308.6    545.6    1344.8
                                                      USPA KOGYM Back Yard Brawl July 28-29, 2018 Ventura, CA

                                     Wt                                                                  Total   Wilks     McC                                Total
              Name          State            Weight       Age       SQ Kg        BP Kg       DL Kg
                                    class                                                                 Kg     Total     Total   SQ Lbs   BP Lbs   DL Lbs    Lbs
     140kg Open
1    Eric Banks               CA    140kg     129          44        122.5       222.5        137.5      482.5   273.288 285.039   270.1    490.5    303.1    1063.7

     SHW Open
1    Jesus Amezcua            CA    SHW      140.8         23         310          195         265         770   429.891           683.4    429.9    584.2    1697.5

     110kg Submaster
1    Ryan Milligan            CA    110kg    104.6         37        182.5         130        227.5        540   323.136           402.3    286.6    501.5    1190.5

     140kg Master 40-44
1    Eric Banks               CA    140kg     129          44        122.5       222.5        137.5      482.5   273.288 285.039   270.1    490.5    303.1    1063.7

     Women Classic Raw Powerlifting
     90kg Open
DQ   Kimberly Brown        CA       90kg       85          52          0           75          155          0      0         0       0      165.3    341.7      0

     90kg Master 50-54
DQ   Kimberly Brown           CA    90kg       85          52          0           75          155          0      0         0       0      165.3    341.7      0

     Men Classic Raw Powerlifting
     75kg Jr 20-23
1    Jason Kirschenmann       CA    75kg       71          23         210         120          200        530    392.942            463     264.6    440.9    1168.4
2    Efren Garcia             CA    75kg      71.4         20         150          75          190        415    306.395           330.7    165.3    418.9     914.9
3    Jesus Magana             CA    75kg      69.2         21         140         77.5         160       377.5   285.428           308.6    170.9    352.7     832.2

     82.5kg Jr 20-23
1    Corey Krystkowiak        CA    82.5kg    77.4         21        182.5         120        227.5        530   369.675           402.3    264.6    501.5    1168.4

     100kg Jr 20-23
1    Dontae Woloshun          CA    100kg     93.2         23        267.5       152.5         320         740   464.424           589.7    336.2    705.5    1631.4

     75kg Open
1    Efren Garcia             CA    75kg      71.4         20         150          75          190         415   306.395           330.7    165.3    418.9    914.9

     90kg Open
1    Noah Thiel               CA    90kg       85          18         225        182.5         255       662.5   436.124            496     402.3    562.2    1460.5
2    Eli Sokolow              HI    90kg       86          21        227.5       127.5         255        610     398.94           501.5    281.1    562.2    1344.8
3    Travis Raville           CA    90kg       86          33        227.5       142.5         235        605     395.67           501.5    314.2    518.1    1333.8

     100kg Open
1    Dontae Woloshun          CA    100kg     93.2         23        267.5       152.5         320         740   464.424           589.7    336.2    705.5    1631.4
                                                         USPA KOGYM Back Yard Brawl July 28-29, 2018 Ventura, CA

                                        Wt                                                                  Total   Wilks     McC                                Total
             Name             State             Weight       Age       SQ Kg        BP Kg       DL Kg
                                       class                                                                 Kg     Total     Total   SQ Lbs   BP Lbs   DL Lbs    Lbs
    110kg Open
1   Anthony Martinez           CA      110kg     106.4        27         265        167.5         265       697.5   414.873           584.2    369.3    584.2    1537.7
2   Louis Shawver              CA      110kg     109.6        27         170        112.5        212.5       495    291.654           374.8     248     468.5    1091.3

    140kg Open
1   Jimmy Reyes                CA      140kg     128.6        30        257.5         170        272.5        700   396.69            567.7    374.8    600.8    1543.2

    Men Raw Bench Only
    90kg Open
1   Jason Zecchini             ND      90kg      87.4         24                    177.5                   177.5   115.073                    391.3             391.3

    140kg Open
1   Eric Banks                 CA      140kg      129         44                    222.5                   222.5   126.024 131.443            490.5             490.5

    140kg Master 40-44
1   Eric Banks                 CA      140kg      129         44                    222.5                   222.5   126.024 131.443            490.5             490.5

    Men Raw Deadlift Only
    100kg Open
1   Rene Aguilar               CA      100kg     94.8         25                                 247.5      247.5   154.094                             545.6    545.6

    125kg Master 65-69
1   David Dallmeyer            CA      125kg     119.2        69                                 187.5      187.5   107.963 173.82                      413.4    413.4


    Meet Director: Larry Pollock
    International: Dan Stephens and Ron Moormeister
    National: Stephanie Stephens and Thomas Urani
    State: Larry Pollack and Reginald Washington
    Announcer: Chuck LaMantia
    Table: Kellie LaMantia and Jailene Perez
    Spotters: Roy Glenn, Anthony McCulloch, Ken Farado and Kevin Pulsipher
