Sex,WeightClassKg,Name,AgeClass,Team,BodyweightKg,Best3SquatKg,Best3BenchKg,Best3DeadliftKg,TotalKg,Place,Event,Equipment,Division
F,75,Lisa Hicks,0-17.5,SW,72.8,85,47.5,100,232.5,G,SBD,Single-ply,F-E-Guest
M,56,Patrick Constantine,0-22.5,SW,53.9,200,100,222.5,522.5,G,SBD,Single-ply,M-E-Guest
M,67.5,Alistair Cannings,0-17.5,SW,67.4,180,105,200,485,G,SBD,Single-ply,M-E-Guest
M,82.5,Nick Shotton-Gale,0-22.5,SW,82.4,200,122.5,220,542.5,G,SBD,Single-ply,M-E-Guest
