Division,WeightClassKg,Place,Name,Team,BodyweightKg,Best3SquatKg,Best3BenchKg,Best3DeadliftKg,TotalKg,Equipment,Event,Sex
Boys,52,1,Dax Irvin,Pottsboro,51.17,140.61,70.31,136.08,347,Single-ply,SBD,M
Boys,52,2,Finlee Rudicile,Farmersville,50.53,108.86,65.77,120.2,294.84,Single-ply,SBD,M
Boys,52,3,Lance Jones,Van Alstyne,50.53,90.72,49.9,117.93,258.55,Single-ply,SBD,M
Boys,52,4,Kason Huschke,Bells,48.81,83.91,52.16,102.06,238.14,Single-ply,SBD,M
Boys,52,5,Brandon Garcia,Bells,50.26,83.91,45.36,90.72,219.99,Single-ply,SBD,M
Boys,52,6,Richard Spence,Bells,42.37,79.38,43.09,90.72,213.19,Single-ply,SBD,M
Boys,52,7,Colby Caldwell,Celina,51.44,72.57,38.56,92.99,204.12,Single-ply,SBD,M
Boys,52,8,Tanner Maples,Sanger,40.55,72.57,31.75,81.65,185.97,Single-ply,SBD,M
Boys,52,9,Dustyn Sanders,Prosper,45.54,68.04,40.82,72.57,181.44,Single-ply,SBD,M
Boys,56,1,Trey Good,Anna,55.34,154.22,88.45,149.69,392.36,Single-ply,SBD,M
Boys,56,2,Alex Rushing,Whitewright,54.61,142.88,97.52,147.42,387.82,Single-ply,SBD,M
Boys,56,3,Austin Mullinex,Sadler S & S Cons,52.89,138.35,79.38,136.08,353.8,Single-ply,SBD,M
Boys,56,4,Hunter Cathey,Pottsboro,52.34,111.13,68.04,113.4,292.57,Single-ply,SBD,M
Boys,60,1,Jacob Grubisa,Farmersville,59.15,172.37,92.99,192.78,458.13,Single-ply,SBD,M
Boys,60,2,Chris Bowling,Blue Ridge,59.33,151.95,106.59,163.29,421.84,Single-ply,SBD,M
Boys,60,3,Dalton Waller,Princeton,58.6,136.08,83.91,163.29,383.29,Single-ply,SBD,M
Boys,60,4,Luis Franco,Princeton,58.24,145.15,77.11,145.15,367.41,Single-ply,SBD,M
Boys,60,5,Spencer Akins,Howe,58.79,147.42,72.57,131.54,351.53,Single-ply,SBD,M
Boys,60,6,Travis Bishop,Blue Ridge,56.97,131.54,79.38,133.81,344.73,Single-ply,SBD,M
Boys,60,7,Tyler Watts,Sanger,58.88,115.67,79.38,136.08,331.12,Single-ply,SBD,M
Boys,60,8,Jaxson Rudicile,Farmersville,58.51,108.86,81.65,120.2,310.71,Single-ply,SBD,M
Boys,60,9,Eli Mosby,Van Alstyne,58.06,99.79,56.7,129.27,285.76,Single-ply,SBD,M
Boys,67.5,1,Johnathan Venable,Anna,61.96,181.44,117.93,181.44,480.81,Single-ply,SBD,M
Boys,67.5,2,Nick Ellis,Prosper,65.5,161.03,99.79,190.51,451.32,Single-ply,SBD,M
Boys,67.5,3,Ryan Slagle,Pottsboro,67.13,170.1,108.86,172.37,451.32,Single-ply,SBD,M
Boys,67.5,4,Raul Rico,Gunter,66.32,147.42,95.25,151.95,394.63,Single-ply,SBD,M
Boys,67.5,5,Hunter McCoy,Farmersville,66.41,140.61,74.84,151.95,367.41,Single-ply,SBD,M
Boys,67.5,6,Isaiah Eley,Prosper,63.68,129.27,86.18,147.42,362.87,Single-ply,SBD,M
Boys,67.5,7,Derek Thacker,Valley View,63.96,133.81,72.57,127.01,333.39,Single-ply,SBD,M
Boys,67.5,8,Eddie Ramirez,Blue Ridge,60.69,129.27,68.04,129.27,326.59,Single-ply,SBD,M
Boys,67.5,9,Mason Snow,Gunter,64.14,136.08,56.7,127.01,319.78,Single-ply,SBD,M
Boys,67.5,10,Cash Little,Bells,64.68,117.93,70.31,131.54,319.78,Single-ply,SBD,M
Boys,67.5,11,Isaac Dickinson,Valley View,60.42,122.47,56.7,117.93,297.1,Single-ply,SBD,M
Boys,67.5,12,Jacob Tidwell,Pottsboro,66.13,99.79,70.31,122.47,292.57,Single-ply,SBD,M
Boys,67.5,DQ,Zach Wright,Van Alstyne,65.14,,,,,Single-ply,SBD,M
Boys,67.5,DQ,Shaun Hudson,Callisburg,64.59,,,,,Single-ply,SBD,M
Boys,75,1,Ty Slaughter,Anna,74.48,258.55,165.56,235.87,659.98,Single-ply,SBD,M
Boys,75,2,Gavin Clark,Whitewright,73.12,172.37,127.01,183.7,483.08,Single-ply,SBD,M
Boys,75,3,Dusty Burris,Princeton,73.12,156.49,131.54,185.97,474,Single-ply,SBD,M
Boys,75,4,Jaden Matthews,Howe,74.34,190.51,99.79,163.29,453.59,Single-ply,SBD,M
Boys,75,5,Phillip Mayfield,Princeton,71.4,158.76,113.4,176.9,449.06,Single-ply,SBD,M
Boys,75,6,Dylan Moreau,Howe,72.67,165.56,108.86,170.1,444.52,Single-ply,SBD,M
Boys,75,7,Quentin Benedict,Prosper,71.3,172.37,90.72,172.37,435.45,Single-ply,SBD,M
Boys,75,8,Dylan Robertson,Pottsboro,74.57,149.69,104.33,174.63,428.64,Single-ply,SBD,M
Boys,75,9,Jesus Duran,Farmersville,74.21,158.76,81.65,181.44,421.84,Single-ply,SBD,M
Boys,75,10,Isaac Doggett,Prosper,68.22,145.15,79.38,190.51,415.04,Single-ply,SBD,M
Boys,75,11,Trevor Coglon,Bells,74.3,156.49,83.91,156.49,396.89,Single-ply,SBD,M
Boys,75,12,David Vance,Prosper,71.3,147.42,88.45,158.76,394.63,Single-ply,SBD,M
Boys,75,13,Gavin Brown,Sanger,70.13,149.69,83.91,156.49,390.09,Single-ply,SBD,M
Boys,75,14,Brandon Perdue,Gunter,74.84,149.69,90.72,129.27,369.68,Single-ply,SBD,M
Boys,75,15,Ryan Doty,Prosper,67.59,142.88,79.38,136.08,358.34,Single-ply,SBD,M
Boys,75,16,Wade Rolen,Bells,71.12,136.08,61.23,151.95,349.27,Single-ply,SBD,M
Boys,75,17,Mason Holzer,Sanger,74.48,136.08,72.57,136.08,344.73,Single-ply,SBD,M
Boys,75,18,Bryson Wagner,Celina,71.3,97.52,52.16,111.13,260.82,Single-ply,SBD,M
Boys,75,DQ,Alex Esparza,Pottsboro,74.03,,,,,Single-ply,SBD,M
Boys,82.5,1,Tanner Hartsfield,Howe,81.01,199.58,136.08,215.46,551.11,Single-ply,SBD,M
Boys,82.5,2,Andrew Griffin,Howe,80.88,195.04,122.47,195.04,512.56,Single-ply,SBD,M
Boys,82.5,3,Tyler Durst,Princeton,78.29,185.97,127.01,185.97,498.95,Single-ply,SBD,M
Boys,82.5,4,Billy Goff,Sanger,80.92,181.44,111.13,181.44,474,Single-ply,SBD,M
Boys,82.5,5,Mason Riggs,Howe,79.33,174.63,104.33,181.44,460.4,Single-ply,SBD,M
Boys,82.5,6,Reid Brown,Farmersville,80.1,158.76,83.91,199.58,442.25,Single-ply,SBD,M
Boys,82.5,7,Gavin Ritchie,Van Alstyne,80.83,183.7,81.65,176.9,442.25,Single-ply,SBD,M
Boys,82.5,8,Nolan Klinke,Sanger,78.93,165.56,95.25,167.83,428.64,Single-ply,SBD,M
Boys,82.5,9,Joseph Villanueva,Blue Ridge,76.66,161.03,92.99,161.03,415.04,Single-ply,SBD,M
Boys,82.5,10,Jace Greening,Celina,80.47,136.08,95.25,170.1,401.43,Single-ply,SBD,M
Boys,82.5,11,Jarrett Ryon,Bells,80.83,142.88,102.06,156.49,401.43,Single-ply,SBD,M
Boys,82.5,12,Jacob Poplin,Farmersville,80.1,136.08,90.72,172.37,399.16,Single-ply,SBD,M
Boys,82.5,13,John Hill,Whitewright,78.93,145.15,92.99,156.49,394.63,Single-ply,SBD,M
Boys,82.5,14,Syler Saenz,Sanger,75.66,136.08,99.79,156.49,392.36,Single-ply,SBD,M
Boys,82.5,15,LJ Rios,Sanger,79.2,156.49,97.52,127.01,381.02,Single-ply,SBD,M
Boys,82.5,16,Kendrick McAdams,Howe,80.78,136.08,70.31,167.83,374.21,Single-ply,SBD,M
Boys,82.5,17,Kyle Gray,Pottsboro,79.38,136.08,74.84,142.88,353.8,Single-ply,SBD,M
Boys,82.5,DQ,A Loi,Garland Naaman Forest,77.66,,,,,Single-ply,SBD,M
Boys,82.5,DQ,A Loi,Garland Naaman Forest,77.66,,,,,Single-ply,SBD,M
Boys,90,1,John Cooper,Whitewright,89.54,183.7,106.59,231.33,521.63,Single-ply,SBD,M
Boys,90,2,Regan Wilkins,Princeton,86.18,167.83,124.74,192.78,485.34,Single-ply,SBD,M
Boys,90,3,Nate Patterson,Collinsville,85.64,183.7,104.33,185.97,474,Single-ply,SBD,M
Boys,90,4,Wyatt Gabel,Celina,85.18,158.76,99.79,183.7,442.25,Single-ply,SBD,M
Boys,90,5,Miguel Bravo,Valley View,87.82,181.44,90.72,156.49,428.64,Single-ply,SBD,M
Boys,90,6,Brody Wiggins,Blue Ridge,89.36,142.88,102.06,142.88,387.82,Single-ply,SBD,M
Boys,90,7,Nathan Duffee,Howe,89.72,138.35,74.84,147.42,360.61,Single-ply,SBD,M
Boys,90,8,Jacob Howell,Howe,83.55,136.08,72.57,149.69,358.34,Single-ply,SBD,M
Boys,90,9,Brandon Hubert,Pottsboro,86.18,122.47,68.04,142.88,333.39,Single-ply,SBD,M
Boys,100,1,Jarrod Huther,Sanger,94.35,226.8,170.1,226.8,623.69,Single-ply,SBD,M
Boys,100,2,Tristan Matthews,Howe,95.8,249.48,145.15,210.92,605.55,Single-ply,SBD,M
Boys,100,3,Junior Hernandez,Princeton,92.35,222.26,136.08,201.85,560.19,Single-ply,SBD,M
Boys,100,4,Jacob Taylor,Howe,97.89,208.65,127.01,219.99,555.65,Single-ply,SBD,M
Boys,100,5,Gavin Rowe,Blue Ridge,94.35,188.24,142.88,188.24,519.36,Single-ply,SBD,M
Boys,100,6,Earl Winkle,Gunter,95.89,183.7,108.86,158.76,451.32,Single-ply,SBD,M
Boys,100,7,Jaden Powell,Bells,95.44,145.15,113.4,176.9,435.45,Single-ply,SBD,M
Boys,100,8,Jonathan Padilla,Celina,91.44,170.1,86.18,172.37,428.64,Single-ply,SBD,M
Boys,100,9,Maxwell Nazarko,Van Alstyne,97.25,156.49,92.99,154.22,403.7,Single-ply,SBD,M
Boys,100,10,Erik Gonzalez,Valley View,95.25,154.22,102.06,145.15,401.43,Single-ply,SBD,M
Boys,100,DQ,Rey Lomas,Valley View,98.79,,,,,Single-ply,SBD,M
Boys,110,1,Lord Zapata,Garland Naaman Forest,107.95,226.8,156.49,204.12,587.4,Single-ply,SBD,M
Boys,110,1,Lord Zapata,Garland Naaman Forest,107.95,226.8,156.49,204.12,587.4,Single-ply,SBD,M
Boys,110,2,Cade Meyerdirk,Gunter,101.06,226.8,140.61,181.44,548.85,Single-ply,SBD,M
Boys,110,3,A. Brown,Garland Naaman Forest,101.15,208.65,111.13,215.46,535.24,Single-ply,SBD,M
Boys,110,3,A. Brown,Garland Naaman Forest,101.15,208.65,111.13,215.46,535.24,Single-ply,SBD,M
Boys,110,4,Ashton McDaniel,Pottsboro,107.32,195.04,124.74,204.12,523.9,Single-ply,SBD,M
Boys,110,5,Travis Dafft,Prosper,105.6,188.24,133.81,188.24,510.29,Single-ply,SBD,M
Boys,110,6,Chris Garrison,Howe,103.06,181.44,90.72,161.03,433.18,Single-ply,SBD,M
Boys,110,7,Evin Hughes,Bells,101.42,161.03,92.99,170.1,424.11,Single-ply,SBD,M
Boys,110,DQ,Preston Pfeifer,Prosper,103.24,204.12,158.76,190.51,,Single-ply,SBD,M
Boys,125,1,Chris Garcia,Prosper,119.39,274.42,204.12,247.21,725.75,Single-ply,SBD,M
Boys,125,2,Miller Nguyen,Garland Naaman Forest,120.29,278.96,151.95,265.35,696.26,Single-ply,SBD,M
Boys,125,2,Miller Nguyen,Garland Naaman Forest,120.29,278.96,151.95,265.35,696.26,Single-ply,SBD,M
Boys,125,3,Stephon Mudd,Garland Naaman Forest,122.92,226.8,149.69,249.48,625.96,Single-ply,SBD,M
Boys,125,3,Stephon Mudd,Garland Naaman Forest,122.92,226.8,149.69,249.48,625.96,Single-ply,SBD,M
Boys,125,4,Keylynn Rushing,Princeton,122.83,219.99,165.56,235.87,621.42,Single-ply,SBD,M
Boys,125,5,T Jackson,Garland Naaman Forest,116.85,199.58,136.08,219.99,555.65,Single-ply,SBD,M
Boys,125,5,T Jackson,Garland Naaman Forest,116.85,199.58,136.08,219.99,555.65,Single-ply,SBD,M
Boys,125,6,Levi Henry,Callisburg,110.68,226.8,129.27,188.24,544.31,Single-ply,SBD,M
Boys,125,7,Hunter Ellender,Lindsay,116.3,226.8,104.33,190.51,521.63,Single-ply,SBD,M
Boys,125,8,Gage McCarty,Sanger,114.94,199.58,136.08,181.44,517.1,Single-ply,SBD,M
Boys,125,9,Koby Williams,Pottsboro,122.56,149.69,90.72,165.56,405.97,Single-ply,SBD,M
Boys,125,DQ,Esteban Cervantes,Valley View,115.12,188.24,,,,Single-ply,SBD,M
Boys,125,DQ,N Ezidore,Garland Naaman Forest,122.74,183.7,,,,Single-ply,SBD,M
Boys,125,DQ,N Ezidore,Garland Naaman Forest,122.74,183.7,,,,Single-ply,SBD,M
Boys,125,DQ,Dylan Templeman,Princeton,123.2,199.58,165.56,,,Single-ply,SBD,M
Boys,125+,1,Sheldon Parkman,Gunter,133.81,317.51,172.37,226.8,716.68,Single-ply,SBD,M
Boys,125+,2,Travis Shouse,Anna,135.26,278.96,167.83,204.12,650.91,Single-ply,SBD,M
Boys,125+,3,Mike Grimes,Princeton,156.49,238.14,181.44,208.65,628.23,Single-ply,SBD,M
Boys,125+,4,Dominic Little,Whitewright,138.89,265.35,145.15,174.63,585.13,Single-ply,SBD,M
Boys,125+,5,Kayl Powers,Collinsville,126.1,195.04,142.88,240.4,578.33,Single-ply,SBD,M
Boys,125+,6,Kyle Duke,Whitewright,127.01,201.85,111.13,188.24,501.22,Single-ply,SBD,M
Boys,125+,7,Mason McCall,Pottsboro,132.54,145.15,111.13,145.15,401.43,Single-ply,SBD,M
