{
	"baseUrl": "https://staging.dev.work.relexsolutions.com/",
	"watchForFileChanges": true,
	"reporter": "cypress-multi-reporters",
	"reporterOptions": {
		"reporterEnabled": "mochawesome",
		"mochawesomeReporterOptions": {
			"reportDir": "cypress/reports/mocha",
			"quite": true,
			"overwrite": false,
			"html": false,
			"json": true
		}
	},
	"video": false,
  "screenshotOnRunFailure": true,
	"defaultCommandTimeout": 20000,
	"pageLoadTimeout": 50000,
	"projectId": "7q4d4u",
	"env": {
		"permissions_signing_key": "q_:12T8(23Vm+Y6#2_fYGf}#8sx]FtbwItigcUlhiJ89gMBY6$#TkCHtC%mhT#y[",
		"ta_pad_basic_username": "time-and-attendance",
		"ta_pad_basic_password": "Y[JVTEmvTk8MZEUNNyt[xqfX5>ItHqop"
	},
	"retries": {
		"runMode": 2,
		"openMode": 2
	}
}
