{
    "Account Holders Info": [
        {
            "name": "FirstName1 LastName1",
            "age": 30,
            "city": "CityA",
            "coordinates": {
                "lat": 20.157,
                "long": 19.4532
            },
            "accounts": [
                {
                    "bank": "XYZ",
                    "account id": "XYZ-423467",
                    "balance": 500.45,
                    "currency": "USD"
                },
                {
                    "bank": "ABC",
                    "account id": "ABC-753390",
                    "balance": 890.70,
                    "currency": "PKR"
                },
                {
                    "bank": "RQ8",
                    "account id": "RQ8-036831",
                    "balance": 312.07,
                    "currency": "EUR"
                }
            ]
        },
        {
            "name": "FirstName2 LastName2",
            "age": 57,
            "city": "CityH",
            "coordinates": {
                "lat": 75.156,
                "long": 40.5631
            },
            "accounts": [
                {
                    "bank": "TY5",
                    "account id": "TY5-718743",
                    "balance": 585.120,
                    "currency": "EUR"
                },
                {
                    "bank": "RQ8",
                    "account id": "RQ8-897513",
                    "balance": 900.25,
                    "currency": "SAR"
                }
            ]
        },
        {
            "name": "FirstName3 LastName3",
            "age": 24,
            "city": "CityW",
            "coordinates": {
                "lat": 518.12,
                "long": 398.647507
            },
            "accounts": []
        },
        {
            "name": "FirstName4 LastName4",
            "age": 34,
            "city": "CityP",
            "coordinates": {
                "lat": 245.457,
                "long": 22.15668
            },
            "accounts": [
                {
                    "bank": "ABC",
                    "account id": "ABC-856432",
                    "balance": 154.151,
                    "currency": "PKR"
                },
                {
                    "bank": "EFG",
                    "account id": "EFG-374516",
                    "balance": 10540,
                    "currency": "SAR"
                },
                {
                    "bank": "QRS",
                    "account id": "QRS-456312",
                    "balance": 1357.97,
                    "currency": "TRY"
                },
                {
                    "bank": "Z7L",
                    "account id": "Z7L-658132",
                    "balance": 196.2,
                    "currency": "CAD"
                }
            ]
        }
    ]
}