{"_id":{"$oid":"597393108c3ed3000422c0ca"},"permissions":{"consentToken":"Atza|IwEBIAGv88qoh4DK69RNJ_OJkFpDBCMsl19PmofVQLgS3iWd0SiOPmLUmh5Z9aZlesGeFfshRzmLnUpEqMHYhMEcX1YcuvWNBi6nyA3c3bCzWuAV1lnBYkM3SEf6tRkyO4eX9I1LNngBVAEI4VVIoG4N56YIR3lz8ezKuF02Rtt8pXM9-3pxNE0YoJM_CT25WBsThnmlxSxnaQz7_TtK0DKB-UNzU1QFMEQR-RSOk5GJOFVUW5B_jBcjf31pm_-Bqb5tIx_JkV2xm4mYCH-gx0VOrO2EBxaNJ2nxnjttansxJQzShwcbGSWKvgzHJyLAKYiZOVIv88nUO_pnoH8J9RbpzCXBGo0sqhntOqJUAKcvQ-LuM3fOSK8mGg8YLtjfaHLI4NOVpxEZ-ztDX4_MRUdHGkjHVdGqD1oBFY-yKGg4XF_IcmuNF0Tr--hrhyKTD7c_o12SZjB_jdK4vm81E2y68WYQ"},"deviceId":"amzn1.ask.device.AF33SFEGAYMA4AXBJI6WSGZT2ZQYTKTUJXXAZQDVPUBSMNZP4WJUFOEZSO7EQ63YRDURJQ5OJROYWH7TLO2KQDDSNU6FKT5ZAKZREZDNZP2Z6KNE632ZWQ4DMRAGUYTJ6IJIIOHE3GQKDNX2YQYG267CN5JA","amzn_id":"amzn1.ask.account.AHSREGNSBJX3OZE7W6YWZNIX7BYQWVLYHXVA525FIGUJUARSWNOFXX2E7W2AZGXRB3C6JAOHB5Q23U6Y3AJEHNZ2DWLZMMIVLICGUQIATGGC5Q53ZDJZX6LTV5S3ZFTOW5HHCRWNXHXTOVERNPMGYIDLTCESC7FBNI2XK5TFSGSQKY6VJG42DGMSGLXB2UFOPZRWEZ6M2ATT2XA","__v":0,"activity":{"launch":19,"search":6,"community":2},"lastAttempt":{"stamp":"July 22nd 2017, 6:58:58 pm","token":"community"},"search_history":{"search":["order","Ash","Purple Goo","Goo"]},"address":"{\"addressLine1\":null,\"addressLine2\":null,\"addressLine3\":null,\"districtOrCounty\":null,\"stateOrRegion\":null,\"city\":null,\"countryCode\":\"US\",\"postalCode\":\"27601\"}"}
{"_id":{"$oid":"5973a59c8553130004931e4b"},"address":"{\"addressLine1\":null,\"addressLine2\":null,\"addressLine3\":null,\"districtOrCounty\":null,\"stateOrRegion\":null,\"city\":null,\"countryCode\":\"US\",\"postalCode\":\"27601\"}","deviceId":"amzn1.ask.device.AGPTLNCQX2WHPXHPXI7L6I3S5CJNWRWVBIHNEECDLNIM67BONUWAAWDJHSJSUN3YSCS6UZQMM2TRNTJRFR7355DWC7P5NO64TM5TULNL6MRYCQ65LCI4F6JKAPXABR7PZYUZF4TRWIETJRLYGP7V7E5PG5VA","amzn_id":"amzn1.ask.account.AGUOWFIR7NFGWBSVJNKKS6Y6JQ6PFH66GIHQCKTPAXBJ6BERIAHFZPOSX6SQ4BTQMXT436YJXHRFHIKTBQVVVU62RKL5TRW272DC5QFVEQUA2ARVWGDVZMF3U6C4IZLCGKKRWKH6E4B4J7EIA6KORC5LMY3ZASLULAVU2MUCROCYWCP5PYG2M2RFRLNNOBYJDOH7C3R3VUSPWAI","__v":0,"activity":{"random":1,"search":11,"rewards":3,"medical":1,"type":3,"community":33,"launch":29,"flavors":4,"joke":4,"searchBy":32,"recipe":7,"help":3,"list":1,"fact":1,"nearby":3},"lastAttempt":{"stamp":"August 6th 2017, 11:53:08 pm","token":"search"},"search_history":{"list":["all"],"search":["cannabis news","l","pottsown","Zen","khalifa can't have this company","Blue Dream","tropical wavered strings","cramps","Purple Haze"],"flavors":["Goo","Purple Haze","Sweet Flavors"],"type":["Purple Haze"],"medical":["Goo"],"searchBy":["earthy","sweet","pain","good","happy","bubble-gum","gum","candy","butter","tropical","men","meant","lemon","ammonia","anxious","cramps","paranoid","mouth"],"recipe":["Okra Pilau","AMF"]},"age":true,"fail_terms":{"searchBy":["noQuery"]},"fails":{"searchBy":1},"lastFail":{"stamp":"August 6th 2017, 10:51:12 pm","token":"searchBy"}}
{"_id":{"$oid":"5977f08f6b04a80004686621"},"address":"{\"addressLine1\":\"47 ELM ST\",\"addressLine2\":null,\"addressLine3\":null,\"districtOrCounty\":null,\"stateOrRegion\":\"NH\",\"city\":\"NORTHFIELD\",\"countryCode\":\"US\",\"postalCode\":\"03276-1528\"}","deviceId":"amzn1.ask.device.AFGXUXSGT5SKK6L7ID6V5DDWEVMUS4JZUENGEFKWC3HA4OIVKNB5HMM5LLEMHQBS5JMPZSJ6N7EMDUWGNU7KKKND5UGKVHTK7ANUIGJU5T5UJ5RZUHCPOG2EFRFWMSW2TT2TJ5HHQQ22VFVSY3WIZPEKYN4Q","amzn_id":"amzn1.ask.account.AFPOE3CUMODSYZEQKWTFLBBPVSSJQSWGQWUU2CO4X2UQQGR73ESJDO2RPZTFFCUUZCSB3V6C6MIEYXURIEAPOLH2CGLQHB2W5WMA36NGC6QE4R4IWFAGB7C3DNQIOMZNNQCSLY6LBBO3QBFIMWFTJ7QGMQP7GWGS4F75KQIZ4JJIGPSBD5PIKPGK6KD7HADNBSORVRJ7XSYC7RQ","__v":0,"activity":{"joke":1},"lastAttempt":{"stamp":"July 26th 2017, 1:30:08 am","token":"joke"}}
{"_id":{"$oid":"59780b656b04a80004686626"},"address":"{\"addressLine1\":null,\"addressLine2\":null,\"addressLine3\":null,\"districtOrCounty\":null,\"stateOrRegion\":null,\"city\":null,\"countryCode\":\"US\",\"postalCode\":\"08002\"}","deviceId":"amzn1.ask.device.AFFBTLBSM3Y5U2T7RFRRK6CDLUYRFBF2UMKT3GOXI34AWXUSO65WO2CSOKBXP6DPQ7XR7WD2HW6GIU2FO7ZOBGA6T4JIGUCOTWWRMF5RUVMPBE3SBDOH7MG2NUL66UOUYNNKLXAAAJWNSCTBAH33FWWNSACA","amzn_id":"amzn1.ask.account.AGLCR26536J4RFD2C2OFRNHJVDO3RPZV35ZZTCA3EL3HNCRIKM2XPYTVFHZOFXDKROAXS3M4OPRKETAERPF6FD5XWJ3NYIXDZNZ4T4S54CKDTJBC4APE4IIQHMC4KS2JQNKPIUSSUCGCWF7J7XQMJ5TGDSMHLX5SR3EKRE7U7EMHZT7AMMSQUPSIX5FTSS4AERHUYQTXRDLTRDY","__v":0,"activity":{"search":1},"lastAttempt":{"stamp":"July 26th 2017, 3:25:25 am","token":"search"},"search_history":{"search":["Purple Haze"]}}
{"_id":{"$oid":"59780dd26b04a80004686627"},"address":"{\"addressLine1\":null,\"addressLine2\":null,\"addressLine3\":null,\"districtOrCounty\":null,\"stateOrRegion\":null,\"city\":null,\"countryCode\":\"US\",\"postalCode\":\"48161\"}","deviceId":"amzn1.ask.device.AEGZJ4NUMGQLMZQVMR5QAJEYRUNNGSI3BZ2AOLZE36NTDFKJZ35PLZUAYPM2BFP67UAB63NYZN65VYLAEYX3453DBDX5IGIQ5EKSCLQJY6MEFXXXODKJHF4UIFSQ3JYWIEKGIKWJ63TRVZDLCM4G5D6TOERA","amzn_id":"amzn1.ask.account.AE432F62B44ECH43NIONMPPTH2I72YNAOO5TH2MCBPBLDBQ334YPKWY6SN74BY7QZDTY2QGDUF72DXNVE7YMXCVPF6GAP5PRAYNKEUSBHWSHYPJRM54VNPSTVPLPW624MVUF5HSS55ZKGAGHXL6QJERB33FLK7VFMJJ4UGYPZDV7SAUDNXYMB5PHYMUNKS4B74IXJPYOI67HKYA","__v":0,"activity":{"search":1,"launch":1},"lastAttempt":{"stamp":"July 26th 2017, 3:35:40 am","token":"search"},"search_history":{"search":["Purple Haze"]}}
{"_id":{"$oid":"597840b66b04a8000468662c"},"address":"{\"addressLine1\":\"5562 Dunbar Ct\",\"addressLine2\":null,\"addressLine3\":null,\"districtOrCounty\":\"El Paso\",\"stateOrRegion\":\"CO\",\"city\":\"Colorado Springs\",\"countryCode\":\"US\",\"postalCode\":\"80918\"}","deviceId":"amzn1.ask.device.AEARNMU662EXNPWVF3BQWSH7F27O53A7IO46IJ5EG7GT2OUFNZVSDFUYJP5WUVSG6MB254RRV2NCPVH2GMN5TGAT56IIC2ZCP4XG3DPCGW65RSMFM35G6SO442MH5WXUX5XKNKM3KXKI6KWRD4PUBWN3VAAQ","amzn_id":"amzn1.ask.account.AEWMDZNUL4MPXYRLSSHEPOHHOX3XQGYHXNBEYCCJ477CWOM3UENEBFFOYLGTSZQJ4LL3FMGDSLB6YPYNI2I5EZBGUPWXEB6JUKOYFT2RUNFFSVYOP23U6KWI5T2LBO3CHKDDHMBDR2NK4DJUFC6BRG4JFBVS3LA7N6DR7A4NBDHWYVXU2SPMMFD3GGWME4GE5S3NJ2BZ3XUPBLI","__v":0,"activity":{"community":1},"lastAttempt":{"stamp":"July 26th 2017, 7:12:23 am","token":"community"}}
{"_id":{"$oid":"597975b56b8d0400040e5e7b"},"address":"{\"addressLine1\":null,\"addressLine2\":null,\"addressLine3\":null,\"districtOrCounty\":null,\"stateOrRegion\":null,\"city\":null,\"countryCode\":\"US\",\"postalCode\":\"90603\"}","deviceId":"amzn1.ask.device.AF4B4WK65ZCINK3DIWMO2VUVS2H775CFZTNECHVSUZW4S7RRDGWP37F3SX2BXNWHN7L45F3SEEOKVGC4KNDEECFF27INU4OB7OLEKDUVT3GKILPXLBVNUMVCRYGM465WS73D2I3WBCFFTGIOFDDGIHOMVUBA","amzn_id":"amzn1.ask.account.AGR5RRYC3WN37EKQMF4NKPG6BFPWBFXZNOD2LRGIZCV3DVG2CJNAHKKOZKNAK274DQJYP7JG5FLAME573WA5X4HICWNP2NV5ZATKV5NKK3HYYBMWJ2YXROQK2M2UFPRBDSQAU4IRTPCISXRSUNZAT24KUS6ZU6QEEEWS3DTLQ5OUZELILDIZZ4QFS24FEF7TMNPLWDYHEWAH6VY","__v":0,"activity":{"community":1,"effects":3,"clarify":1,"launch":1,"medical":2,"searchBy":1,"search":3,"help":1},"lastAttempt":{"stamp":"July 28th 2017, 4:42:59 am","token":"community"},"search_history":{"medical":["Sexy Back"],"search":["week","the hybrid clementine","Clementine"],"effects":["Sativa","Clementine"]},"clarify_terms":{"search":["we'd"]}}
{"_id":{"$oid":"597a78f7bcd7ea00040b6096"},"address":"{\"addressLine1\":null,\"addressLine2\":null,\"addressLine3\":null,\"districtOrCounty\":null,\"stateOrRegion\":null,\"city\":null,\"countryCode\":\"US\",\"postalCode\":\"92101\"}","deviceId":"amzn1.ask.device.AGBCUNXLG3VISK3WTJY3WC66BH23W4EEL23G6MGAZUSHDHXD2TBSNOYX2I3U72NM6RDHDGTLTLLT6TZC5MNNLOI755WXDAMFEAT64DMTSWONRSIDFZYDPAT6KDL6K663UL6TMNWEP53NTMS2PMZGOHOBCOEA","amzn_id":"amzn1.ask.account.AE6LYSXK4BH72UN5N22BFJQWV5PUH3L2TKKAG3VUW3SNKPJ4JCGKRKMCCWAUVXMYVWI76TMGCTTNAPZWTAOV5H5J7ET4V2PNIL6U57DZWS6CA67BG2ADWEU6PAA5NNRGYIL2PKJACCMTQZCEJZYFWHOEWINTZFQBDFKLZ6Q3M2DWDFBR6R54YM46SHJAUMB6NNGU5ONMUZIIXUY","__v":0,"activity":{"search":1,"launch":1},"lastAttempt":{"stamp":"July 28th 2017, 12:42:45 am","token":"search"},"search_history":{"search":["Purple Haze"]}}
{"_id":{"$oid":"597a7d04bcd7ea00040b6097"},"address":"{\"addressLine1\":null,\"addressLine2\":null,\"addressLine3\":null,\"districtOrCounty\":null,\"stateOrRegion\":null,\"city\":null,\"countryCode\":\"US\",\"postalCode\":\"63011\"}","deviceId":"amzn1.ask.device.AFJUZG77YPTW5ET26UJOQXBBDTHNXPTNLS6OG6252UQQKW7K7NBBMZX334QCVPPV7TSUCCK2XYADII6WJ267AE3JJJM3PEMU4K4MR5HAKUPR7IH4EGXYQUQ7VJUTYKILWGLZRIVVGUUWNMEJT4NFH5KB6WBQ","amzn_id":"amzn1.ask.account.AFSKVQR4YQVYRX2QZGS7OOCDFROIFXWCDA7SKDSCPYS2JZOECQUXRZN32W5B3G4ZF7IPN7PB6FMHIHEEBZ44IZMHVOVB4Q6PGRIQYDYFODBTJD76MPREVVB3DUCGEBT4KA5VQSZRXSXAMSTFDV6ZPFWCJBMAWYAEDVU6FAZPDTVT56OL2WWDFB4SOBY2FYETCNDF5TKBJ5IDXTY","__v":0}
{"_id":{"$oid":"597abcb5bcd7ea00040b60c6"},"address":"{\"addressLine1\":\"8133 Hannett Ave NE\",\"addressLine2\":null,\"addressLine3\":null,\"districtOrCounty\":\"Bernalillo\",\"stateOrRegion\":\"NM\",\"city\":\"Albuquerque\",\"countryCode\":\"US\",\"postalCode\":\"87110\"}","deviceId":"amzn1.ask.device.AHLQIFBF7XFUIXIZ54NDCWV5JVCLHIB43V6X5BFJOCRWRUL3VZJ7WL3GPG7CHPHTVUDBCTRUE7NEH3GTJIZQULWT2UGVV3CJGSBBU5Y3D5FOF4YGT7IXVN33IL4PRLCYHGYVSIIJDXBQDXLLSOUMKBR3ESJA","amzn_id":"amzn1.ask.account.AEJGYRZGTBKN7UQJUIJZMEZGH3CD5NVNSEDKDU2L454HI5SNEMZWQOSK6GP3VPMTLQNU5KYPVNHOUNEFLWM5UOYKF4WH4DJCEMYUEBZOIXX2THCGN6UFKFAXIDHBVT4FX5FXQZTHGV2WTQ3YJZJE4CS5MPBTBMGUNS27BCWZVESBGRQGNUA7BPZRRYET7NR5YNRRYQ5URNY2QJA","__v":0,"activity":{"search":1},"lastAttempt":{"stamp":"July 28th 2017, 4:26:25 am","token":"search"},"search_history":{"search":["Jock Horror"]}}
{"_id":{"$oid":"597b860b9b288f0004208279"},"address":"{\"addressLine1\":\"2093 MARINE DR\",\"addressLine2\":null,\"addressLine3\":null,\"districtOrCounty\":null,\"stateOrRegion\":\"OR\",\"city\":\"ASTORIA\",\"countryCode\":\"US\",\"postalCode\":\"97103-3427\"}","deviceId":"amzn1.ask.device.AFK6C7ADT5K2QKHU4MBUJDGHZPAT4LC4RQ3MRLV3J6XTEWUCT5XZ2VX6HH2DMCW57KLXJHXTJCNNBT7R72X6WCGPRLBMF3GNJ5ZVHXU7Z3POTTPCXDIJUDITUDUTX6V57FGB3SDUANH24MTQH5RMQWJZRAAA","amzn_id":"amzn1.ask.account.AHIASOEAKALR6WUGNQSIEKCBXIMZAV66P3676TBOERR35JLLEW2YL4XLF4D7CECASVMH4NP6YNXIHRKKU7OQUOSU52CZIDPNO3AZT3CNLB75NR3FNXOGHWW7UU27WSIFLNWOL4FHTL5ZCWCDDDOWDDM7JXXVDYJWRVKPJQ6XGWBSS5JHS57XSKGCKSF6C3SLU4KCQNMWK43FAMI","__v":0,"activity":{"clarify":1,"list":1},"lastAttempt":{"stamp":"July 28th 2017, 6:45:50 pm","token":"clarify"},"search_history":{"list":["all"]},"clarify_terms":{"search":["no"]}}
{"_id":{"$oid":"597bca3f9b288f0004208287"},"address":"{\"addressLine1\":\"7352 Lazy Hammock Way\",\"addressLine2\":null,\"addressLine3\":null,\"districtOrCounty\":\"Hall\",\"stateOrRegion\":\"GA\",\"city\":\"Flowery Branch\",\"countryCode\":\"US\",\"postalCode\":\"30542\"}","deviceId":"amzn1.ask.device.AG2FHQI7RIEVE2CMKK2JBYNBKDBBCVK4JTR6WMSMXKTAR6L5EH5GJDN3EKCAALBF5ZHFRW6MWHSSCHAVSL2TDMTKLMUZAYUMMVYNBNNLOYD3JXLWWVM3VKAZHXST4ZI63B666MQZEBWY4CDUEVUKZX44R3SQ","amzn_id":"amzn1.ask.account.AH4HC4X73NFQRFMJZ4J7NG43ARAIVJMKBTFFHG3BIXVMGQSJ5BJOBJAZRXO32L4D25BSNGUYDKDZKLJF4HBTFNT7ZXOPK2IM6FZF2F7R375U5S2IO7ORJT6GT367J7IQYPYO4BZ2JI4JMPY5ZNBWR6WYS3IKHMHX74NBW5NNZMWWT7A77HLPCYCK3LRGA7VFPDGDP3YIZU5YIOQ","__v":0}
{"_id":{"$oid":"597bd5539b288f000420828a"},"address":"{\"type\":\"FORBIDDEN\",\"message\":\"Invalid authentication token.\"}","deviceId":"amzn1.ask.device.AGSQNSJFSLP7ALSXPP4HZAJM76TD7A2E7EMKDSGJP53PH7ZLXWW2AVELHTDXKI53AIZOCBZ4MTYYUOCQGCHFXXXU6CSJEO3MDWCK7SAWULGRKLE2LJJCCQ2BQO4BOE2BA3UBLBMC7XG4RH3ZLXSJMP3PN3QQ","amzn_id":"amzn1.ask.account.AGBOATK3NRWL4D5FQHPFNA2HITRJZZR6CQSKS5T3ZJC7I4YVWCS3Z6LNHFROOQ6YGTD5WFTLWHFU2XECOS6XCDDH7QS4B4ORV47EN4EUYHEWOJF6H4WVSKZFKKJBBKLMJGUTASFCUPID2ZIWMVEJDFFEFLBPIOIZLZIEOUMREQ6RRFQHRFMWDV2J6Q7TGWFZ4POLVAJEYPV72ZI","__v":0,"activity":{"rewards":1,"launch":1},"lastAttempt":{"stamp":"July 29th 2017, 12:23:23 am","token":"rewards"}}
{"_id":{"$oid":"597d31f1b5d39f0004c25a5f"},"address":"{\"addressLine1\":null,\"addressLine2\":null,\"addressLine3\":null,\"districtOrCounty\":null,\"stateOrRegion\":null,\"city\":null,\"countryCode\":\"US\",\"postalCode\":\"49002\"}","deviceId":"amzn1.ask.device.AE4AVMAFACALKLUSVQEWDELEPHG2P7RM6GJJAUXFIQDHKPD7ETCV6P7RP4TBWBMNYJYGBLZV5CFOE2NJ5Y3UGIWQLDZIBX6W4DRYRG5YRK2GMLCWLAWQNRS3NWDUPZAT6U4RFYBWLEIYUQOQ2RSTUGFWRKSA","amzn_id":"amzn1.ask.account.AE3OCWT6OR4PNR6Q6XTLIMX5TTHZVQZT5BXHYH6E3QYD5LPSDGO2XL7WCFWIHGQYQ75BYH5PW2HIMJ2CODQHEAW6KHFLOEFIOKOS7SEAQJJXMOB2575RLOFBHO5Z7OHTLWCDEHY2Q4H4D62W2BADHTAGHZIINWS5G2DCHDVTLO5JAQ5XLUI4M25QJOWG2LH5VGSMDKDCBJL6W2I","__v":0,"activity":{"medical":1,"rewards":2,"search":2},"lastAttempt":{"stamp":"July 30th 2017, 1:11:02 am","token":"search"},"search_history":{"search":["that again","Puna Budder"],"medical":["Whey"]}}
{"_id":{"$oid":"597d4930b5d39f0004c25a6f"},"address":"{\"addressLine1\":\"13730 MESQUITE AVE # B\",\"addressLine2\":null,\"addressLine3\":null,\"districtOrCounty\":null,\"stateOrRegion\":\"CA\",\"city\":\"DESERT HOT SPRINGS\",\"countryCode\":\"US\",\"postalCode\":\"92240-5937\"}","deviceId":"amzn1.ask.device.AHZX3BUJ72ZSID37VC23BV64S6EYJPMCTJJGVBFIPBTMAZH55TXDRVT67JDJTD7SHBVCXQWZHUONZBMKNZBHYBGKOTA2CX4B3VX2IJWOVMCEDPP7KBKW4THQJ3THGRYVIBPMCLMZUVNG5ED7JAKM4XVNP2EQ","amzn_id":"amzn1.ask.account.AEPKMXRYBMNGCQD5KLPNXM3RPW2S5VDYI76BKSCBQAECYLAZD5KWXVODKHSBHJMFWUJECJ2XNLRJ3GVDY5CKUEA5GOZTYS5E2OWSCJY6BQU3X3QENSMYMRISRHPRMZ3JFM3V5TPXXUNGIDJ3QFQMOUXPKIOXIKQOC4RAR6QPTCMMKWZMHW6Y5CEXMNT7BPEECEOTCWEY6K6WULY","__v":0,"activity":{"community":2,"search":10,"flavors":1,"launch":2,"list":2},"lastAttempt":{"stamp":"August 7th 2017, 11:29:40 pm","token":"community"},"search_history":{"flavors":["Holy Grail Kush"],"search":["Holy Grail Kush","Pearl Scout Cookies","Abusive OG","Sour Cookies","music g.","Trinity","Dogwalker OG","Goji OG","Ghost OG"],"list":["Indica sativa"]},"age":true}
{"_id":{"$oid":"597de2c0b5d39f0004c25a96"},"address":"{\"addressLine1\":null,\"addressLine2\":null,\"addressLine3\":null,\"districtOrCounty\":null,\"stateOrRegion\":null,\"city\":null,\"countryCode\":\"US\",\"postalCode\":\"90001\"}","deviceId":"amzn1.ask.device.AECN6CMDNAINFGUHRJALZTRLJNS5FEUJCNGNM3P6ILDU6UILDMWO3DKGQCFLNRODWBKZFUHBS2CQBZVSMKKRPJMEHN75XI6SUDECCIP3IUHN4H5JQIBKM6KTBUU476GC7VYZOMO4RTW37YXPYDYWHOD556YA","amzn_id":"amzn1.ask.account.AE3WSGAJPESSTI5VYAD7M57UTRTSVHATZ5POTUVGY3HEYSXGFJPRZBZ35TSGGGKGHDB44AYD3MK275N4W2DPM5S4CGW2TMIRGGS33OHAGIABRPNWDPZNRTTE224NKXXUZLRSZZQ2N7NB7TZCTJQHYMF743BZSZEU5EHRDAGHTIOYLI432YTUHBJL2PBMPPEKXEXKO2TGQNMKTGY","__v":0,"activity":{"community":1},"lastAttempt":{"stamp":"July 30th 2017, 1:45:32 pm","token":"community"}}
{"_id":{"$oid":"597e52d70ac1020004132c04"},"address":"{\"addressLine1\":\"111 Hicks St\",\"addressLine2\":null,\"addressLine3\":null,\"districtOrCounty\":\"Kings\",\"stateOrRegion\":\"NY\",\"city\":\"Brooklyn\",\"countryCode\":\"US\",\"postalCode\":\"11201\"}","deviceId":"amzn1.ask.device.AH56QQB6TH3AR5AU5O4J23S2AOPM4VMWI57G376PEG2J4LUJSKYZQMQATIR46US5U3DVGBUHDBMJKRADZ3T2OVTV2O46MHRL4EK3IGN6YHQR2HQZTZHHGCMY65WHYAY7ECTNF2TKLENH2TL6FELQMYJ4QUSQ","amzn_id":"amzn1.ask.account.AHA47KOERKTX5VAYFIHRFA67X7BR5JDRTNAJ2LZ55JKPSEM2L67HACTW3GTRQTX5YDRZAHWWZVCPGNSEBCCQSCF2OIOA6MANA3FYXSO2NTVUWM2MN3Z5VB3WXLTDVNXDXON7JYMF7BLIX7SSQDCWLQCKYSH4XJCPXRVNIO5RE4GY3VN3NPIRKCZV6M3H2VS7SNMWHZJFT3AJEAI","__v":0}
{"_id":{"$oid":"597f060e0ac1020004132c31"},"address":"{\"addressLine1\":\"4468 Riverwood Forest Ct\",\"addressLine2\":null,\"addressLine3\":null,\"districtOrCounty\":\"Dekalb\",\"stateOrRegion\":\"GA\",\"city\":\"Decatur\",\"countryCode\":\"US\",\"postalCode\":\"30035\"}","deviceId":"amzn1.ask.device.AFQRTSMFBUFLKG5AQBYLA5FCNKPGZLAJ4BSWOG4XCVQLUO2GQQ3FFDKLP36JVZ4RD27M3KZIHSJ5VDGNLC7I5HKTWZ72TOIRYOCZYTK2QI3E7ED53SSXO5E5EOJFAMZLUK6ZFT2NQD3TY24GVLDHCMJXUBBA","amzn_id":"amzn1.ask.account.AFAPTR466EAFJDYKVAVPNYIQGLJJPXTTCUYXAWQOC54HK4UENMOXOWZ73N52XCH3BOJXHK6FB6ASPNL7DEVVGRZMN5LBCPNK6NBE34SQFGKTEP2ZPN45E5WDO74RXU3TRPAEJ7Z3ME2AEBGLMIEBRMSY4WDVTIAB3IQ4KE3TGNGZPNLPXUEGK3K2UAIAWZUOOZHVXWV6WGI64KA","__v":0}
{"_id":{"$oid":"597fc4f6b73fab00048dbd18"},"address":"{\"addressLine1\":\"1052 MARK ST\",\"addressLine2\":null,\"addressLine3\":null,\"districtOrCounty\":null,\"stateOrRegion\":\"IL\",\"city\":\"SOUTH ELGIN\",\"countryCode\":\"US\",\"postalCode\":\"60177-2543\"}","deviceId":"amzn1.ask.device.AENST6FIGU2II3JLX3TIGITJCJGNEWYR3IS64RWALK4TA3ZW5CXQQRLXZWXAAR2YBFGRQFRRIORXZS56L6DK4XFBY2VOETVSMTWYYWVDXYGCKDMFMMYSHHZEP2SWDAKIUO3CYZOQHU3W24TWMGQ5UL5VVXKA","amzn_id":"amzn1.ask.account.AFMXQZES7QZC7S62GIGVOGA3OMKJY35JTMIJCXJSEDBRSKDMTYYKIQLCE34RMTNJ6UP5LDWBLR4TUTZBN22SYH2GN72KW5FBTWSYVNOI5NLCZYRKW7RVGTCL7UGXMYBXISCRD7MLBY6NKJNTWGDQJ3EEQXRCT2HQ4SGAR3JTMTM55CEDMZMK7DDJDXS44OYJ5PFZDHLP624P53A","__v":0,"activity":{"community":1,"medical":2,"rewards":1},"lastAttempt":{"stamp":"August 1st 2017, 12:02:39 am","token":"community"}}
{"_id":{"$oid":"597feec7b73fab00048dbd37"},"address":"{\"addressLine1\":\"6501 W Medalist Cir\",\"addressLine2\":null,\"addressLine3\":null,\"districtOrCounty\":\"Collin\",\"stateOrRegion\":\"TX\",\"city\":\"Plano\",\"countryCode\":\"US\",\"postalCode\":\"75023\"}","deviceId":"amzn1.ask.device.AHHHPVAIIGV5S6Y7SS434M2KEQUP7C3MB5DZYFDF7XCDGZSEMA6OPOKBXFDR6LNGMPADLNZI5FDGKPECBQ5W7OO4X3UYX5GW6FTOKFEW3DHQIRCTL7SEUALHNLDXYHKSV4Z7YY4MCIBVWMX64VRW575CUGYQ","amzn_id":"amzn1.ask.account.AEJR3XLCDQRSCIRFTKRZ6WIAPDB6I5POL2NI7NJLXVQC6LGYCOQ6NXPFCNDKYXL2GGV64TACXWHEHUIOUSEOUKLGGS6LLOHQ6NGUXEMT2P5X7QPTWL6P7NNQKE23VJC6NTHRKA234C2FTGJKIAF57CI6GFAOSFGFMMSLDPSP642WLHUWCPZWRQ5MOLNIRMYAFZGJM4LCBN4VXXQ","__v":0,"activity":{"search":3,"joke":2,"launch":3},"lastAttempt":{"stamp":"August 4th 2017, 11:45:43 pm","token":"search"},"age":true,"search_history":{"search":["Dragon OG","Angel OG"]}}
{"_id":{"$oid":"5980bb6cb73fab00048dbd3d"},"address":"{\"addressLine1\":null,\"addressLine2\":null,\"addressLine3\":null,\"districtOrCounty\":null,\"stateOrRegion\":null,\"city\":null,\"countryCode\":\"US\",\"postalCode\":\"62837\"}","deviceId":"amzn1.ask.device.AEX4FYBMQDLQKYQTJQY3D4H4DF3JXUMGBFTQSIXNKNIBY3ANN2E6F42VIKNYHZKXONFGLCNNH2PF5WEY34K24SBQZ4VC4C2JEGX5VY5OWZTQE74J4OAZIAIMZ5UUV47XQPRUW3EHM4UYOTRWRJ4OWGZSMMLQ","amzn_id":"amzn1.ask.account.AHDCR4O64DGPNEYHOJHN6QSGM74SXMKSTACJATRMP36HYG4UFLYVYKFOWO5RMOHLV5EDHPWVAA4JNZCQJOBMR4FQDGQK7HWU2F7LDNICUABK3K77QOAYQNF7DZWYOLZQFM7T6LHRVSHJ7YAK4ZNY6KDOA6S7AVH3W75WDIH5X2WJO5HW7VJIQLPBP5BON7C2E53UYLY5MTV6EEI","__v":0,"activity":{"searchBy":1},"lastAttempt":{"stamp":"August 1st 2017, 5:34:34 pm","token":"searchBy"}}
{"_id":{"$oid":"5980c569b73fab00048dbd44"},"address":"{\"addressLine1\":\"4026 GREENES WAY CIR\",\"addressLine2\":null,\"addressLine3\":null,\"districtOrCounty\":null,\"stateOrRegion\":\"PA\",\"city\":\"COLLEGEVILLE\",\"countryCode\":\"US\",\"postalCode\":\"19426-3179\"}","deviceId":"amzn1.ask.device.AED6UF4GKEIVVR2F5BZKN5BYZHF3QCZDSR3HDV4WJAHFRMMEBH7CWXNBGQVJ7JG2IINR4UFE4BYTB3LNU6OJ6H52YXKF26GJI5C2NCFKFZWEPZDTWJ4Q6DTCFYQJPECO4UZLN64XMCRMHAOYSTUXAL5J3OAQ","amzn_id":"amzn1.ask.account.AENRKBE4IDFM5OVUOKWL7K6GBOKERIEOCTZTMBNKCYZIEJQQBQUYVQDHU7VYSOW4NK4AGVJ4S5PTOBIFB5EVRESU6EGK3JXPCYHPJNOB7BKZ2UIARMBZC3VUVPKUMDKYRJC5WMJBVMWQV42XQF3OFCKFPDFXCF6KMEFHTAMXZG74ZN2OJ3L2BDU5QIX4ZL4CJZOOQLN52FVNQ4A","__v":0,"activity":{"flavors":1,"launch":3,"search":3},"lastAttempt":{"stamp":"August 3rd 2017, 9:22:44 pm","token":"flavors"},"search_history":{"flavors":["Fruity Pebbles"],"search":["Matanuska Thunder Fuck","Blue Trane"]},"age":true,"fail_terms":{"search":["fruity pebbles traver"]},"fails":{"search":1},"lastFail":{"stamp":"August 3rd 2017, 9:22:29 pm","token":"search"}}
{"_id":{"$oid":"5980e291e02f000004a615d8"},"address":"{\"type\":\"FORBIDDEN\",\"message\":\"Invalid authentication token.\"}","deviceId":"amzn1.ask.device.AGFSJYG4PGK2KTNG6MUYB63VFPURXYQIC4JCPI3X7J4HA5LQ7GUNN6PM2S2DNMCWPGRDAHBEPBJVLXCXO326LM6DZGJ76F3B2ALOXFRSNYUM5KZLCSF4POEP65BJ3ZYWR4NIMYWI3ZPTWNZN36P4VSD2YBCQ","amzn_id":"amzn1.ask.account.AFY3Q7FLV3NTM5MPXEKTWVI2ZUGPC34QFMPXR5FN2W66XQAVLLZLN3TBDRM7FQ3PXNPKN2SPQWIGKLXDHJ6VYINUFCVKJ45ZQT64MS2PLUBKZSN52BBCSEAUFUYGYQ4TRHISM3XIFERHVMBLPY7Y2QDOV3FPNVN6UHSFXOO4A6HSFIRUJ7KAVBA4FMUGT3NIX4WE4I7ET6DIK3Y","__v":0}
{"_id":{"$oid":"59812ff348fb8600046a4954"},"address":"{\"addressLine1\":\"23087 Hesselroth Ave\",\"addressLine2\":null,\"addressLine3\":null,\"districtOrCounty\":\"Nobles\",\"stateOrRegion\":\"MN\",\"city\":\"Rushmore\",\"countryCode\":\"US\",\"postalCode\":\"56168\"}","deviceId":"amzn1.ask.device.AGWDVADOIHRW3Z7PREBZ5O6FCNMSTDLCZRPEXSFMC5ZX27U7QI5UNFKWQIG4HEWIXEMHXSVQQGQBO7WOW5YC5ZVC4UGNJWNOHS3YW4UZM2A37FSZTXCYCDARV6VULBDJYBIA3PSW4DWBIEKEQUGQ6IDGDOIA","amzn_id":"amzn1.ask.account.AEIVV5K7MBAHC6YJOC6FYMHOOGZGEYJ4CO24273CKNR7XS2IDNIXXRR2JZH6DFXVYMDFKN6QZV4KC6M3RZ3HHYKFTRCSOV4CYHJFRJ6P56KB5ZP6KYJHHGQPY7R3FMKVS6HBU66ZLPWECERR5IKLH4O6KA66EXG35C74ZPIMAMZMFBXVLJWJRAHHT2IDPSDVKHW4MPQOWUI4LBQ","__v":0}
{"_id":{"$oid":"5981519c48fb8600046a4955"},"address":"{\"addressLine1\":null,\"addressLine2\":null,\"addressLine3\":null,\"districtOrCounty\":null,\"stateOrRegion\":null,\"city\":null,\"countryCode\":\"US\",\"postalCode\":\"85701\"}","deviceId":"amzn1.ask.device.AEZ3P756VCHVOPILVXUWATMWU4RKBPBGXC7TQA37SZCUWY7EBACZORSQBE2655IX3TBY3VIAVI4HLPGSKTWUJ4MHFRBVOE7HX7UKF6P4D7X2QJ77RA3P4PFJWBC3HBBCII447N7AYWJG6ZDS5PFNXLYSN62A","amzn_id":"amzn1.ask.account.AEWHJUAI7NFROVD5IFXPP254VJF3OOB7T74XTJLY5CRZSYHXO42XSTMRZPPIY6JX3ESZI2HLL7ZIUBQYSATHRT4MIFMDNVXXY5LFMDDNAEYCV4JSJYNJGTJIZ6SMXDDKAEXETZ6WNRSEVS6KADK32LELYC3CJ6AEIV5IWY727K4LEGDMSHP5H2A6TRMZHXAS62BG6U6Q7U3M3JQ","__v":0,"activity":{"search":1},"lastAttempt":{"stamp":"August 2nd 2017, 4:15:28 am","token":"search"},"search_history":{"search":["Green Crack"]}}
{"_id":{"$oid":"5982070d890072000420e7af"},"address":"{\"addressLine1\":null,\"addressLine2\":null,\"addressLine3\":null,\"districtOrCounty\":null,\"stateOrRegion\":null,\"city\":null,\"countryCode\":\"US\",\"postalCode\":\"95037\"}","deviceId":"amzn1.ask.device.AEZM5VMXNJERXV77M4V3UCH4LQVVYOEB2FUMPGZLPZMB5SHNLHOT3NVO3CLCAM273N5FZNJJZAZRRBZXPBTXNUNHLVOK6DPPLJXGBBYO7N4NDVJEAHDBWOMJWSW3H2ALYMXFYLROMD3G3IOWGCNX3ZMMMGCQ","amzn_id":"amzn1.ask.account.AHKAKIGWHH2EJ4HD24TF3T7PJY62Z32CTRNJ6ENYWBHRZPIU42DFKZCQHB4YMTOHSUYZP4MAUXKMXBR5H5OTCW7M65KVA6GUT45I3WGPYEU6HNXHP2SIFAZPZ6G7FYWKGLOLU7NPC4OIXYU6CKTRIV5BMKLQK5HEH6CCC6RFFQUQ5VCXI4JXJRMCR4RE3FS4XOZORRVE36QATGQ","__v":0,"activity":{"community":1},"lastAttempt":{"stamp":"August 2nd 2017, 5:09:30 pm","token":"community"}}
{"_id":{"$oid":"59823278890072000420e7b7"},"address":"{\"addressLine1\":null,\"addressLine2\":null,\"addressLine3\":null,\"districtOrCounty\":null,\"stateOrRegion\":null,\"city\":null,\"countryCode\":\"US\",\"postalCode\":\"19380\"}","deviceId":"amzn1.ask.device.AELEH5S2HZ3O5VII3C5ZQSHOLNQVYK7WZXNG2ZMYZVU35QJQU2HMTMEH7TILINR66XPCOOJWX2YCSBRSQ62GDQBBHXQ3I7J3XTZJKINIGO6YHIW3IDBLOXOZMHV4JWOQ7BECCRU3HAIWZPWGGXAAC77PQ34A","amzn_id":"amzn1.ask.account.AH2ZQOMWRXGRD5YISIFXLTRKIZO6HNNBDUZUPWQQ3ILNZXAKW3SFPCIJ756ESZONOF6WTP2IJ6GX3UKRZJIWX2C3XKQH7KTNZKFAWZ74QFRCLRK2YRGUN3ON7L37X765QKFMD36KNEAWPT53KSATA637V5HELSLAPT27N4ZCURH7MYIB4VFG5TZBL4ERI4SIDE24S4LLAQND4OY","__v":0,"activity":{"community":1},"lastAttempt":{"stamp":"August 2nd 2017, 8:14:11 pm","token":"community"}}
{"_id":{"$oid":"598250b0890072000420e7cb"},"address":"{\"addressLine1\":null,\"addressLine2\":null,\"addressLine3\":null,\"districtOrCounty\":null,\"stateOrRegion\":null,\"city\":null,\"countryCode\":\"US\",\"postalCode\":\"19007\"}","deviceId":"amzn1.ask.device.AGUMGMZC5XMTPLH56WHDSS32KMLJMGZSRKGGOAVL5JVIX6O55XMD5Q66TJKVUV3BZO2T3UISRBJITVBV3SPTBF2MQT7I4VWMRPYQJNS63QNFHBT4H32HXXZBXWCBYVEZ7E7MP6FBQCFMQ5VMGCQSKDS3A74Q","amzn_id":"amzn1.ask.account.AECWVPJMYK3LYRW6UZYSRY6UNU72CFPF7PQXUOIBGQXU37WTB2QXDNDTE7HIH5UYM53MHHB4ZIPIPGLUKMVQSVES43MKAGH7MBFNI5NNWU3DLSP26WLL6KEV6XOPJONCSB6V3BX74IT4KJQG72ZIIKL2R5V6RQHWI3SS4SUOSZNQ776VF7TYQGOMBFTCKEUECLTKXCW6BBHGP6Y","__v":0,"fails":{"?Hot Butter":1},"lastFail":{"stamp":"August 2nd 2017, 10:23:41 pm","token":"?Hot Butter"}}
{"_id":{"$oid":"598276a63c7cdb000408517f"},"address":"{\"addressLine1\":null,\"addressLine2\":null,\"addressLine3\":null,\"districtOrCounty\":null,\"stateOrRegion\":null,\"city\":null,\"countryCode\":\"US\",\"postalCode\":\"49422\"}","deviceId":"amzn1.ask.device.AG4MN46JQ43EICJZMKYQGUZ6LD4FFBVXGO3DTTUJ5PJKPWWV7AIVFF2C7JEWBNOOPKTH6QQMIDCCPYATZLNOZFG74PHEDRLF7WXZCV3MWKJPV7YPNWCSUOVZBCTFA4TJLS7FS4PSIQDUVL3NZU43X7J2DTOA","amzn_id":"amzn1.ask.account.AESNQHVFZGTQYWDD2M4VWQXYY2ATPWP4SIN2VDDGKAJA7FMAZTLTVPYLIRQNLFSIGZYTDXXIJJVGLFGGF6VXP35BZOQICCUK7TRV5QDE3WEDD7EUZVSO6NKRP4WSTKCOHYI5GKULJ7ERBM4LBU2DQ3GSLGOMRO5JGXOMAHPCE7LQR6IJVCBBVPDMXWNY5FAVC7RC4B6U7RAFIOI","__v":0,"activity":{"help":1,"search":1,"launch":2},"lastAttempt":{"stamp":"August 3rd 2017, 1:06:54 am","token":"help"},"search_history":{"search":["Alf"]},"fails":{"?criticalError":1,"#fail?no":1},"lastFail":{"stamp":"August 3rd 2017, 1:07:34 am","token":"?criticalError"}}
{"_id":{"$oid":"5982ea604659620004a7ae23"},"address":"{\"addressLine1\":\"433 N 1ST AVE APT D\",\"addressLine2\":null,\"addressLine3\":null,\"districtOrCounty\":null,\"stateOrRegion\":\"CA\",\"city\":\"ARCADIA\",\"countryCode\":\"US\",\"postalCode\":\"91006-2809\"}","deviceId":"amzn1.ask.device.AHH2K5PAIZL27LDQDYG5LXKQLA744SFJ4UOIICD3OUFDVSDPNW3V77P4NA62KMW7RDA5BP7CS7K5FAMXG4IPFKC6SJ7L7ZXL4KXXE5A4EC2RYF2ZKWF7SM2VRJOWKQUDG36LIBIPMEUM7MJBWUBCOYZNTUVQ","amzn_id":"amzn1.ask.account.AEFIJ7L4ANRPLG6GSHLHPN4DFWM4LAI37RORCIMM2NXQMWGJGDNXJ2PZ45IIRY4SURYSWLXMOYD2X3IPYBQXM5LUFPGHOUIOL2TGR447OIUS5FPG5LYT2IOGL5O6NPGEH3B7DEV2HO374OPSXWB55DIGMFPHTSJM6H62T3C3W4ETEVBZS4ULKKQVRPWG4MRK5S6P6ZSRGV4EPWA","__v":0}
{"_id":{"$oid":"59839f6211379c0004721967"},"address":"{\"addressLine1\":null,\"addressLine2\":null,\"addressLine3\":null,\"districtOrCounty\":null,\"stateOrRegion\":null,\"city\":null,\"countryCode\":\"US\",\"postalCode\":\"23701\"}","deviceId":"amzn1.ask.device.AEZR3PLWYGCH7VN7KBBNR7KSIULYXNAK6FWDZAYHOOJDOMWVB3XGJB6BPSUOOFCQWBYRIGEC53GNMQQSSCSIHFJS3KQXR36ANUWAPHAKEHETKYHUGXGZZWFGMPAPOLEZKS5ABRIXLN7X7UCUKGWVB7YKA6ZA","amzn_id":"amzn1.ask.account.AHAZ6CYBYQISMVCVZINWL3DGETDAHJ26N6WV3PLEJPYL3TYKQQB3BMOUPVGXU3KF6MRUVSDE7V37CR3XMVY5TNBLIVQNXFVEIMNKKG7C7PBRX4TCWV23QCLCSMV3WWNRFVY3QIET5BQH54TWPA5Q7Y3WQC3DZBXSIVA6LZUFH3Q46P6IMXT4QMFS4DP6PSTNZ5JWOI3Q7II5XTY","__v":0,"age":true,"activity":{"community":1,"search":3,"launch":3},"lastAttempt":{"stamp":"August 6th 2017, 6:40:45 pm","token":"search"},"search_history":{"search":["Gorilla Glue #1","OG Ringo"]},"fail_terms":{"search":["0g doritos","og doritos"]},"fails":{"search":2},"lastFail":{"stamp":"August 5th 2017, 9:36:07 pm","token":"search"}}
{"_id":{"$oid":"598463db11379c0004721973"},"address":"{\"addressLine1\":null,\"addressLine2\":null,\"addressLine3\":null,\"districtOrCounty\":null,\"stateOrRegion\":null,\"city\":null,\"countryCode\":\"US\",\"postalCode\":\"37349\"}","deviceId":"amzn1.ask.device.AEUKDR7GEYYA5FHVX6S5EDJ3DVLVKJYPGFUDRSBPWM5N3Y7QUEOOUAHHMKOAUL74ODYQ5SESCZLXRLLUCR552YRXLSWDX63KHI6JOHZE5T3IU2LQJB7ETPVXTUU2EWCZAYRTD22RNAK4ESE3DVIJO4BKG6MQ","amzn_id":"amzn1.ask.account.AGW46YWEQRYK5BTR2T23C4ZNYNXDTM6SOUFRVVXATA4QNQMUC4ICSVLNODCIXC2JNX76IJL6GQGYEZ5Y7ZJPCMZ5UHPCEJJJUIMDJN2YVROD7D5347Q7QRH3QBQZZNT5SHQIGC4JBVZSXEUCO7AX7LXPAGRSNIGFJRRGMMJJ6U7A5Y5OPMD5KNAPJ45HDXY4I36SE65DTHTGXRI","__v":0,"age":true,"activity":{"joke":1,"clarify":1,"launch":1,"help":1},"lastAttempt":{"stamp":"August 4th 2017, 12:10:29 pm","token":"joke"},"fail_terms":{"search":["women"]},"fails":{"search":1},"lastFail":{"stamp":"August 4th 2017, 12:09:28 pm","token":"search"},"clarify_terms":{"undefined":[null]}}
{"_id":{"$oid":"5984978d6e2f24000415e589"},"address":"{\"addressLine1\":\"1112 BOLERO WAY\",\"addressLine2\":null,\"addressLine3\":null,\"districtOrCounty\":null,\"stateOrRegion\":\"KY\",\"city\":\"FRANKFORT\",\"countryCode\":\"US\",\"postalCode\":\"40601-4617\"}","deviceId":"amzn1.ask.device.AGJJZA3RYQ2I2BO2FFRHVNEJ5J7W5DXGR2Z34ZDKVU4D4DALLLLZK5Z2DG62M2XOUZ6VXPZY7LSQYELLMUTCXOEUSDFTTEFW3OYCZO5AVLF3MQ5R4XYEI5WXH67G6VVYZUX6TWBK5LKKM6JDZVSFCFCKPREQ","amzn_id":"amzn1.ask.account.AEDWSRMDSW2VZLAAYJUZQPEWI2QXX6KAXD22PNIJTHCMN2JGGP2SVWXOM7FVCZSM7VZ5F2IO7PVSWREOI3V2T2BXQPB62B4AM2SVUM33U2CP6LSK2MXU3G23S2UBEBKM35653ALCXIVM6UJCJQO6M2WLP2NSG265TNZHTJSRWGVLSIN5A4FSVMMSQ6WWSE5BT2ZZ4BFML7RKOOI","__v":0}
{"_id":{"$oid":"5984b2176e2f24000415e59b"},"address":"{\"addressLine1\":\"123 W Ridge Cir\",\"addressLine2\":null,\"addressLine3\":null,\"districtOrCounty\":\"Bibb\",\"stateOrRegion\":\"GA\",\"city\":\"Macon\",\"countryCode\":\"US\",\"postalCode\":\"31210\"}","deviceId":"amzn1.ask.device.AE7OT36XOF5KIVX5SOBXORIJRKU453OGE3E4UWGOHATC2F4KSXMGW4A4YOGNABY4NRBFKJUZIJ7772DJ3JVQIILIV5DYDQFYXQYV2YGBDOAG4DDRQOPFCAI4MQYTUBSWWUKFP6YUIOHFEGPAUXXJMSDVRVNA","amzn_id":"amzn1.ask.account.AFV2XXVMD5N6B6KA2AWK56J2XCORJUPDFNEHWRGXL4GKIQL5XP34NH6WV35SO623QCZOLRDPFVYH2242KQ7VHTTSQASRDJMKC6B3ZUFHSBAPB5PFHACH2Q3WTYZ7C7UT5LMX4CUA7FGK72FT4HKO2CCNLXPLZ4WVFUL3WL2TWERSN3P2D6R7DISWIMNHT2Q3UABFWMPM5UHWI3I","__v":0,"age":true,"fail_terms":{"search":["poboy hayes"]},"fails":{"search":1},"lastFail":{"stamp":"August 4th 2017, 5:43:15 pm","token":"search"},"activity":{"search":1},"lastAttempt":{"stamp":"August 4th 2017, 5:43:25 pm","token":"search"},"search_history":{"search":["Purple Haze"]}}
{"_id":{"$oid":"5984d4e96e2f24000415e59e"},"address":"{\"addressLine1\":\"6002 Sheed Rd\",\"addressLine2\":null,\"addressLine3\":null,\"districtOrCounty\":\"Hamilton\",\"stateOrRegion\":\"OH\",\"city\":\"Cincinnati\",\"countryCode\":\"US\",\"postalCode\":\"45247\"}","deviceId":"amzn1.ask.device.AEWPMYBT5YGS5KGIWJHPTZN7FRTPP364LXF3FM4M5KDILBQKQHWF7LIE4OAVTOYYHPI37WNIIOWU23YTUEIS44Z7TWDLLEBHUI6OKBHI7NP6BMYW7TD3IMXHOZ2M5EJXB2NSQBGP2G3FLYLOWZK7F274VSAA","amzn_id":"amzn1.ask.account.AHPMY2C55U54R3TVFON54HRVB7KOCVZWRM3WA2S4NT4ARKSY7MA44VBFARJI4YFC36C37IGE64R4EOJ7CXSTAQV3T3RLYBBW3L4KYY5RF4LWTW7TJSFCYZYNIIS46K745IBAUKBO5OXMXLLD3DL6T2HKZSGVNOVZLHKY7UTSYEHEL3UEWUTIMRJUWY2CWLJGI6YLUGF6J4AKXDY","__v":0,"age":true,"activity":{"launch":1},"lastAttempt":{"stamp":"August 4th 2017, 8:11:52 pm","token":"launch"},"fail_terms":{"searchBy":["you"]},"fails":{"searchBy":1},"lastFail":{"stamp":"August 4th 2017, 8:12:01 pm","token":"searchBy"}}
{"_id":{"$oid":"5984ded46e2f24000415e59f"},"address":"{\"addressLine1\":\"587 Jefferson Ave\",\"addressLine2\":null,\"addressLine3\":null,\"districtOrCounty\":\"Kings\",\"stateOrRegion\":\"NY\",\"city\":\"Brooklyn\",\"countryCode\":\"US\",\"postalCode\":\"11221\"}","deviceId":"amzn1.ask.device.AEW65L3V4D764ZR43FHEFMQBXS47ZXL37TZU5BM2QUAKUKECD534MEJI7TF4QTXHTYCL37TPDBQGIBVPRNXFDZVISOOCVCFTZJO52W4D5JIKF57424ASXRCQIVWTYLTEKMT6FDXOOKTXNIJC7HXM6XZNUW7Q","amzn_id":"amzn1.ask.account.AH7BCEFCUMLTL7K3NUP4Z5JHPSH2GE4WKBAM62AU4YIJFEREEOPQ47YX75Y6I2USUXIXNCYGTE2BI74CB4KZGPSTP6IQ5QUAEQ6LWNUFPCEX2NTE6XKPIY4MO7V7XDCQRR3U4RPYACP4GQEGMLZUOM3HZZHEANAZF44GIKTSAHKB2ECTZRVKLJ5SXXHI3HBO7BMRHXSDZBVT5LY","__v":0,"age":true,"activity":{"clarify":1,"launch":2},"lastAttempt":{"stamp":"August 4th 2017, 8:55:23 pm","token":"clarify"},"fail_terms":{"search":["never mind","zoli's gift"]},"fails":{"search":2},"lastFail":{"stamp":"August 4th 2017, 8:55:14 pm","token":"search"},"clarify_terms":{"undefined":[null]}}
{"_id":{"$oid":"59851b146e2f24000415e5a0"},"address":"{\"addressLine1\":null,\"addressLine2\":null,\"addressLine3\":null,\"districtOrCounty\":null,\"stateOrRegion\":null,\"city\":null,\"countryCode\":\"US\",\"postalCode\":\"85201\"}","deviceId":"amzn1.ask.device.AGWJ3ONNTETPF3IVKFA5CBAFJEZJTZPB64OU3EUXWOQAGTQYSJYESHBMOC26UW7IDMCT7KCF5JLXLYZ7KVISPXKVQWM4QBMBFHLBHWSMS4ZXFJOGHOKKMZOXFZS4REFLRG4VZVU3P34D67GCFBSOHBDABQRQ","amzn_id":"amzn1.ask.account.AH6B46VERVS7RWOWHWUCBRO6QJRXRZOVWLMZNQBACBFR2LBLE3N6SJ3KQ64BHHN64KJJV7DHWX5MJYBBRUG6VUSR6DHS5X4ZO3FEJMEDHZQTWQAWCOLANRGGYIQP6QWDVIGXUFSUJL2N7S7JBQNJXOZBCD5ZJDNYTJUZRDEQKWFABOS3ZFK6XQRURQE5LT4MLVA7U6R2WQHGFUI","__v":0,"age":true,"activity":{"flavors":1,"community":2},"lastAttempt":{"stamp":"August 5th 2017, 1:12:38 am","token":"community"},"search_history":{"flavors":["Gorilla Glue #4"]}}
{"_id":{"$oid":"5985450b6e2f24000415e5a5"},"address":"{\"addressLine1\":null,\"addressLine2\":null,\"addressLine3\":null,\"districtOrCounty\":null,\"stateOrRegion\":null,\"city\":null,\"countryCode\":\"US\",\"postalCode\":\"30346\"}","deviceId":"amzn1.ask.device.AFKOFUSZTKOLW2MJOR6O4XATLKEX6UH2VCRZ6CFDOWYSRYOEG7IW2UZEFSD7JW3L3UNNFWZYIZEH43SQUAUFP7F5J3JBL6LK7QTOQR6C6EZDZPNQCGE7GH5ALFYQN2VZSNA6OVQBSNPROR325UV5MCLBL2SQ","amzn_id":"amzn1.ask.account.AHM73UXQMZCSX4ZOCOIVQIHGTVSU4UCS6RGPQH7OZ6QKW5XAAEBALYQ6SPWYCVOILF5UVJEFU5JTBLSZKQZXBUSTMWIRNCIZ7Z3SJ4ZGKX2ZKEGTIQZKKTIUSZFYQ2BHBB6JAZWMMCOFEONQSBWK7HASJZZFH53HHYCD55EQLH3ESMCJBIDJGCA4WVZ5BOMSGFCF254ZPTQ5XXY","__v":0,"age":true,"activity":{"recipe":1},"lastAttempt":{"stamp":"August 5th 2017, 4:10:31 am","token":"recipe"},"search_history":{"recipe":["Applesauce"]}}
{"_id":{"$oid":"5985549c6e2f24000415e5ac"},"address":"{\"addressLine1\":null,\"addressLine2\":null,\"addressLine3\":null,\"districtOrCounty\":null,\"stateOrRegion\":null,\"city\":null,\"countryCode\":\"US\",\"postalCode\":\"78201\"}","deviceId":"amzn1.ask.device.AFG5GRG7UTVCUATKPCH7M6QCJ2CFI5626JWM26VWFAIAHE24GWSLOPK6HLGIXP54WVVNCEL63Y2J5WELMDYVUGMK4HZ4WO4BFHVWBDW6W34UBDM73SIIIMORQYFLCWOBFWUHNMKMYQFB7FETOU6OP3NPRCOA","amzn_id":"amzn1.ask.account.AF3LI6TXVYSAYTDII3VJM2ERDI77N5FLGWWD7YCCCG77JNNL3OOFJ3VJYDCZGWAPJ2NNE6LPOQZHC6H2DO3CQIZVR7F7LVM6ZI3Q34VRKVYRIL26BIJFHLO5XVAUSMLHD76Z7UV3XQFUAYACCZB3JR5GRQE7ESABHCZ7WCJ76XS7ABDB6YPROIJ5AFAWZEKLDXQ6NFOC3HALEIA","__v":0,"age":true,"activity":{"recipe":1,"search":4,"launch":6},"lastAttempt":{"stamp":"August 6th 2017, 6:44:20 pm","token":"search"},"search_history":{"recipe":["Brownies"],"search":["Blues","Gorilla Glue #1","Bubblicious","Pineapple Express"]},"fail_terms":{"search":["no evening around"]},"fails":{"search":1},"lastFail":{"stamp":"August 6th 2017, 6:44:11 pm","token":"search"}}
{"_id":{"$oid":"59855f976e2f24000415e5ad"},"address":"{\"addressLine1\":null,\"addressLine2\":null,\"addressLine3\":null,\"districtOrCounty\":null,\"stateOrRegion\":null,\"city\":null,\"countryCode\":\"US\",\"postalCode\":\"43551\"}","deviceId":"amzn1.ask.device.AE5VODDGOAU76JO4E4OW3APMFJZJKJQACGXYGT6M24DMGGXD5TDMCI3NIOCYVKLHFRWW7EGZNRPWPNXBSR547FVMA2K4CE6NWADB3VZ57DCKMMAXNMPLM3IOLTCG7EAUZCAKWDBVQZ65OLBT5RFZ34MVYUEA","amzn_id":"amzn1.ask.account.AFGIVLABX65VCJS6NU7FPWPDFHT2D5GDKJ444XPMFRIQNXFREI7ELUH6NXOS3P7DBOIVG2C6ZORLIOR2JMBFPNNWPHOBXAORB3TJXT425GJHLZ6J7UOHVRMZJJTLE5BJKCTKMY3OPZ2CWR4C3A4TVL6ZIDWTUHLY47AUFHJL24BZWRB2OOSTJIOSD66RNITFZ6JZLP5RY37GADY","__v":0,"age":true,"activity":{"community":1,"search":2,"launch":1,"flavors":2,"recipe":1},"lastAttempt":{"stamp":"August 5th 2017, 6:08:39 am","token":"community"},"fail_terms":{"recipe":["Lables"],"search":["iraq","tide dick","tide stick","justice"],"medical":["United States"]},"fails":{"recipe":1,"search":4,"medical":1},"lastFail":{"stamp":"August 5th 2017, 6:08:19 am","token":"search"},"search_history":{"recipe":["Brownies"],"flavors":["Fruity Pebbles","Ice"],"search":["Purple Haze","Colombian Gold"]}}
{"_id":{"$oid":"598620ce7b8ae70004f2a99b"},"address":"{\"addressLine1\":\"NF-079\",\"addressLine2\":null,\"addressLine3\":null,\"districtOrCounty\":\"Bonneville\",\"stateOrRegion\":\"ID\",\"city\":\"Idaho Falls\",\"countryCode\":\"US\",\"postalCode\":\"83401\"}","deviceId":"amzn1.ask.device.AHLWO7PK56XYVL7YGMPHDA6N32ZPGSVYIT5DEC45BKU4ZD33AO3LZIRWU3RXA2CVGZKAPPNSVX7X7LO5YCDYMQKGNCIW23UHM2WBA3KXIO3XN4FD4N3XQ73AIS7RTJLEDQ6RBEIAVEICUDDM63BL2DOARAXA","amzn_id":"amzn1.ask.account.AFKWKO7QSWM77HWT67XR3MGIDAISFO7FFPZGAN3JONLCY5VQONR2KLH7R4TJ47CULOH4GXDQ6KZBDVRZSHUTD5NVK6VOLNND6VO7WVLI4QLWO45556EJDDG6A2H7I6MQP4BZLM6J7QM6U45TNA2DU25QNLSXVUYWNO6SX7E2FGRRNY4NZXV4MSFGRJH2YDKZWSOC4NPCRDODQ2A","__v":0,"age":true,"activity":{"community":1,"launch":1},"lastAttempt":{"stamp":"August 5th 2017, 7:47:59 pm","token":"community"}}
{"_id":{"$oid":"598626a37b8ae70004f2a99f"},"address":"{\"addressLine1\":null,\"addressLine2\":null,\"addressLine3\":null,\"districtOrCounty\":null,\"stateOrRegion\":null,\"city\":null,\"countryCode\":\"US\",\"postalCode\":\"77410\"}","deviceId":"amzn1.ask.device.AGSB4SOLENHHJ6W7FUXMGGIMHAZANDMZKZXNWTR3FE53M3WZGFQXMEHM3A4N34PETC5IH57NTBODS7OC3OSJQ3BISRB4DLVVYHBUKVFS3JE2JW2QTAKHUGNXPISIMQAEDY5G6MU3F2SL324FYSSKJ6SGGOYA","amzn_id":"amzn1.ask.account.AHKZ3DEYNCXGKWKVXUD7TF6PZOQZFK2NTASSL46U3ZJO76TKBRQWF4TXHTA2JUV34NFMOFJI3XSB6DZEBKWP2W4X524IG2VJ6SUKD3LRB3OOZNYMDDPBL3TXRP5QAG6ZUK5IGX44JPXKLWET2O3YBOG3LU6FYKIJ5PIWM55KFH6HNPKCV3NZKMYJS55I4UELNB6OPSLTII4SFCQ","__v":0}
{"_id":{"$oid":"59862ca97b8ae70004f2a9a1"},"address":"{\"addressLine1\":null,\"addressLine2\":null,\"addressLine3\":null,\"districtOrCounty\":null,\"stateOrRegion\":null,\"city\":null,\"countryCode\":\"US\",\"postalCode\":\"98528\"}","deviceId":"amzn1.ask.device.AEKTY7ZGGSFZWXN2OOJCCBP465ETIOIJBZDA2R6J5FH3HLQXG24VBXYWSAXEQWMKKT4RLEJJ66TIR54WDXWD25ECYLCZULSPSX5IWREBMPTTYJ5WGQ4SOTD5EM7BCS766MVOYQN6ZDK2XBUFFDSUXCJO37BQ","amzn_id":"amzn1.ask.account.AGV6AGCSBAKRBVLEBA275ENZDL6XNQ6AU6PCJXICMX5RHKROXP7UNLI7FDAO7BK74UOFHFKUCZE344PO7YJQVIXITIWQA6LUJW4B5II3LD3HCHTVIK5JEVYONZ372FUOFJVLGP7MHM5QU24KBI7IYRWRBXD36W5QUF6TKN3SBJ4RRPVONXUF2ZVSKCCF6J5GXNGMEKDEXBX5LMQ","__v":0}
{"_id":{"$oid":"598653247b8ae70004f2a9a6"},"address":"{\"addressLine1\":\"8142 ROYCREST LN\",\"addressLine2\":null,\"addressLine3\":null,\"districtOrCounty\":null,\"stateOrRegion\":\"FL\",\"city\":\"SPRING HILL\",\"countryCode\":\"US\",\"postalCode\":\"34606-6664\"}","deviceId":"amzn1.ask.device.AE3FPST6PMZJ3DD2NDGCVLN7JZWRXF4WVY3U6PULMOUNQRX2EVC4O5ON5CHPDPGJWEST7BFCLBQU3XWHRAWSZEYUM5KRDNVSTTP4M75XD72P35ANIQQRPBWLQFO4A4YNKYTOGI3YXH5MBTLZXEDQG745WNHQ","amzn_id":"amzn1.ask.account.AEI4QII3Z6BEFVVXQROGNYEJWNVF5KMFU4GOKCRMPDHR4WPZM3WZBPTBLYGBKAHYUTNTHMYHHLOW6NISBRMHYJRFHVUPLISMIGWIRO5DHF6BXWUIILVZQ4UGPLJVIQTMX6SMZ2UXX5PANZHUXDGBJQSAAJIKPBMTGSUSWAKOMQAKS6GYB6UQAJ7G6VMHCFZVPHWZOWBBL4LSEAA","__v":0}
{"_id":{"$oid":"598653907b8ae70004f2a9a7"},"address":"{\"addressLine1\":\"8142 ROYCREST LN\",\"addressLine2\":null,\"addressLine3\":null,\"districtOrCounty\":null,\"stateOrRegion\":\"FL\",\"city\":\"SPRING HILL\",\"countryCode\":\"US\",\"postalCode\":\"34606-6664\"}","deviceId":"amzn1.ask.device.AGHASKDR5UU54BZFOCAFVYECTYGX232XOP5SKWNGF23BOZQJRVN3KXU3WNFKUQ32L2QARYJNDYGMUP3ZRTDUCLPC35EMCLQD5CNRJT6UWCJH5QHXF3RA5MWEZ2C57DNSMXL22EBGQTB66LNEN7HMCM7RG6QQ","amzn_id":"amzn1.ask.account.AEARPNZKYLD24SB4VAL63BHB3KBS4BNKFSCBMJ5CVLP2N5UPZU6MDLEK7INFYTFD4GEGISLQ5LAVASXDD45SOW6DR44LKFKE5QUDINLUHSRDL5YXTLHACBPDH3SBJXXXQXRZAKGJX3XLA72VW77HVVGUU44ORSDMOX5AB7L2EMOTSB2FJLYPQOYYLIAP3KJKJWLMWFPPGUJTJ2I","__v":0,"fail_terms":{"effects":["Every Strain"],"search":["oh yeah","yes yeah","yes"]},"fails":{"effects":1,"search":3},"lastFail":{"stamp":"August 6th 2017, 1:18:48 am","token":"search"},"age":true,"activity":{"businessSearch":1,"joke":6,"list":3,"community":1,"search":2,"fact":1,"clarify":1},"lastAttempt":{"stamp":"August 7th 2017, 1:34:18 am","token":"joke"},"search_history":{"search":["Mr. Nice","Blue Power"],"list":["all"],"businessSearch":["mr nice guy"]},"clarify_terms":{"undefined":[null]}}
{"_id":{"$oid":"598663d77b8ae70004f2a9ae"},"address":"{\"addressLine1\":\"3225 Bishop St\",\"addressLine2\":null,\"addressLine3\":null,\"districtOrCounty\":\"Hamilton\",\"stateOrRegion\":\"OH\",\"city\":\"Cincinnati\",\"countryCode\":\"US\",\"postalCode\":\"45220\"}","deviceId":"amzn1.ask.device.AFYZVQD2K533RSELRBN4I7GNVOD5ZGRC2CRZG2IPXQWHL2ZWGXQ4FHI54E3MS22YV6ONGB4M2RM5AYNQZRPTNU5RFXGTPVWTE5VZ4CEC7FPDM7H7C3VC2M725XVV2WLW6HFK263MR4FBGD3BTQB5B3MBV4TQ","amzn_id":"amzn1.ask.account.AHR5P4RI5WHGNNBW6PEHIQNN6M5XQU5IF4K6HGH5Y3M3QV5AKOVKECG5T4WBTDPAR7LXQS3ZOUT5UYMFKKCXOSRSW4XL32ARVRWHDRWENFOLZN7SXBW72ANGR7LPAO4GQUZP7FYQQJUTJB57MDNS2I3BID7FCLMUXMWMK6HEK5Y4LPRN4EFJY7DNUFX5I5LHO7OWPKXDT4LGCMY","__v":0}
{"_id":{"$oid":"59867c6d7b8ae70004f2a9b5"},"address":"{\"addressLine1\":null,\"addressLine2\":null,\"addressLine3\":null,\"districtOrCounty\":null,\"stateOrRegion\":null,\"city\":null,\"countryCode\":\"US\",\"postalCode\":\"80901\"}","deviceId":"amzn1.ask.device.AG65VC2CQ2WFDKNS4EWUTSTQGGY7C4D2NMPQKXQCO3XLA5SGBU4IZTOXCCPWJRPTBV35Z56F6X3GCAZDGXCTCI6ZQFKC3OY54T3VRV3JC2GQH57ZKOROQ5ZPMGBBK43VOTTOTMAN2LMFXWKAWM7Q2DLIAJSQ","amzn_id":"amzn1.ask.account.AHRPHXCBWQUTWAJMSN2KLRNU7GICZBSXWCGKMQ2LIG7BY45YBSNJGGRPPLPZW2RV25QF3JJJSPHDD3L4BB55PK46UOI5V73CQNTT73BE3OROLI5WZ6F2S2XSXDN7IL4IXCM26OR57PHG7NPV4RE2EMM226OPMYHSKAGOPWLOLNQ4PBJCKQZMQBDKK5BGJKKQD5R3J6B5LZNZYYA","__v":0,"fail_terms":{"search":["order yes"]},"fails":{"search":1},"lastFail":{"stamp":"August 6th 2017, 2:18:33 am","token":"search"},"age":true,"activity":{"search":3,"launch":3},"lastAttempt":{"stamp":"August 7th 2017, 12:50:16 am","token":"search"},"search_history":{"search":["Blue Dream","Bay Dream","Pink Kush"]}}
{"_id":{"$oid":"5986bf8b7b8ae70004f2a9b6"},"address":"{\"addressLine1\":null,\"addressLine2\":null,\"addressLine3\":null,\"districtOrCounty\":null,\"stateOrRegion\":null,\"city\":null,\"countryCode\":\"US\",\"postalCode\":\"75201\"}","deviceId":"amzn1.ask.device.AENBSILZ5WAXDLTC76HUIFBEHQJQFUAUQJW46M32QPHTHDJKZIAZXACPIUPI5ABP4GWRCQKVXZY54LYVVWHBGH46UDVVWDAWFEVHAODIAJBAJOAQGIFO6UMIB7MMUUFKEF7KE4GZIVQLSKP3GNRW2Y6ZSD4Q","amzn_id":"amzn1.ask.account.AGGBJPX47GQEIYALS4AOCLOXXGB23OLXG3K6AUPAZFMKESJ23SAELEGKGFBOBKNG7JFCOWD5OOFV3YOOEL5RHGB2NB2YX5PEXICL7NPD2Y3ZY475YGQBSJW6YJDJKXVN6AZK2OZ2ZVD7H5QNY3RFSMHSQOCFB2EXOJZDSSZCE6WYTKZEUOZWCK2Z6X7KUMSZSYVXCKV57JUX6EA","__v":0,"age":true,"activity":{"flavors":1,"search":1},"lastAttempt":{"stamp":"August 6th 2017, 7:06:30 am","token":"flavors"},"search_history":{"flavors":["Fruity Pebbles"],"search":["Purple Haze"]},"fail_terms":{"recipe":["Edibles"]},"fails":{"recipe":1},"lastFail":{"stamp":"August 6th 2017, 7:06:18 am","token":"recipe"}}
{"_id":{"$oid":"5987427d7faafd0004a3c198"},"address":"{\"addressLine1\":null,\"addressLine2\":null,\"addressLine3\":null,\"districtOrCounty\":null,\"stateOrRegion\":null,\"city\":null,\"countryCode\":\"US\",\"postalCode\":\"93650\"}","deviceId":"amzn1.ask.device.AFGLFNQQMANF5WOFEQOJRWN57S2QEWDP56V2AVFSTAEWGTY6K65NM7XYEC6QXPPOZDWCZFEY7Z2MNKAROLQ25SOR32VTXF7NKUBHSI7UERKB7S7F35UFSDE4Z55BLSKO4VCALVNW3YF4U3VHRDSEX4ZVC6NA","amzn_id":"amzn1.ask.account.AHGNJG6B6VNMLSDWTM34DF4D2TW6GCZYDJIXMUHPJMZJH7D67WV4VJMKGHMBOUN6IMDBDBHEI5SUK4OMSKV7DJEPOTSTBLFSL6IVV7NIHEWEHNAV36EDE7CMKJBFIVJOT2L37VNTTVNOUVIPYM5UGK62OUVABUUC3KBCOYZUAPRKYUDBIUNIM7FXVTO2E6UYUANJ3DR7RSEKUYY","__v":0,"age":true,"activity":{"community":1,"flavors":1,"launch":1},"lastAttempt":{"stamp":"August 6th 2017, 9:14:08 pm","token":"community"},"search_history":{"flavors":["Fruity Pebbles"]},"fail_terms":{"search":["subways"]},"fails":{"search":1},"lastFail":{"stamp":"August 6th 2017, 9:14:01 pm","token":"search"}}
{"_id":{"$oid":"59874a0914fd68000429a32b"},"address":"{\"addressLine1\":null,\"addressLine2\":null,\"addressLine3\":null,\"districtOrCounty\":null,\"stateOrRegion\":null,\"city\":null,\"countryCode\":\"US\",\"postalCode\":\"21201\"}","deviceId":"amzn1.ask.device.AGVXETF4XIA2ZJAGLR4TVZIOZGL7K4R2WOH3BLF4QFW5TA6SGX7MVO7IXTFAKRK3E5I24KNO6BDDSIVRUT2PYM6DVPDQPBINB3VGAE3K5XR4DSQ7OTRHNMNUERCCOT452JSHHVAYIXS3V6UHQDPGJ7QRKJRQ","amzn_id":"amzn1.ask.account.AHHKIZOPHU5I4CZPKDB2G4GSCC3BOD5ESKAUQCBPFU6EOZLU4CYXIGPIKO32NBLSJC5TLNCZI3VCMJ7QU2JTLXYSKSLCXC45DBYEHAO45IYSH3REIYMCZJAZIC6Y5QRBBNWTZ6SLF4GAW76X3SAFCTAP5L3SKWCQMFUBCK6ZMAVO6S2QDFYJKU2CS3VQ3NFKG4KPUJEDXYSOT4Q","__v":0,"age":true,"fail_terms":{"search":["king kong kis","app","app again","af again"],"medical":["Avatar"]},"fails":{"search":4,"medical":1},"lastFail":{"stamp":"August 7th 2017, 3:46:53 am","token":"search"},"activity":{"search":3},"lastAttempt":{"stamp":"August 7th 2017, 3:47:04 am","token":"search"},"search_history":{"search":["King Kong","Green Crack","Afghan Kush"]}}
{"_id":{"$oid":"59878e3da795e30004bb9b05"},"address":"{\"addressLine1\":null,\"addressLine2\":null,\"addressLine3\":null,\"districtOrCounty\":null,\"stateOrRegion\":null,\"city\":null,\"countryCode\":\"US\",\"postalCode\":\"19134\"}","deviceId":"amzn1.ask.device.AEGDQTH76BYH3LYKUGRC37KQ7L27PQRFARKP5E2OMA6J5HLMGPKIPGW5LIPIRMP6BNEEKOFLEV4CPGSKF2FZAFYTZ6QGVDUU4GGA3LUM7DJV4TUBCXBHGIHEQZQUVX3HWWAXQ6IQARFGAHKMOKLEIVD6H2ZA","amzn_id":"amzn1.ask.account.AHLK7CASZ7TQCH3KIEHIKIPGORVDUM7XLFLF35YNHKU3TF6LSIYMU44HPB32DRUVSJ73VC7TTW7D65X3TK3NC4L6SIFKMWH75JJ774ONCZLA6RRE62XBDA5EOZVUD5VC6AUUYZ6WQEI7QH4R7WSDXSAFKMAUIYH6KAINX6R24K2RYFUJUVZQNAJ2HHUWEXK2EFHGUHJZ3E3SQAI","__v":0,"age":true,"activity":{"search":2,"launch":2},"lastAttempt":{"stamp":"August 6th 2017, 9:52:08 pm","token":"search"},"search_history":{"search":["Fire OG","Blue Knight"]}}
{"_id":{"$oid":"5987a2a3a795e30004bb9b08"},"address":"{\"addressLine1\":\"1429 Sheridan Ave\",\"addressLine2\":null,\"addressLine3\":null,\"districtOrCounty\":\"Placer\",\"stateOrRegion\":\"CA\",\"city\":\"Roseville\",\"countryCode\":\"US\",\"postalCode\":\"95661\"}","deviceId":"amzn1.ask.device.AEU6NFC2VEM2BRZ3GHNPGUHCIN4DR2MPD3XLX65ATLC2YCUKZURRUCUFSTFKZWW36AJYCGM5EZMIVBE7VZV4X2ORSYALWAMPTKCTNAGCGS2LSSTRUQUXQAHIO54JCVYV43UVWFHYYNZXORMDGABYDA5HJ2GQ","amzn_id":"amzn1.ask.account.AEEA3HKND2MY6QP7RPGBXA532P6UKCRPCSY4JU4KGUEWWKC5L3TV4ZBL422K4W2CW64TQD27WSU37NKRNNUSZ3QVJGRG52GDDHQJKZUEEPR7I2X6XGTLXTKJ5IISA6LG6DTCMNX2O3QNSX7QN2CJAF6ZYIUN3PUXGRT7QI557AICVDJWGRHPTH7F4LEWIKSFISL2KBPK3QJ466Y","__v":0,"fail_terms":{"flavors":["Fedora"],"search":["yes yes","fedora"]},"fails":{"flavors":1,"search":2},"lastFail":{"stamp":"August 6th 2017, 11:14:51 pm","token":"flavors"},"age":true,"activity":{"launch":1,"flavors":1},"lastAttempt":{"stamp":"August 6th 2017, 11:14:31 pm","token":"launch"},"search_history":{"flavors":["Northern Lights"]}}
{"_id":{"$oid":"5987dae4a795e30004bb9b13"},"address":"{\"addressLine1\":\"415 9TH ST  APT3\",\"addressLine2\":null,\"addressLine3\":null,\"districtOrCounty\":null,\"stateOrRegion\":\"FL\",\"city\":\"WEST PALM BEACH\",\"countryCode\":\"US\",\"postalCode\":\"33401-3341\"}","deviceId":"amzn1.ask.device.AH2YGBM3ZPO7ABYQY2LPUHAKJZ4FYQN37C7XTP523LVFCWDA3KBXBRYXAQNH4G6376W35E32JFXSJAT6WROCJUTDMQYVKDIW4XPLZMDT5MFWXPZP52BBD3XAC7JOCMFEJ6NMPUYT7LGFQMCIO4T6XF5BIK2Q","amzn_id":"amzn1.ask.account.AFT7DRFW5WYQCK5OAAJSWONFAQ4VUIA6PWHU2DYPWGYBF2AHEKHGW35DHIPDFYJHU5JBRNLRWGUCDTKMPI62BVBILBRRRBTUGIZFYZ67LBJG7PB77ALKFY7XMWCQBLC7CDEJZKJ2FCU3SLLSEJZBWCP2MBI5NBEBQ3IGQ5NKEVNOPGZEQQEJV2YBTOQRO7ELACMGGXVJLEKMPNA","__v":0,"age":true,"activity":{"search":3},"lastAttempt":{"stamp":"August 7th 2017, 3:16:09 am","token":"search"},"search_history":{"search":["Headbanger","Bubble Gum","Bubba OG"]}}
{"_id":{"$oid":"5988e51f9365240004dd7857"},"address":"{\"addressLine1\":\"9726 Shelburne Cir\",\"addressLine2\":null,\"addressLine3\":null,\"districtOrCounty\":\"Charlotte\",\"stateOrRegion\":\"FL\",\"city\":\"Port Charlotte\",\"countryCode\":\"US\",\"postalCode\":\"33981\"}","deviceId":"amzn1.ask.device.AFY5UIEL7XYO54TUJ3AXMCVMQFNXOJRGSVJR4JO5CZ2SLV3E6S754JMFMNCTJRVVHXTB5LWQYI6N3QL6VMSLW73G4KIKDY3J5KOIMOF4B6V5CNJOHG6PBAXWT7NVWXH242LX3N4XGFGENIPVS55VRMGXQBPQ","amzn_id":"amzn1.ask.account.AGXQ4F7FY67XKVCO73A52WKNSJ6A7JOU4X7FMYG6UIIXHKT73RLWUS6CCZ7HWOXM635OLIKEAU7PJ7CPZ2BHZTJEJBEV6UKLCKZER3ZZMVPX2YLKFOZLIMUTYLO6RYIWCS6QB4SR7FJIJCQHDQ36VTQ5KM4YQAGPRLXDMSKV2Y3MROS36YTVX2W3O3O5JCXBVNOAY4HKZYM547Y","__v":0,"age":true,"activity":{"search":1,"launch":1},"lastAttempt":{"stamp":"August 7th 2017, 10:10:14 pm","token":"search"},"search_history":{"search":["Purple Nepal"]}}
{"_id":{"$oid":"5988eea39365240004dd785f"},"address":"{\"addressLine1\":null,\"addressLine2\":null,\"addressLine3\":null,\"districtOrCounty\":null,\"stateOrRegion\":null,\"city\":null,\"countryCode\":\"US\",\"postalCode\":\"27601\"}","deviceId":"amzn1.ask.device.AHGBJTLWRR4SIO6XATEYZTP6EHHXDXKW3ME2PHXQHGLEPV2L3G22LPAI3J5MATSGF2KFI5OHGKG2QWQCSP76T4EDWQEHK5Z2RBPGNCZT2R74YSGFLOV4MR7TWREAEUWWJEZUPUIZEWN4R2FCAAQMOEA52BLQ","amzn_id":"amzn1.ask.account.AF52NYJX2H7C5YPD3Q6HS66CO7M5XCBROJXQR2KCSN7VSBNQ23677UGE3JFILQXNWKZENENNKIDCTL7SZCQ26STPX7CIDHWFTZD3MAVC5OTPVHELNC6DJ4LZUE4VAC2EO2SYBSHFI3EJU3BENN2WWXG2EQMDFJOOLZIDXILP6T5ZJLLUT6ZLB5IBA4BBSJ2Q6W3ENGRKFONLCAI","__v":0,"age":true,"activity":{"recipe":1,"community":1},"lastAttempt":{"stamp":"August 7th 2017, 11:13:43 pm","token":"recipe"},"search_history":{"recipe":["Chicken Pot Pie"]}}
{"_id":{"$oid":"598950579365240004dd786a"},"address":"{\"addressLine1\":null,\"addressLine2\":null,\"addressLine3\":null,\"districtOrCounty\":null,\"stateOrRegion\":null,\"city\":null,\"countryCode\":\"US\",\"postalCode\":\"95101\"}","deviceId":"amzn1.ask.device.AHLDY5TY23JLHRXHRSBHBMH6TAA2CSJLVCCGSK2UQTBVZ5A6YZULWJWOJUXBEU7ISPPUT7454WKRPTM6PSBBPIEMPIEU4NE5ZSBW2ED2JSRFHKYM3CGUQNWUGCBMUPL4PSRH4TGYV52BIUHT3YLG6G2L5MXQ","amzn_id":"amzn1.ask.account.AF2J4RUDTORW3J6KM5UC7VW67NFLZTSM6SE24E2KHIHLHKSQZG2KSC3CBYHISR7H5FORVGDXQIXKZVSL36NGN6S4KLNQEHMIQGWO42TRPJ7NQTFTD46WEMLLTKJD5P5KRJ4GSUMGDBYR27ZNSP265UHXBIFZSE5QPPPWF37HUFIFZED5OPOV75EUISFPPYBDD73M3RT3V7OGCZA","__v":0}
{"_id":{"$oid":"598951069365240004dd7874"},"address":"{\"addressLine1\":null,\"addressLine2\":null,\"addressLine3\":null,\"districtOrCounty\":null,\"stateOrRegion\":null,\"city\":null,\"countryCode\":\"US\",\"postalCode\":\"73301\"}","deviceId":"amzn1.ask.device.AHYJJ6ELYB4EDKUVLWJRZRNQJZ6COEQFJGJB2SLY7FXPX7CELKNZ745ILYWFQEGD2KETIGAZRRRQD3OJKVUHRD5FVTR7GVOWXIAUFZ3Q27XKQOHXPQAZRJRKZ4GQU3R3DL7LFZSVZLISUGGQ44BYA6OGLCBA","amzn_id":"amzn1.ask.account.AE6Y7WDXTZLJQRDP4DY65ZF4MIMMWTLTJ6DN5KFQVDJJNYKVYNDHSQ2QUYCE67GUUPZN4FZBCCK3LYYAZA6V34BS3IB6DICQ22AX2XUDBZCPGLYNNETFRC3LQJH2FX7G5WBIWQMCXJAXBMGFMT25CUOJ5ZRFPRYLTR2TWVHZEALPZQ6YXVIJF7Q2URJ6SVKM5XPLJWZ2I3EUMRA","__v":0,"age":true,"activity":{"community":1,"launch":1},"lastAttempt":{"stamp":"August 8th 2017, 5:50:25 am","token":"community"}}
{"_id":{"$oid":"598951609365240004dd7875"},"address":"{\"addressLine1\":null,\"addressLine2\":null,\"addressLine3\":null,\"districtOrCounty\":null,\"stateOrRegion\":null,\"city\":null,\"countryCode\":\"US\",\"postalCode\":\"89434\"}","deviceId":"amzn1.ask.device.AGEFAO2UU4QPFWUPX2MXQLWTIZBEXM4VMAVAYRSZNRLIVFDAENWDAKGNGM7JGMGVVTTLQDBE5S4OSZYLKHQEDFVZGWHRV5DVX6XRIUR3INDUSQWUZDGBQOHBPE7DZ7ZSN4KKGEQNDUG4LH3ZSNT2LJTYAEZA","amzn_id":"amzn1.ask.account.AEJRIE3WYM3VO6PGWYMGL3COFBY7DK75GDKW5Y75KSC6EEKZCHTBM27WRELYGG735JDEDOZYCFIGNNBTB2BT4FL7MKKII2QWDOCF2GFIFRVH7PX7UHPEZPDKHVT7ZO2E7FVDY64UAAWFWQL37UKICONHPMEXZUQSOJK6KDW7AH2BDVSMIPWIYZPBLNA3LJ4B7INX6ZTHLWK7IHA","__v":0,"age":true,"activity":{"launch":1},"lastAttempt":{"stamp":"August 8th 2017, 5:51:52 am","token":"launch"},"fail_terms":{"recipe":["Medical Butter"],"search":["me some edible gummies"]},"fails":{"recipe":1,"search":1},"lastFail":{"stamp":"August 8th 2017, 5:52:15 am","token":"recipe"}}
{"_id":{"$oid":"598965c69365240004dd787e"},"address":"{\"addressLine1\":\"1525 PATRICK DR\",\"addressLine2\":null,\"addressLine3\":null,\"districtOrCounty\":null,\"stateOrRegion\":\"TN\",\"city\":\"LEWISBURG\",\"countryCode\":\"US\",\"postalCode\":\"37091-2966\"}","deviceId":"amzn1.ask.device.AHIZFKFTCTCL7LQNIFUUOF5RYI3JWGLV52VSDGVZ43M4P7WOU3SPVN2KPT6NBTX3YLQ5QSFPUSJDOEUL4R7G4GQXDXS45V3A6DNFP4PMGVNQF6M7NYYBGHBRMF3TVYMQ734NQAHB4T32ORQ6OINGKOGQB46A","amzn_id":"amzn1.ask.account.AGLB434KPB4DUO2H446PWM2DVNMMKX4CHIBOMF4YRSUACK2TZQIVIGMNIGGWGUC56TKM4KGXTVCCSIXZ6WBEEYDIVP6ASVVYRYV2WWSDD4YDYVGKXAWU33HX2ZZAA6OV45GET57EME7OVF5EEDEZYN4SOTAYZFALT6FPRREKDB4VAAL42V6VBDWCBWEQJ5WQW2K3ZZDKSO2DJSQ","__v":0,"age":true,"activity":{"search":2,"community":1},"lastAttempt":{"stamp":"August 8th 2017, 7:20:11 am","token":"search"},"search_history":{"search":["Purple Haze","Silver Cindy"]}}
