%YAML 1.1
%TAG !u! tag:unity3d.com,2011:
--- !u!114 &11400000
MonoBehaviour:
  m_ObjectHideFlags: 0
  m_CorrespondingSourceObject: {fileID: 0}
  m_PrefabInstance: {fileID: 0}
  m_PrefabAsset: {fileID: 0}
  m_GameObject: {fileID: 0}
  m_Enabled: 1
  m_EditorHideFlags: 0
  m_Script: {fileID: 11500000, guid: 548c97ce9a5cdcb4eab3488a9ff4c90f, type: 3}
  m_Name: Kyle
  m_EditorClassIdentifier: 
  selecIndex: 2
  playableCharacter: {fileID: 7554915255573483301, guid: 6f5aed8d6191c444a99e2c3f4211412f, type: 3}
  lifeBar: {fileID: 2809308076757766396, guid: d75943bb7bfcc4547befde60d2805ca1, type: 3}
  image: {fileID: 21300000, guid: 80159ce5204b22f478a42808c343ca24, type: 3}
  name: Kyle
