%YAML 1.1
%TAG !u! tag:unity3d.com,2011:
--- !u!114 &11400000
MonoBehaviour:
  m_ObjectHideFlags: 0
  m_CorrespondingSourceObject: {fileID: 0}
  m_PrefabInstance: {fileID: 0}
  m_PrefabAsset: {fileID: 0}
  m_GameObject: {fileID: 0}
  m_Enabled: 1
  m_EditorHideFlags: 0
  m_Script: {fileID: 11500000, guid: 548c97ce9a5cdcb4eab3488a9ff4c90f, type: 3}
  m_Name: Mysterion
  m_EditorClassIdentifier: 
  selecIndex: 8
  playableCharacter: {fileID: 3161189695813160061, guid: bba3a2c39c342e54580d78338301727c, type: 3}
  lifeBar: {fileID: 2809308076757766396, guid: 6b56d800ce5f4f64d8b9e219029bdeb1, type: 3}
  image: {fileID: 21300000, guid: 78194db65a6adb64fad9e0050c0d6ace, type: 3}
  name: Mysterion
