%YAML 1.1
%TAG !u! tag:unity3d.com,2011:
--- !u!114 &11400000
MonoBehaviour:
  m_ObjectHideFlags: 0
  m_CorrespondingSourceObject: {fileID: 0}
  m_PrefabInstance: {fileID: 0}
  m_PrefabAsset: {fileID: 0}
  m_GameObject: {fileID: 0}
  m_Enabled: 1
  m_EditorHideFlags: 0
  m_Script: {fileID: 11500000, guid: 548c97ce9a5cdcb4eab3488a9ff4c90f, type: 3}
  m_Name: Craig
  m_EditorClassIdentifier: 
  playableCharacter: {fileID: 1599289863645610178, guid: 5f2fe42a02eb11143837bd6ba61dd611, type: 3}
  lifeBar: {fileID: 2809308076757766396, guid: c414bd5e7d5a0b74a829fb27a493a02a, type: 3}
  image: {fileID: 21300000, guid: 549f6ce75733d2642a3743e4c915b238, type: 3}
  name: Craig
