%YAML 1.1
%TAG !u! tag:unity3d.com,2011:
--- !u!1 &1863460413715823583
GameObject:
  m_ObjectHideFlags: 0
  m_CorrespondingSourceObject: {fileID: 0}
  m_PrefabInstance: {fileID: 0}
  m_PrefabAsset: {fileID: 0}
  serializedVersion: 6
  m_Component:
  - component: {fileID: 1863460413715823581}
  - component: {fileID: 1863460413715823580}
  m_Layer: 0
  m_Name: ItemDropSpawner
  m_TagString: Untagged
  m_Icon: {fileID: 0}
  m_NavMeshLayer: 0
  m_StaticEditorFlags: 0
  m_IsActive: 1
--- !u!4 &1863460413715823581
Transform:
  m_ObjectHideFlags: 0
  m_CorrespondingSourceObject: {fileID: 0}
  m_PrefabInstance: {fileID: 0}
  m_PrefabAsset: {fileID: 0}
  m_GameObject: {fileID: 1863460413715823583}
  m_LocalRotation: {x: 0, y: 0, z: 0, w: 1}
  m_LocalPosition: {x: 0, y: 0, z: 0}
  m_LocalScale: {x: 1, y: 1, z: 1}
  m_ConstrainProportionsScale: 0
  m_Children: []
  m_Father: {fileID: 0}
  m_RootOrder: 0
  m_LocalEulerAnglesHint: {x: 0, y: 0, z: 0}
--- !u!114 &1863460413715823580
MonoBehaviour:
  m_ObjectHideFlags: 0
  m_CorrespondingSourceObject: {fileID: 0}
  m_PrefabInstance: {fileID: 0}
  m_PrefabAsset: {fileID: 0}
  m_GameObject: {fileID: 1863460413715823583}
  m_Enabled: 1
  m_EditorHideFlags: 0
  m_Script: {fileID: 11500000, guid: 736f18d10e7371a4898e8e1af10dbbcf, type: 3}
  m_Name: 
  m_EditorClassIdentifier: 
  SpawnableItems:
  - {fileID: 4509008376602654761, guid: 91a2299e41fd42041bf1bef498ba5c6f, type: 3}
  - {fileID: 7494121001197895799, guid: dce41d4f7feaf764db47e9a1a7e9a3c3, type: 3}
  - {fileID: 3382947081128094822, guid: 15634912726ad2345bbf85c94c0ff6ea, type: 3}
  - {fileID: 7494121001197895799, guid: 96a3bf8366e28bc4fa69c6123345a50d, type: 3}
  - {fileID: 4509008376602654761, guid: 77d989d7e69e4734395c65ba0213dbb6, type: 3}
  - {fileID: 7494121001197895799, guid: 3c3e70ee7a5eb2c498fb363a8f9b14bb, type: 3}
  - {fileID: 4509008376602654761, guid: 703da9d0f84dfda46a2b72aeba4f3a7f, type: 3}
  - {fileID: 7494121001197895799, guid: e58e522064bb1264bad22c75708cc53f, type: 3}
  - {fileID: 4509008376602654761, guid: 592145154ec75e345a8a0608a77bd722, type: 3}
  - {fileID: 7494121001197895799, guid: aed4d3ac032c1a642b769c55a09aaa52, type: 3}
  - {fileID: 7494121001197895799, guid: f8093d58a2feda943b69dff3d8d10c19, type: 3}
  - {fileID: 7494121001197895799, guid: 24befe83ceceb934086bc2f070a03ded, type: 3}
  - {fileID: 4509008376602654761, guid: c1485eda183a94e41bc6efc1af522e7a, type: 3}
  - {fileID: 8614989322745408337, guid: 50e561170fe786749bdacca78b37fe8a, type: 3}
