%YAML 1.1
%TAG !u! tag:unity3d.com,2011:
--- !u!114 &11400000
MonoBehaviour:
  m_ObjectHideFlags: 0
  m_CorrespondingSourceObject: {fileID: 0}
  m_PrefabInstance: {fileID: 0}
  m_PrefabAsset: {fileID: 0}
  m_GameObject: {fileID: 0}
  m_Enabled: 1
  m_EditorHideFlags: 0
  m_Script: {fileID: 11500000, guid: 548c97ce9a5cdcb4eab3488a9ff4c90f, type: 3}
  m_Name: Token
  m_EditorClassIdentifier: 
  selecIndex: 7
  playableCharacter: {fileID: 7868776094449264648, guid: e0ca07ddf50f22e40ad8b23d46d05cf4, type: 3}
  lifeBar: {fileID: 2809308076757766396, guid: 223c557b454342541ae04470da12ef3a, type: 3}
  image: {fileID: 21300000, guid: 26f52fda80eb30347ad04192fdbb88fc, type: 3}
  name: Tolkien
