\relax 
\@writefile{toc}{\contentsline {section}{\numberline {1}Colecciones}{1}}
\@writefile{toc}{\contentsline {section}{\numberline {2}Modo matem\IeC {\'a}tico}{3}}
\@writefile{toc}{\contentsline {subsection}{\numberline {2.1}Delimitadores}{4}}
