[3J[H[2J████████████████████████████████████████████████████████████████████████████████████████████████████████████████████████████████████████████████████████████████████████████████████████████████████████
████████████████████████████████████████████████████████████████████████████████████████████████████████████████████████████████████████████████████████████████████████████████████████████████████████
████████████████████████████████████████████████████████████████████████████████████████████████████████████████████████████████████████████████████████████████████████████████████████████████████████
████████████████████████████████████████████████████████████████████████████████████████████████████████████████████████████████████████████████████████████████████████████████████████████████████████
████████████████████████████████████████████████████████████████████████████████████████████████████████████████████████████████████████████████████████████████████████████████████████████████████████
████████████████████████████████████████████████████████████████████████████████████████████████████████████████████████████████████████████████████████████████████████████████████████████████████████
████████████████████████████████████████████████████████████████████████████████████████████████████████████████████████████████████████████████████████████████████████████████████████████████████████
████████████████████████████████████████████████████████████████████████████████████████████████████████████████████████████████████████████████████████████████████████████████████████████████████████
████████████████████████████████████████████████████████████████████████████████████████████████████████████████████████████████████████████████████████████████████████████████████████████████████████
████████████████████████████████████████████████████████████████████████████████████████████████████████████████████████████████████████████████████████████████████████████████████████████████████████
████████████████████████████████████████████████████████████████████████████████████████████████████████████████████████████████████████████████████████████████████████████████████████████████████████
████████████████████████████████████████████████████████████████████████████████████████████████████████████████████████████████████████████████████████████████████████████████████████████████████████
████████████████████████████████████████████████████████████████████████████████████████████████████████████████████████████████████████████████████████████████████████████████████████████████████████
████████████████████████████████████████████████████████████████████████████████████████████████████████████████████████████████████████████████████████████████████████████████████████████████████████
████████████████████████████████████████████████████████████████████████████████████████████████████████████████████████████████████████████████████████████████████████████████████████████████████████
████████████████████████████████████████████████████████████████████████████████████████████████████████████████████████████████████████████████████████████████████████████████████████████████████████
████████████████████████████████████████████████████████████████████████████████████████████████████████████████████████████████████████████████████████████████████████████████████████████████████████
████████████████████████████████████████████████████████████████████████████████████████████████████████████████████████████████████████████████████████████████████████████████████████████████████████
████████████████████████████████████████████████████████████████████████████████████████████████████████████████████████████████████████████████████████████████████████████████████████████████████████
████████████████████████████████████████████████████████████████████████████████████████████████████████████████████████████████████████████████████████████████████████████████████████████████████████
████████████████████████████████████████████████████████████████████████████████████████████████████████████████████████████████████████████████████████████████████████████████████████████████████████
████████████████████████████████████████████████████████████████████████████████████████████████████████████████████████████████████████████████████████████████████████████████████████████████████████
████████████████████████████████████████████████████████████████████████████████████████████████████████████████████████████████████████████████████████████████████████████████████████████████████████
████████████████████████████████████████████████████████████████████████████████████████████████████████████████████████████████████████████████████████████████████████████████████████████████████████
████████████████████████████████████████████████████████████████████████████████████████████████████████████████████████████████████████████████████████████████████████████████████████████████████████
████████████████████████████████████████████████████████████████████████████████████████████████████████████████████████████████████████████████████████████████████████████████████████████████████████
████████████████████████████████████████████████████████████████████████████████████████████████████████████████████████████████████████████████████████████████████████████████████████████████████████
████████████████████████████████████████████████████████████████████████████████████████████████████████████████████████████████████████████████████████████████████████████████████████████████████████
█████████████████████████████████████████████████████████████████████ ██████████████████████████████████████████████████████████████████████████████████████████████████████████████████████████████████
████████████████████████████████████████████████████████████████████ ███████████████████████████████████████████████████████████████████████████████████████████████████████████████████████████████████
████████████████████████████████████████████████████████████████████████████████████████████████████████████████████████████████████████████████████████████████████████████████████████████████████████
██████████████████████████████████████████████████████████████████████ ███████████████████████████████████████████████████████  ████████████████████████████████████████████████████████████████████████
███████████████████████████████████████████████████████████████████████████████████████████████████████████████████████████████   ██████████████████████████████████████████████████████████████████████
████████████████████████████████████████████████████████████████████████████████████████████████████████████████████████████████  ██████████████████████████████████████████████████████████████████████
███████████████████████████████████████████████████████████████████████ ████ ███████████████████████████████████████████████████████████████████████████████████████████████████████████████████████████
███████████████████████████████████████████████████████████████████████  ██  ███████████████████████████████████████████████████████████████████████████████████████████████████████████████████████████
███████████████████████████████████████████████████████████████████████   █ ████████████████████████████████████████████████████████████████████████████████████████████████████████████████████████████
██████████████████████████████████████████████████████████████████████  ██    ████████████████████████████████████████████ █████████████████████████████████████████████████████████████████████████████
██████████████████████████████████████████████████████████████████████ ███      ██████████████████████   ██████████████  █  ████████████████████████████████████████████████████████████████████████████
███████████████████████████████████████████████████████████████████████████████ █████████████████                        █   ███████████████████████████████████████████████████████████████████████████
███████████████████████████████████████████████████████████████████████████ ███████████████████                               ██████████████████████████████████████████████████████████████████████████
███████████████████████████████████████████████████████████████████████████ █  ██████████████                                  █████████████████████████████████████████████████████████████████████████
██████████████████████████████████████████████████████████████████████████ ██ ██████████████                                    ████████████████████████████████████████████████████████████████████████
██████████████████████████████████████████████████████████████████████████████████████████                                      ████ ███████████████████████████████████████████████████████████████████
█████████████████████████████████████████████████████████████████████████ █████████ █████                                        ███ ███████████████████████████████████████████████████████████████████
█████████████████████████████████████████████████████████████████████████████████   ████                                          ██  ██████████████████████████████████████████████████████████████████
█████████████████████████████████████████████████████████████████████████████████  ████                                           ███ ██████████████████████████████████████████████████████████████████
████████████████████████████████████████████████████████████████████████████████  █████                                            █████████████████████████████████████████████████████████████████████
██████████████████████████████████████████████████████████████████████████████ █  ████                                               ███████████████████████████████████████████████████████████████████
█████████████████████████████████████████████████████████████████████████████ █  ████                                                  █████████████████████████████████████████████████████████████████
███████████████████████████████████████████████████████████████████████████████ ████                                                    ████████████████████████████████████████████████████████████████
███████████████████████████████████████████████████████████████████████████████████                                                      ███████████████████████████████████████████████████████████████
███████████████████████████████████████████████████████████████████████████████████                                                       ██████████████████████████████████████████████████████████████
██████████████████████████████████████████████████████████████████████████████████                                                         █████████████████████████████████████████████████████████████
█████████████████████████████████████████████████████████████████████████████████                                                           ████████████████████████████████████████████████████████████
████████████████████████████████████████████████████████████████████████████████                                                             ███████████████████████████████████████████████████████████
████████████████████████████████████████████████████████████████████████████████                                                            ████████████████████████████████████████████████████████████
███████████████████████████████████████████████████████████████████████████████                                                             ████████████████████████████████████████████████████████████
██████████████████████████████████████████████████████████████████████████████                                                               ███████████████████████████████████████████████████████████
██████████████████████████████████████████████████████████████████████████████                                                                ██████████████████████████████████████████████████████████
█████████████████████████████████████████████████████████████████████████████                                                                 ██████████████████████████████████████████████████████████
████████████████████████████████████████████████████████████████████████████                                                                  ██████████████████████████████████████████████████████████
████████████████████████████████████████████████████████████████████████████                                                                  ██████████████████████████████████████████████████████████
███████████████████████████████████████████████████████████████████████████                                                                   ██████████████████████████████████████████████████████████
██████████████████████████████████████████████████████████████████████████                                                                    ██████████████████████████████████████████████████████████
█████████████████████████████████████████████████████████████████████████                                                                     ██████████████████████████████████████████████████████████
█████████████████████████████████████████████████████████████████████████                                                                      █████████████████████████████████████████████████████████
████████████████████████████████████████████████████████████████████████                                                                       █████████████████████████████████████████████████████████
████████████████████████████████████████████████████████████████████████                                                                        ████████████████████████████████████████████████████████
███████████████████████████████████████████████████████████████████████                                                                          ███████████████████████████████████████████████████████
███████████████████████████████████████████████████████████████████████                                                                          ███████████████████████████████████████████████████████
██████████████████████████████████████████████████████████████████████                                                                           ███████████████████████████████████████████████████████
██████████████████████████████████████████████████████████████████████                                                                           ███████████████████████████████████████████████████████
█████████████████████████████████████████████████████████████████████                                                                            ███████████████████████████████████████████████████████
█████████████████████████████████████████████████████████████████████                                                                            ███████████████████████████████████████████████████████
█████████████████████████████████████████████████████████████████████                                                                            ███████████████████████████████████████████████████████
████████████████████████████████████████████████████████████████████                                                             █████           ███████████████████████████████████████████████████████
████████████████████████████████████████████████████████████████████                                                         █████████████      ████████████████████████████████████████████████████████
███████████████████████████████████████████████████████████████████                                                     ████████████████████    ████████████████████████████████████████████████████████
███████████████████████████████████████████████████████████████████                                                  ███████████████████████     ███████████████████████████████████████████████████████
███████████████████████████████████████████████████████████████████                                            ██████████████████████    █████    ██████████████████████████████████████████████████████
███████████████████████████████████████████████████████████████████████                                       ████████████████████         ███    ██████████████████████████████████████████████████████
███████████████████████████████████████████████████████████████████████████████                              ██████████████████                   ██████████████████████████████████████████████████████
██████████████████████████████████████████████████████████████████████████████████                          █████████████████                     ██████████████████████████████████████████████████████
████████████████████████████████████████████████████████████████████████████████████                         ████████████████████                 ██████████████████████████████████████████████████████
██████████████████████████████████████████████████████████████████████████████████████                              ██ █████████████              ████████████ █████████████████████████████████████████
████████████████████████████████████████████████████████████████      █████████████████                                ███████████████            ████████████ █████████████████████████████████████████
████████████████████████████████████████████████████████████████       ███████████████                                ████████████████             ███████████ █████████████████████████████████████████
███████████████████████████████████████████████████████████████       ██████████████                                 ███████████████████           ██████████  █████████████████████████████████████████
███████████████████████████████████████████████████████████████   ███████████████                                   ███████████  ███████           █████████   █████████████████████████████████████████
███████████████████████████████████████████████████████████████████████████████████                                ████████████   ██████           █████████   █████████████████████████████████████████
████████████████████████████████████████████████████████████████████████████████████                              ██   █ ██████   ██████            ████████   █████████████████████████████████████████
████████████████████████████████████████████████████████████████████████ ███████████                             ██       █████  █████              █████████  █████████████████████████████████████████
██████████████████████████████████████████████████████████████████████   ███████    ██                           █      ███████ ███                 █████████  █████████████████████████████████████████
██████████████████████████████████████████████████████████████ ███████   ███████     █                          ██      ██ ███ ███                  █████████  █████████████████████████████████████████
██████████████████████████████████████████████████████████████  ██████    █████ █     █                                                             ██████████ █████████████████████████████████████████
█████████████████████████████████████████████████████████████    ███████   ██████     ██                                                            ██████████ █████████████████████████████████████████
█████████████████████████████████████████████████████████████       ███████████                                                                     █████████  █████████████████████████████████████████
█████████████████████████████████████████████████████████████       ████████                                                                        ████████  ██████████████████████████████████████████
████████████████████████████████████████████████████████████                                                                                        ████████  ██████████████████████████████████████████
████████████████████████████████████████████████████████████                                                                                        ████████  ██████████████████████████████████████████
████████████████████████████████████████████████████████████                                                                                        ████████  ██████████████████████████████████████████
████████████████████████████████████████████████████████████                                                                                        ████████  ██████████████████████████████████████████
████████████████████████████████████████████████████████████                                                                                       █████████  ██████████████████████████████████████████
███████████████████████████████████████████████████████████                                                                                        █████████  ██████████████████████████████████████████
███████████████████████████████████████████████████████████                                                                                        █████████  ██████████████████████████████████████████
███████████████████████████████████████████████████████████                                                                                        ███████ █  ██████████████████████████████████████████
███████████████████████████████████████████████████████████                                                                                        ███████    ██████████████████████████████████████████
███████████████████████████████████████████████████████████                                                                                        ██████    ███████████████████████████████████████████
███████████████████████████████████████████████████████████                                                                                        ██████    ███████████████████████████████████████████
███████████████████████████████████████████████████████████                                                                                        ██████    ███████████████████████████████████████████
████████████████████████████████████████████████████████████                                                                                       ██████   ████████████████████████████████████████████
████████████████████████████████████████████████████████████                                                                                       █████████████████████████████████████████████████████
████████████████████████████████████████████████████████████                                                                                      ██████████████████████████████████████████████████████
█████████████████████████████████████████████████████████████                                                                                      █████████████████████████████████████████████████████
█████████████████████████████████████████████████████████████                                                                                      █████████████████████████████████████████████████████
█████████████████████████████████████████████████████████████                                                                                      █████████████████████████████████████████████████████
██████████████████████████████████████████████████████████████                                                                                    ██████████████████████████████████████████████████████
██████████████████████████████████████████████████████████████                                                                                   ███████████████████████████████████████████████████████
██████████████████████████████████████████████████████████████                                                                                   ███████████████████████████████████████████████████████
██████████████████████████████████████████████████████████████                                                                                   █ █████████████████████████████████████████████████████
███████████████████████████████████████████████████████████████                                                                                   ██████████████████████████████████████████████████████
███████████████████████████████████████████████████████████████                                                                                   ██████████████████████████████████████████████████████
████████████████████████████████████████████████████████████████                                                                                  ██████████████████████████████████████████████████████
████████████████████████████████████████████████████████████████                                                                                  ██████████████████████████████████████████████████████
████████████████████████████████████████████████████████████████                           ███          █                                         ██████████████████████████████████████████████████████
████████████████████████████████████████████████████████████████                             ██        ██                                        ███████████████████████████████████████████████████████
████████████████████████████████████████████████████████████████                               █     ███                                         ███████████████████████████████████████████████████████
████████████████████████████████████████████████████████████████                                 █████                                           ███████████████████████████████████████████████████████
████████████████████████████████████████████████████████████████                                                                                   █████████████████████████████████████████████████████
████████████████████████████████████████████████████████████████                                                                                  ██████████████████████████████████████████████████████
████████████████████████████████████████████████████████████████                                                                                  ██████████████████████████████████████████████████████
████████████████████████████████████████████████████████████████                                                                                  ██████████████████████████████████████████████████████
█████████████████████████████████████████████████████████████████                                                                                ███████████████████████████████████████████████████████
█████████████████████████████████████████████████████████████████                                                                                ███████████████████████████████████████████████████████
█████████████████████████████████████████████████████████████████                                                                                ███████████████████████████████████████████████████████
█████████████████████████████████████████████████████████████████                                                   █████                        ███████████████████████████████████████████████████████
█████████████████████████████████████████████████████████████████                   █████                      █████████                        ████████████████████████████████████████████████████████
██████████████████████████████████████████████████████████████████                   ███████                ███ ██████                          ████████████████████████████████████████████████████████
██████████████████████████████████████████████████████████████████                    █████████ ████ ██ █        █                              ████████████████████████████████████████████████████████
██████████████████████████████████████████████████████████████████                      ████                                                   █████████████████████████████████████████████████████████
███████████████████████████████████████████████████████████████████                                                                            █████████████████████████████████████████████████████████
████████████████████████████████████████████████████████████████████                                               █                          ██████████████████████████████████████████████████████████
████████████████████████████████████████████████████████████████████                                                                          ██████████████████████████████████████████████████████████
█████████████████████████████████████████████████████████████████████                    ██                                                  ███████████████████████████████████████████████████████████
█████████████████████████████████████████████████████████████████████                                                                        ███████████████████████████████████████████████████████████
██████████████████████████████████████████████████████████████████████                                                                     █████████████████████████████████████████████████████████████
███████████████████████████████████████████████████████████████████████                                                                    █████████████████████████████████████████████████████████████
███████████████████████████████████████████████████████████████████████                                                                   ██████████████████████████████████████████████████████████████
████████████████████████████████████████████████████████████████████████                                                                 ███████████████████████████████████████████████████████████████
█████████████████████████████████████████████████████████████████████████                                                               ████████████████████████████████████████████████████████████████
██████████████████████████████████████████████████████████████████████████                                                             █████████████████████████████████████████████████████████████████
██████████████████████████████████████████████████████████████████████████                                                            ██████████████████████████████████████████████████████████████████
███████████████████████████████████████████████████████████████████████████                                                          ███████████████████████████████████████████████████████████████████
████████████████████████████████████████████████████████████████████████████                                                        ████████████████████████████████████████████████████████████████████
█████████████████████████████████████████████████████████████████████████████                                                      ███████ █████████████████████████████████████████████████████████████
██████████████████████████████████████████████████████████████████████████████                                                     ██████  █████████████████████████████████████████████████████████████
███████████████████████████████████████████████████████████████████████████████                                                  ████████ ██████████████████████████████████████████████████████████████
███████████████████████████████████████████████████████████████████████████████                                                 ████████  ██████████████████████████████████████████████████████████████
███████████████████████████████████████████████████████████████████████████ █████                                              ████████   ██████████████████████████████████████████████████████████████
███████████████████████████████████████████████████████████████████████████  █████                                           ██████████  ███████████████████████████████████████████████████████████████
████████████████████████████████████████████████████████████████████████████  ████                                          ██████████   ███████████████████████████████████████████████████████████████
████████████████████████████████████████████████████████████████████████████    ███                                        ██████████    ███████████████████████████████████████████████████████████████
█████████████████████████████████████████████████████████████████████████████   ████                                      █████████     ████████████████████████████████████████████████████████████████
█████████████████████████████████████████████████████████████████████████████    ████                                    ██████████     ████████████████████████████████████████████████████████████████
█████████████████████████████████████████████████████████████████████████████      ███                                  █████████       ████████████████████████████████████████████████████████████████
█████████████████████████████████████████████████████████████████████████████      ████                               ██████████        ████████████████████████████████████████████████████████████████
█████████████████████████████████████████████████████████████████████████████       ████                             ███████ ██         ███████████████████████████████████████████████████████████████ 
█████████████████████████████████████████████████████████████████████████████        ████                          ███████   ██        █████████████████████████████████████████████████████████████████
█████████████████████████████████████████████████████████████████████████████         █████                      ████████   ███ █     ██████████████████████████████████████████████████████████████████
█████████████████████████████████████████████████████████████████████████████          ██████                ███████████   ███ █      ██████████████████████████████████████████████████████████████████
█████████████████████████████████████████████████████████████████████████████           █████████████ ████████████████     ███        ██████████████████████████████████████████████████████████████████
█████████████████████████████████████████████████████████████████████████████             ██████████████████████████      █████       ██████████████████████████████████████████████████████████████████
█████████████████████████████████████████████████████████████████████████████               ███████████████████████      ██████       ██████████████████████████████████████████████████████████████████
█████████████████████████████████████████████████████████████████████████████                 █████████████████          █████        ██████████████████████████████████████████████████████████████████
█████████████████████████████████████████████████████████████████████████████                                           ██████        ██████████████████████████████████████████████████████████████████
████████████████████████████████████████████████████████████████████████  ███                                           █ ███        ███████████████████████████████████████████████████████████████████
████████████████████████████████████████████████████████████████████████  ███                                          ██ ██         ███████████████████████████████████████████████████████████████████
████████████████████████████████████████████████████████████████████████ ██                                           ██  ██        ████████████████████████████████████████████████████████████████████
████████████████████████████████████████████████████████████████████████ █                                            ██ ███      ██████████████████████████████████████████████████████████████████████
██████████████████████████████████████████████████████████████████████████                                            ██ ██      ███████████████████████████████████████████████████████████████████████
█████████████████████████████████████████████████████████████████████████                                            ██  ██     ████████████████████████████████████████████████████████████████████████
█████████████████████████████████████████████████████████████████████████                                            ██  ██    █████████████████████████████████████████████████████████████████████████
███████████████████████████████████████████████████████████████████████████                                         ██  ███   ██████████████████████████████████████████████████████████████████████████
███████████████████████████████████████████████████████████████████████████████                                     ██  ██   ███████████████████████████████████████████████████████████████████████████
██████████████████████████████████████████████████████████████████████████████████████                              ██  ██ █████████████████████████████████████████████████████████████████████████████
████████████████████████████████████████████████████████████████████████████████████████████                       ███  ████████████████████████████████████████████████████████████████████████████████
█████████████████████████████████████████████████████████████████████████████████████████████                      ██  █████████████████████████████████████████████████████████████████████████████████
█████████████████████████████████████████████████████████████████████████████████████████████                      ██  █████████████████████████████████████████████████████████████████████████████████
██████████████████████████████████████████████████████████████████████████████████████████████                     ██  █████████████████████████████████████████████████████████████████████████████████
██████████████████████████████████████████████████████████████████████████████████████████████                     █████████████████████████████████████████████████████████████████████████████████████
██████████████████████████████████████████████████████████████████████████████████████████████                     █████████████████████████████████████████████████████████████████████████████████████
██████████████████████████████████████████████████████████████████████████████████████████████                     █████████████████████████████████████████████████████████████████████████████████████
███████████████████████████████████████████████████████████████████████████████████████████████                   ██████████████████████████████████████████████████████████████████████████████████████
███████████████████████████████████████████████████████████████████████████████████████████████               ██████████████████████████████████████████████████████████████████████████████████████████
███████████████████████████████████████████████████████████████████████████████████████████████             ████████████████████████████████████████████████████████████████████████████████████████████
███████████████████████████████████████████████████████████████████████████████████████████████             ████████████████████████████████████████████████████████████████████████████████████████████
███████████████████████████████████████████████████████████████████████████████████████████████             ████████████████████████████████████████████████████████████████████████████████████████████
███████████████████████████████████████████████████████████████████████████████████████████████             ████████████████████████████████████████████████████████████████████████████████████████████
███████████████████████████████████████████████████████████████████████████████████████████████            █████████████████████████████████████████████████████████████████████████████████████████████
███████████████████████████████████████████████████████████████████████████████████████████████            █████████████████████████████████████████████████████████████████████████████████████████████
