a: 9.88%						      |	a: 5.82%
b: 1.27%						      |	b: 1.07%
c: 2.90%						      |	c: 2.11%
d: 3.78%						      |	d: 2.69%
e: 9.95%						      |	e: 9.61%
f: 0.45%						      |	f: 1.88%
g: 0.87%						      |	g: 1.34%
h: 0.80%						      |	h: 4.70%
i: 4.45%						      |	i: 5.67%
j: 0.47%						      |	j: 0.08%
k: 0.00%						      |	k: 0.49%
l: 4.46%						      |	l: 2.93%
m: 2.15%						      |	m: 1.83%
n: 5.14%						      |	n: 5.11%
o: 7.24%						      |	o: 5.60%
p: 1.73%						      |	p: 1.37%
q: 0.93%						      |	q: 0.11%
r: 4.87%						      |	r: 4.23%
s: 5.58%						      |	s: 5.46%
t: 2.86%						      |	t: 7.17%
u: 3.32%						      |	u: 1.92%
v: 0.84%						      |	v: 0.69%
w: 0.00%						      |	w: 1.35%
x: 0.06%						      |	x: 0.13%
y: 0.98%						      |	y: 1.21%
z: 0.36%						      |	z: 0.02%
