com/boxever/challenge/airline/algorithms/ShortestPathFinder.class
com/boxever/challenge/airline/model/AirlinePath.class
com/boxever/challenge/airline/model/AirlineGraph.class
com/boxever/challenge/airline/AirlineApplication.class
com/boxever/challenge/airline/exceptions/InputException.class
