%YAML 1.1
%TAG !u! tag:unity3d.com,2011:
--- !u!74 &7400000
AnimationClip:
  m_ObjectHideFlags: 0
  m_CorrespondingSourceObject: {fileID: 0}
  m_PrefabInstance: {fileID: 0}
  m_PrefabAsset: {fileID: 0}
  m_Name: Destruir
  serializedVersion: 6
  m_Legacy: 0
  m_Compressed: 0
  m_UseHighQualityCurve: 1
  m_RotationCurves: []
  m_CompressedRotationCurves: []
  m_EulerCurves: []
  m_PositionCurves: []
  m_ScaleCurves: []
  m_FloatCurves: []
  m_PPtrCurves:
  - curve:
    - time: 0
      value: {fileID: -3468994143459283456, guid: 2b9413dcbab3b7c429ea9a4c45d54cf0, type: 3}
    - time: 0.083333336
      value: {fileID: 7144568498353350527, guid: 2b9413dcbab3b7c429ea9a4c45d54cf0, type: 3}
    - time: 0.16666667
      value: {fileID: 7638694064163648409, guid: 2b9413dcbab3b7c429ea9a4c45d54cf0, type: 3}
    - time: 0.25
      value: {fileID: 8729101359193379664, guid: 2b9413dcbab3b7c429ea9a4c45d54cf0, type: 3}
    - time: 0.33333334
      value: {fileID: -7330495575719147060, guid: 2b9413dcbab3b7c429ea9a4c45d54cf0, type: 3}
    - time: 0.41666666
      value: {fileID: 8849095768334654569, guid: 2b9413dcbab3b7c429ea9a4c45d54cf0, type: 3}
    - time: 0.5
      value: {fileID: -2252370586133961227, guid: 2b9413dcbab3b7c429ea9a4c45d54cf0, type: 3}
    - time: 0.5833333
      value: {fileID: -3646375149683794300, guid: 2b9413dcbab3b7c429ea9a4c45d54cf0, type: 3}
    - time: 0.6666667
      value: {fileID: -6018995672260073552, guid: 2b9413dcbab3b7c429ea9a4c45d54cf0, type: 3}
    - time: 0.75
      value: {fileID: -4052881915847119638, guid: 2b9413dcbab3b7c429ea9a4c45d54cf0, type: 3}
    - time: 0.8333333
      value: {fileID: -3815714320726241031, guid: 2b9413dcbab3b7c429ea9a4c45d54cf0, type: 3}
    - time: 0.9166667
      value: {fileID: 9040450454783375780, guid: 2b9413dcbab3b7c429ea9a4c45d54cf0, type: 3}
    - time: 1
      value: {fileID: 4282483677827853472, guid: 2b9413dcbab3b7c429ea9a4c45d54cf0, type: 3}
    - time: 1.0833334
      value: {fileID: 4278536187556028417, guid: 2b9413dcbab3b7c429ea9a4c45d54cf0, type: 3}
    - time: 1.1666666
      value: {fileID: 4635153639443726790, guid: 2b9413dcbab3b7c429ea9a4c45d54cf0, type: 3}
    - time: 1.25
      value: {fileID: 8806194992118333798, guid: 2b9413dcbab3b7c429ea9a4c45d54cf0, type: 3}
    attribute: m_Sprite
    path: 
    classID: 212
    script: {fileID: 0}
  m_SampleRate: 12
  m_WrapMode: 0
  m_Bounds:
    m_Center: {x: 0, y: 0, z: 0}
    m_Extent: {x: 0, y: 0, z: 0}
  m_ClipBindingConstant:
    genericBindings:
    - serializedVersion: 2
      path: 0
      attribute: 0
      script: {fileID: 0}
      typeID: 212
      customType: 23
      isPPtrCurve: 1
    pptrCurveMapping:
    - {fileID: -3468994143459283456, guid: 2b9413dcbab3b7c429ea9a4c45d54cf0, type: 3}
    - {fileID: 7144568498353350527, guid: 2b9413dcbab3b7c429ea9a4c45d54cf0, type: 3}
    - {fileID: 7638694064163648409, guid: 2b9413dcbab3b7c429ea9a4c45d54cf0, type: 3}
    - {fileID: 8729101359193379664, guid: 2b9413dcbab3b7c429ea9a4c45d54cf0, type: 3}
    - {fileID: -7330495575719147060, guid: 2b9413dcbab3b7c429ea9a4c45d54cf0, type: 3}
    - {fileID: 8849095768334654569, guid: 2b9413dcbab3b7c429ea9a4c45d54cf0, type: 3}
    - {fileID: -2252370586133961227, guid: 2b9413dcbab3b7c429ea9a4c45d54cf0, type: 3}
    - {fileID: -3646375149683794300, guid: 2b9413dcbab3b7c429ea9a4c45d54cf0, type: 3}
    - {fileID: -6018995672260073552, guid: 2b9413dcbab3b7c429ea9a4c45d54cf0, type: 3}
    - {fileID: -4052881915847119638, guid: 2b9413dcbab3b7c429ea9a4c45d54cf0, type: 3}
    - {fileID: -3815714320726241031, guid: 2b9413dcbab3b7c429ea9a4c45d54cf0, type: 3}
    - {fileID: 9040450454783375780, guid: 2b9413dcbab3b7c429ea9a4c45d54cf0, type: 3}
    - {fileID: 4282483677827853472, guid: 2b9413dcbab3b7c429ea9a4c45d54cf0, type: 3}
    - {fileID: 4278536187556028417, guid: 2b9413dcbab3b7c429ea9a4c45d54cf0, type: 3}
    - {fileID: 4635153639443726790, guid: 2b9413dcbab3b7c429ea9a4c45d54cf0, type: 3}
    - {fileID: 8806194992118333798, guid: 2b9413dcbab3b7c429ea9a4c45d54cf0, type: 3}
  m_AnimationClipSettings:
    serializedVersion: 2
    m_AdditiveReferencePoseClip: {fileID: 0}
    m_AdditiveReferencePoseTime: 0
    m_StartTime: 0
    m_StopTime: 1.3333334
    m_OrientationOffsetY: 0
    m_Level: 0
    m_CycleOffset: 0
    m_HasAdditiveReferencePose: 0
    m_LoopTime: 1
    m_LoopBlend: 0
    m_LoopBlendOrientation: 0
    m_LoopBlendPositionY: 0
    m_LoopBlendPositionXZ: 0
    m_KeepOriginalOrientation: 0
    m_KeepOriginalPositionY: 1
    m_KeepOriginalPositionXZ: 0
    m_HeightFromFeet: 0
    m_Mirror: 0
  m_EditorCurves: []
  m_EulerEditorCurves: []
  m_HasGenericRootTransform: 0
  m_HasMotionFloatCurves: 0
  m_Events: []
