%YAML 1.1
%TAG !u! tag:unity3d.com,2011:
--- !u!1045 &1
EditorBuildSettings:
  m_ObjectHideFlags: 0
  serializedVersion: 2
  m_Scenes:
  - enabled: 1
    path: Assets/Scenes/Logo.unity
    guid: 3b949709c286ebc4dbcdb28821ffa98b
  - enabled: 1
    path: Assets/Scenes/Intro.unity
    guid: 0e9ee798de834a748acb0294a9f52a3e
  - enabled: 1
    path: Assets/Scenes/Menu.unity
    guid: 8665fb27855fb1b43828136fc43e3863
  - enabled: 1
    path: Assets/Scenes/Nivel0.unity
    guid: 01f22abc550985a4bbd1cf5c78bee66b
  - enabled: 1
    path: Assets/Scenes/Nivel1.unity
    guid: 2cda990e2423bbf4892e6590ba056729
  - enabled: 1
    path: Assets/Scenes/Nivel2.unity
    guid: 016f30b5a1e15e94bab0732564091e2c
  - enabled: 1
    path: Assets/Scenes/Nivel3.unity
    guid: effe78c34a62ff14ca236615551d48b8
  - enabled: 1
    path: Assets/Scenes/Instrucciones.unity
    guid: 54ac868b61664994981f128ea21ddea3
  - enabled: 1
    path: Assets/Scenes/Creditos.unity
    guid: dd1df36a84f16d347acc722b68df15ac
  - enabled: 1
    path: Assets/Scenes/Final.unity
    guid: 6ce43ee509f8fd54d99a58e46b399f1d
  m_configObjects: {}
