class de.ruv.javaschulung.Lektion11IOmitExceptions.Customer;Peter Wurst;66666;Foo;Bar;42
class de.ruv.javaschulung.Lektion11IOmitExceptions.Customer;Nikola Tesla;8822;Bar;Baz;7
class de.ruv.javaschulung.Lektion11IOmitExceptions.Customer;Elon Musk;1234;Mars;Alba Patera;21
class de.ruv.javaschulung.Lektion11IOmitExceptions.Customer;Jonny 5;97103;Astoria, Oregon;Stephanie Speck;5