org/mycompany/invoice/repository/InvoiceRepositoryInterface.class
org/mycompany/invoice/entity/Invoice.class
org/mycompany/invoice/controller/InvoiceControllerMichel.class
org/mycompany/invoice/repository/InvoiceRepositoryMichel.class
org/mycompany/invoice/controller/InvoiceControllerInterface.class
org/mycompany/invoice/repository/InvoiceRepository.class
org/mycompany/invoice/service/InvoiceServiceInterface.class
org/mycompany/invoice/App.class
