com\sportshop\controller\UserController.class
com\sportshop\Application.class
com\sportshop\repository\UserRepository.class
com\sportshop\service\impl\UserService.class
com\sportshop\response\BaseResponse.class
com\sportshop\entity\UserEntity.class
com\sportshop\dto\UserDTO.class
com\sportshop\service\IUserService.class
com\sportshop\converter\UserConverter.class
com\sportshop\response\AuthResponse.class
