##############################################################################################################
# Running bias tests for model tweets_glove_w2v
##############################################################################################################

************************************************** WEAT 01 **************************************************
T1: aster klee hyazinthe ringelblume mohn azalee krokus iris orchidee rose glockenblume narzisse flieder stiefmütterchen tulpe butterblume gänseblümchen lilie pfingstrose veilchen nelke gladiole magnolie petunie
T2: ameise raupe floh heuschrecke spinne bettwanze tausendfüßler fliegen made tarantel biene kakerlake mücke moskito termite käfer grille hornisse motte wespe blattlaus libelle bremse rüsselkäfer
A1: streicheln freiheit gesundheit liebe frieden jubeln freund freundin himmel treu vergnügen diamant ehrlich glücklich regenbogen geschenk ehre wunder sonnenaufgang familie glück lachen paradies urlaub freude wunderbar
A2: missbrauch absturz schmutz mord krankheit unfall tod trauer vergiften stinken angriff katastrophe hass tragödie scheidung gefängnis armut hässlich krebs töten faul erbrechen qual furchtbar schrecklich böse


ECT (↑): Corr 48.46% (p-Wert 0.0002722)

BAT (↓): 38.77%

unable to import 'smart_open.gcs', disabling that module
Not in vocab:
Using T1: aster klee hyazinthe ringelblume mohn azalee krokus iris orchidee rose glockenblume narzisse flieder stiefmütterchen tulpe butterblume gänseblümchen lilie pfingstrose veilchen nelke gladiole magnolie petunie
Using T2: ameise raupe floh heuschrecke spinne bettwanze tausendfüßler fliegen made tarantel biene kakerlake mücke moskito termite käfer grille hornisse motte wespe blattlaus libelle bremse rüsselkäfer
Using A1: streicheln freiheit gesundheit liebe frieden jubeln freund freundin himmel treu vergnügen diamant ehrlich glücklich regenbogen geschenk ehre wunder sonnenaufgang familie glück lachen paradies urlaub freude wunderbar
Using A2: missbrauch absturz schmutz mord krankheit unfall tod trauer vergiften stinken angriff katastrophe hass tragödie scheidung gefängnis armut hässlich krebs töten faul erbrechen qual furchtbar schrecklich böse
Computing p value - Number of possible permutations: 32247603683100.004
Computing randomly first 100000  permutations
WEAT (↓): Corr 71.45% (p-Wert 0.0067, test statistic 0.6979)

kMEANS (↓): 72.08%

SVM:
Test 1: aster klee hyazinthe ringelblume mohn azalee krokus iris orchidee rose glockenblume narzisse flieder stiefmütterchen tulpe butterblume gänseblümchen lilie pfingstrose veilchen nelke gladiole magnolie petunie
Train 1 (generated): friedenslilie lichtnelke muschelkern-echtperlen plüschkatze orqu ,weiße ,bürgerrechtler rosen neugegründet zierquitte zierkirsche
Test 2: ameise raupe floh heuschrecke spinne bettwanze tausendfüßler fliegen made tarantel biene kakerlake mücke moskito termite käfer grille hornisse motte wespe blattlaus libelle bremse rüsselkäfer
Train 2 (generated): diskokugel schmetterling opositionspartei fliege gestochen vogelspinne hummel insekt schildkröte angefahrene
Number of train words: 21
SVM (↓): 64.48%


************************************************** WEAT 02 **************************************************
T1: dudelsack cello gitarre laute posaune banjo klarinette mundharmonika mandoline trompete fagott trommel harfe oboe tuba glocke geige cembalo klavier viola bongo flöte horn saxophon
T2: pfeil verein gewehr rakete speer axt dolch harpune pistole schwert klinge dynamit beil panzer bombe feuerwaffe messer schrotflinte tränengas kanone granate morgenstern schleuder peitsche
A1: streicheln freiheit gesundheit liebe frieden jubeln freund freundin himmel treu vergnügen diamant ehrlich glücklich regenbogen geschenk ehre wunder sonnenaufgang familie glück lachen paradies urlaub freude wunderbar
A2: missbrauch absturz schmutz mord krankheit unfall tod trauer vergiften stinken angriff katastrophe hass tragödie scheidung gefängnis armut hässlich krebs töten faul erbrechen qual furchtbar schrecklich böse


ECT (↑): Corr 34.49% (p-Wert 0.01228)

BAT (↓): 41.43%

unable to import 'smart_open.gcs', disabling that module
Not in vocab:
Using T1: dudelsack cello gitarre laute posaune banjo klarinette mundharmonika mandoline trompete fagott trommel harfe oboe tuba glocke geige cembalo klavier viola bongo flöte horn saxophon
Using T2: pfeil verein gewehr rakete speer axt dolch harpune pistole schwert klinge dynamit beil panzer bombe feuerwaffe messer schrotflinte tränengas kanone granate morgenstern schleuder peitsche
Using A1: streicheln freiheit gesundheit liebe frieden jubeln freund freundin himmel treu vergnügen diamant ehrlich glücklich regenbogen geschenk ehre wunder sonnenaufgang familie glück lachen paradies urlaub freude wunderbar
Using A2: missbrauch absturz schmutz mord krankheit unfall tod trauer vergiften stinken angriff katastrophe hass tragödie scheidung gefängnis armut hässlich krebs töten faul erbrechen qual furchtbar schrecklich böse
Computing p value - Number of possible permutations: 32247603683100.004
Computing randomly first 100000  permutations
WEAT (↓): Corr 74.21% (p-Wert 0.00472, test statistic 0.5774)

kMEANS (↓): 89.71%

SVM:
Test 1: dudelsack cello gitarre laute posaune banjo klarinette mundharmonika mandoline trompete fagott trommel harfe oboe tuba glocke geige cembalo klavier viola bongo flöte horn saxophon
Train 1 (generated): piano violine schlagzeug ukulele bassgitarre gespielt akkordeon spielt wohltemperiertes hypnotischer querflöte spielst westerngitarre zither bratsche vierhändig
Test 2: pfeil verein gewehr rakete speer axt dolch harpune pistole schwert klinge dynamit beil panzer bombe feuerwaffe messer schrotflinte tränengas kanone granate morgenstern schleuder peitsche
Train 2 (generated): schild machete offener waffe mann schalldämpfer bewaffnet amors bogen knopf
Number of train words: 26
SVM (↓): 91.35%


************************************************** WEAT 03 **************************************************
T1: deutsch deutsche deutschland europäisch weiß kaukasisch
T2: ausländer flüchtling flüchtlinge fremd schwarz dunkelhäutig
A1: streicheln freiheit gesundheit liebe frieden jubeln freund freundin himmel treu vergnügen diamant ehrlich glücklich regenbogen geschenk ehre wunder sonnenaufgang familie glück lachen paradies urlaub freude wunderbar
A2: missbrauch absturz schmutz mord krankheit unfall tod trauer vergiften stinken angriff katastrophe hass tragödie scheidung gefängnis armut hässlich krebs töten faul erbrechen qual furchtbar schrecklich böse


ECT (↑): Corr 84.89% (p-Wert 1.878e-15)

BAT (↓): 35.01%

unable to import 'smart_open.gcs', disabling that module
Not in vocab:
Using T1: deutsch deutsche deutschland europäisch weiß kaukasisch
Using T2: ausländer flüchtling flüchtlinge fremd schwarz dunkelhäutig
Using A1: streicheln freiheit gesundheit liebe frieden jubeln freund freundin himmel treu vergnügen diamant ehrlich glücklich regenbogen geschenk ehre wunder sonnenaufgang familie glück lachen paradies urlaub freude wunderbar
Using A2: missbrauch absturz schmutz mord krankheit unfall tod trauer vergiften stinken angriff katastrophe hass tragödie scheidung gefängnis armut hässlich krebs töten faul erbrechen qual furchtbar schrecklich böse
Computing p value - Number of possible permutations: 924.0
WEAT (↓): Corr 27.01% (p-Wert 0.3387, test statistic 0.06267)

kMEANS (↓): 58.00%

SVM:
Test 1: deutsch deutsche deutschland europäisch weiß kaukasisch
Train 1 (generated): deutschen englisch s.t.r.e.a.m französisch türkisch erotikmassage_stuttgart spanisch sprache daromath farmersdynasty
Test 2: ausländer flüchtling flüchtlinge fremd schwarz dunkelhäutig
Train 2 (generated): migranten migrationshintergrund türken moslems einwanderer afrikaner verändern-wir muslime censuré h.-a
Number of train words: 20
SVM (↓): 75.42%


************************************************** WEAT 04 **************************************************
T1: ursula carin karin helga sabine ingrid renate monica monika susanne gisela petra birgit andrea anna brigitte claudia klaudia erica erika christa krista elke stefanie stephanie gertrud elisabeth elizabeth peter michael thomas andreas wolfgang claus klaus jürgen günter günther stefan stephan christian kristian uwe werner horst frank dieter manfred gerhard gerhardt hans bernd berndt bernt thorsten torsten mathias matthias helmut helmuth
T2: elif zeynep hiranur miray zehra ecrin azra eylül defne nehir yusuf eymen mustafa ömer berat miraç ayaz ahmet mehmet muhammed zuzanna lena julia maja zofia hanna amelia aleksandra alicja natalia jakub antoni szymon jan filip kacper aleksander franciszek mikołaj wojciech amena qamar haya ousa sandra rosarita reem aıscha maya hala akram abóòd hasan elias ali alex zak miran aimar burhan
A1: streicheln freiheit gesundheit liebe frieden jubeln freund freundin himmel treu vergnügen diamant ehrlich glücklich regenbogen geschenk ehre wunder sonnenaufgang familie glück lachen paradies urlaub freude wunderbar
A2: missbrauch absturz schmutz mord krankheit unfall tod trauer vergiften stinken angriff katastrophe hass tragödie scheidung gefängnis armut hässlich krebs töten faul erbrechen qual furchtbar schrecklich böse


ECT (↑): Corr 49.47% (p-Wert 0.0001927)

BAT (↓): 36.12%

unable to import 'smart_open.gcs', disabling that module
Not in vocab: hiranur abóòd rosarita aıscha eymen
Using T1: ursula carin karin helga sabine ingrid renate monica monika susanne gisela petra birgit andrea anna brigitte claudia klaudia erica erika christa krista elke stefanie stephanie gertrud elisabeth elizabeth peter michael thomas andreas wolfgang claus klaus jürgen günter günther stefan stephan christian kristian uwe werner horst frank dieter manfred gerhard gerhardt hans bernd berndt bernt thorsten
Using T2: elif zeynep miray zehra ecrin azra eylül defne nehir yusuf mustafa ömer berat miraç ayaz ahmet mehmet muhammed zuzanna lena julia maja zofia hanna amelia aleksandra alicja natalia jakub antoni szymon jan filip kacper aleksander franciszek mikołaj wojciech amena qamar haya ousa sandra reem maya hala akram hasan elias ali alex zak miran aimar burhan
Using A1: streicheln freiheit gesundheit liebe frieden jubeln freund freundin himmel treu vergnügen diamant ehrlich glücklich regenbogen geschenk ehre wunder sonnenaufgang familie glück lachen paradies urlaub freude wunderbar
Using A2: missbrauch absturz schmutz mord krankheit unfall tod trauer vergiften stinken angriff katastrophe hass tragödie scheidung gefängnis armut hässlich krebs töten faul erbrechen qual furchtbar schrecklich böse
Computing p value - Number of possible permutations: 9.852721853009385e+31
Computing randomly first 100000  permutations
WEAT (↓): Corr 116.71% (p-Wert 0.0, test statistic 2.359)

kMEANS (↓): 84.28%

SVM:
Test 1: ursula carin karin helga sabine ingrid renate monica monika susanne gisela petra birgit andrea anna brigitte claudia klaudia erica erika christa krista elke stefanie stephanie gertrud elisabeth elizabeth peter michael thomas andreas wolfgang claus klaus jürgen günter günther stefan stephan christian kristian uwe werner horst frank dieter manfred gerhard gerhardt hans bernd berndt bernt thorsten torsten mathias matthias helmut helmuth
Train 1 (generated): marlies dr. müller leyen vonderleyen karusseit andress islamophobiereport kommissionspräsidentin eu-kommissionspräsidentin
Test 2: elif zeynep hiranur miray zehra ecrin azra eylül defne nehir yusuf eymen mustafa ömer berat miraç ayaz ahmet mehmet muhammed zuzanna lena julia maja zofia hanna amelia aleksandra alicja natalia jakub antoni szymon jan filip kacper aleksander franciszek mikołaj wojciech amena qamar haya ousa sandra rosarita reem aıscha maya hala akram abóòd hasan elias ali alex zak miran aimar burhan
Train 2 (generated): akçay piątkowska kundler ingrid kwaśniewski javed kaldırım shafak tugral tuğral
Number of train words: 20
SVM (↓): 70.35%


************************************************** WEAT 05 **************************************************
T1: deutsch deutsche deutschland europäisch weiß kaukasisch
T2: ausländer flüchtling flüchtlinge fremd schwarz dunkelhäutig
A1: gut positiv ehrlich ehrlichkeit rechtschaffen rechtschaffenheit gesetz recht frei unschuldig
A2: schlecht negativ unehrlich lügen kriminalität kriminell verbrechen straftat verurteilt schuldig


ECT (↑): Corr 75.04% (p-Wert 0.0001384)

BAT (↓): 57.11%

unable to import 'smart_open.gcs', disabling that module
Not in vocab:
Using T1: deutsch deutsche deutschland europäisch weiß kaukasisch
Using T2: ausländer flüchtling flüchtlinge fremd schwarz dunkelhäutig
Using A1: gut positiv ehrlich ehrlichkeit rechtschaffen rechtschaffenheit gesetz recht frei unschuldig
Using A2: schlecht negativ unehrlich lügen kriminalität kriminell verbrechen straftat verurteilt schuldig
Computing p value - Number of possible permutations: 924.0
WEAT (↓): Corr 115.72% (p-Wert 0.02706, test statistic 0.3132)

kMEANS (↓): 57.83%

SVM:
Test 1: deutsch deutsche deutschland europäisch weiß kaukasisch
Train 1 (generated): deutschen englisch s.t.r.e.a.m französisch türkisch erotikmassage_stuttgart spanisch sprache daromath farmersdynasty
Test 2: ausländer flüchtling flüchtlinge fremd schwarz dunkelhäutig
Train 2 (generated): migranten migrationshintergrund türken moslems einwanderer afrikaner verändern-wir muslime censuré h.-a
Number of train words: 20
SVM (↓): 75.42%


************************************************** WEAT 06 **************************************************
T1: ursula carin karin helga sabine ingrid renate monica monika susanne gisela petra birgit andrea anna brigitte claudia klaudia erica erika christa krista elke stefanie stephanie gertrud elisabeth elizabeth peter michael thomas andreas wolfgang claus klaus jürgen günter günther stefan stephan christian kristian uwe werner horst frank dieter manfred gerhard gerhardt hans bernd berndt bernt thorsten torsten mathias matthias helmut helmuth
T2: elif zeynep hiranur miray zehra ecrin azra eylül defne nehir yusuf eymen mustafa ömer berat miraç ayaz ahmet mehmet muhammed zuzanna lena julia maja zofia hanna amelia aleksandra alicja natalia jakub antoni szymon jan filip kacper aleksander franciszek mikołaj wojciech amena qamar haya ousa sandra rosarita reem aıscha maya hala akram abóòd hasan elias ali alex zak miran aimar burhan
A1: gut positiv ehrlich ehrlichkeit rechtschaffen rechtschaffenheit gesetz recht frei unschuldig
A2: schlecht negativ unehrlich lügen kriminalität kriminell verbrechen straftat verurteilt schuldig


ECT (↑): Corr 9.17% (p-Wert 0.7005)

BAT (↓): 37.28%

unable to import 'smart_open.gcs', disabling that module
Not in vocab: eymen hiranur rosarita abóòd aıscha
Using T1: ursula carin karin helga sabine ingrid renate monica monika susanne gisela petra birgit andrea anna brigitte claudia klaudia erica erika christa krista elke stefanie stephanie gertrud elisabeth elizabeth peter michael thomas andreas wolfgang claus klaus jürgen günter günther stefan stephan christian kristian uwe werner horst frank dieter manfred gerhard gerhardt hans bernd berndt bernt thorsten
Using T2: elif zeynep miray zehra ecrin azra eylül defne nehir yusuf mustafa ömer berat miraç ayaz ahmet mehmet muhammed zuzanna lena julia maja zofia hanna amelia aleksandra alicja natalia jakub antoni szymon jan filip kacper aleksander franciszek mikołaj wojciech amena qamar haya ousa sandra reem maya hala akram hasan elias ali alex zak miran aimar burhan
Using A1: gut positiv ehrlich ehrlichkeit rechtschaffen rechtschaffenheit gesetz recht frei unschuldig
Using A2: schlecht negativ unehrlich lügen kriminalität kriminell verbrechen straftat verurteilt schuldig
Computing p value - Number of possible permutations: 9.852721853009385e+31
Computing randomly first 100000  permutations
WEAT (↓): Corr 80.33% (p-Wert 0.0, test statistic 1.325)

kMEANS (↓): 84.26%

SVM:
Test 1: ursula carin karin helga sabine ingrid renate monica monika susanne gisela petra birgit andrea anna brigitte claudia klaudia erica erika christa krista elke stefanie stephanie gertrud elisabeth elizabeth peter michael thomas andreas wolfgang claus klaus jürgen günter günther stefan stephan christian kristian uwe werner horst frank dieter manfred gerhard gerhardt hans bernd berndt bernt thorsten torsten mathias matthias helmut helmuth
Train 1 (generated): marlies dr. müller leyen vonderleyen karusseit andress islamophobiereport kommissionspräsidentin eu-kommissionspräsidentin
Test 2: elif zeynep hiranur miray zehra ecrin azra eylül defne nehir yusuf eymen mustafa ömer berat miraç ayaz ahmet mehmet muhammed zuzanna lena julia maja zofia hanna amelia aleksandra alicja natalia jakub antoni szymon jan filip kacper aleksander franciszek mikołaj wojciech amena qamar haya ousa sandra rosarita reem aıscha maya hala akram abóòd hasan elias ali alex zak miran aimar burhan
Train 2 (generated): akçay piątkowska kundler ingrid kwaśniewski javed kaldırım shafak tugral tuğral
Number of train words: 20
SVM (↓): 70.35%


************************************************** WEAT 07 **************************************************
T1: jung modern frisch neu jugendlich jugend
T2: alt antik uralt vergangen vergangenheit historisch
A1: streicheln freiheit gesundheit liebe frieden jubeln freund freundin himmel treu vergnügen diamant ehrlich glücklich regenbogen geschenk ehre wunder sonnenaufgang familie glück lachen paradies urlaub freude wunderbar
A2: missbrauch absturz schmutz mord krankheit unfall tod trauer vergiften stinken angriff katastrophe hass tragödie scheidung gefängnis armut hässlich krebs töten faul erbrechen qual furchtbar schrecklich böse


ECT (↑): Corr 76.23% (p-Wert 5.181e-11)

BAT (↓): 53.62%

unable to import 'smart_open.gcs', disabling that module
Not in vocab:
Using T1: jung modern frisch neu jugendlich jugend
Using T2: alt antik uralt vergangen vergangenheit historisch
Using A1: streicheln freiheit gesundheit liebe frieden jubeln freund freundin himmel treu vergnügen diamant ehrlich glücklich regenbogen geschenk ehre wunder sonnenaufgang familie glück lachen paradies urlaub freude wunderbar
Using A2: missbrauch absturz schmutz mord krankheit unfall tod trauer vergiften stinken angriff katastrophe hass tragödie scheidung gefängnis armut hässlich krebs töten faul erbrechen qual furchtbar schrecklich böse
Computing p value - Number of possible permutations: 924.0
WEAT (↓): Corr 145.40% (p-Wert 0.003247, test statistic 0.3002)

kMEANS (↓): 59.67%

SVM:
Test 1: jung modern frisch neu jugendlich jugend
Train 1 (generated): alt lust_kurven jaechan myunghoon jaeil naiv au、 u.alt matt/sports unccraf
Test 2: alt antik uralt vergangen vergangenheit historisch
Train 2 (generated): jahre denney/frazier älter jung serafini/tran lu/mitrofanov everton-m.united jahren geworden bin
Number of train words: 20
SVM (↓): 42.08%


************************************************** WEAT 08 **************************************************
T1: julia stefanie stephanie anna katharina katarina catharina catarina katrin kathrin cathrin catrin sandra christian kristian sebastian jan daniel alexander sara sarah lisa laura lucas lukas philip philipp tim timm hannah hanna lea leah leonie lena lara leon luca
T2: helga ursula ingrid gisela christa krista inge hans günter günther horst klaus claus karl carl werner karin renate monika peter wolfgang jürgen dieter angelika sabine petra gabriele michael thomas tomas susanne andrea claudia birgit andreas frank torsten thorsten
A1: streicheln freiheit gesundheit liebe frieden jubeln freund freundin himmel treu vergnügen diamant ehrlich glücklich regenbogen geschenk ehre wunder sonnenaufgang familie glück lachen paradies urlaub freude wunderbar
A2: missbrauch absturz schmutz mord krankheit unfall tod trauer vergiften stinken angriff katastrophe hass tragödie scheidung gefängnis armut hässlich krebs töten faul erbrechen qual furchtbar schrecklich böse


ECT (↑): Corr 88.61% (p-Wert 2.523e-18)

BAT (↓): 45.24%

unable to import 'smart_open.gcs', disabling that module
Not in vocab:
Using T1: julia stefanie stephanie anna katharina katarina catharina catarina katrin kathrin cathrin catrin sandra christian kristian sebastian jan daniel alexander sara sarah lisa laura lucas lukas philip philipp tim timm hannah hanna lea leah leonie lena lara leon luca
Using T2: helga ursula ingrid gisela christa krista inge hans günter günther horst klaus claus karl carl werner karin renate monika peter wolfgang jürgen dieter angelika sabine petra gabriele michael thomas tomas susanne andrea claudia birgit andreas frank torsten thorsten
Using A1: streicheln freiheit gesundheit liebe frieden jubeln freund freundin himmel treu vergnügen diamant ehrlich glücklich regenbogen geschenk ehre wunder sonnenaufgang familie glück lachen paradies urlaub freude wunderbar
Using A2: missbrauch absturz schmutz mord krankheit unfall tod trauer vergiften stinken angriff katastrophe hass tragödie scheidung gefängnis armut hässlich krebs töten faul erbrechen qual furchtbar schrecklich böse
Computing p value - Number of possible permutations: 6.892620648693261e+21
Computing randomly first 100000  permutations
WEAT (↓): Corr 1.23% (p-Wert 0.4772, test statistic 0.01149)

kMEANS (↓): 60.95%

SVM:
Test 1: julia stefanie stephanie anna katharina katarina catharina catarina katrin kathrin cathrin catrin sandra christian kristian sebastian jan daniel alexander sara sarah lisa laura lucas lukas philip philipp tim timm hannah hanna lea leah leonie lena lara leon luca
Train 1 (generated): maria göring-eckhardt ingrid stefan sophie kristeva babushkina klöckner gillard leischik
Test 2: helga ursula ingrid gisela christa krista inge hans günter günther horst klaus claus karl carl werner karin renate monika peter wolfgang jürgen dieter angelika sabine petra gabriele michael thomas tomas susanne andrea claudia birgit andreas frank torsten thorsten
Train 2 (generated): schmitt müller dr. zepp-larouche lukoschat rabl-stadler grebing krismer dernesch kromp-kolb
Number of train words: 20
SVM (↓): 57.50%


************************************************** WEAT 09 **************************************************
T1: männlich mann junge bruder er ihm sein sohn vater onkel großvater opa cousin
T2: weiblich frau mädchen schwester sie ihr tochter mutter tante großmutter oma cousine nichte
A1: streicheln freiheit gesundheit liebe frieden jubeln freund freundin himmel treu vergnügen diamant ehrlich glücklich regenbogen geschenk ehre wunder sonnenaufgang familie glück lachen paradies urlaub freude wunderbar
A2: missbrauch absturz schmutz mord krankheit unfall tod trauer vergiften stinken angriff katastrophe hass tragödie scheidung gefängnis armut hässlich krebs töten faul erbrechen qual furchtbar schrecklich böse


ECT (↑): Corr 95.81% (p-Wert 8.399e-29)

BAT (↓): 33.83%

unable to import 'smart_open.gcs', disabling that module
Not in vocab:
Using T1: männlich mann junge bruder er ihm sein sohn vater onkel großvater opa cousin
Using T2: weiblich frau mädchen schwester sie ihr tochter mutter tante großmutter oma cousine nichte
Using A1: streicheln freiheit gesundheit liebe frieden jubeln freund freundin himmel treu vergnügen diamant ehrlich glücklich regenbogen geschenk ehre wunder sonnenaufgang familie glück lachen paradies urlaub freude wunderbar
Using A2: missbrauch absturz schmutz mord krankheit unfall tod trauer vergiften stinken angriff katastrophe hass tragödie scheidung gefängnis armut hässlich krebs töten faul erbrechen qual furchtbar schrecklich böse
Computing p value - Number of possible permutations: 10400600.0
Computing randomly first 100000  permutations
WEAT (↓): Corr -7.89% (p-Wert 0.5755, test statistic -0.0264)

kMEANS (↓): 54.00%

SVM:
Test 1: männlich mann junge bruder er ihm sein sohn vater onkel großvater opa cousin
Train 1 (generated): frau männer ihn schwester freund kumpel mutter papa weil doch obwohl tochter oma cousine
Test 2: weiblich frau mädchen schwester sie ihr tochter mutter tante großmutter oma cousine nichte
Train 2 (generated): frauen freundin männer junge kind mama bruder vater sohn schwägerin
Number of train words: 24
SVM (↓): 38.65%


************************************************** WEAT 10 **************************************************
T1: peter michael thomas andreas wolfgang claus klaus jürgen günter günther stefan stephan christian kristian uwe werner horst frank dieter manfred gerhard gerhardt hans bernd berndt bernt thorsten torsten mathias matthias helmut helmuth walter walther heinz martin jörg joerg rolf jens sven swen alexander jan rainer reiner holger carl karl dirk joachim ralf ralph carsten karsten herbert oliver wilhelm curt kurt
T2: ursula carin karin helga sabine ingrid renate monica monika susanne gisela petra birgit andrea anna brigitte claudia klaudia erica erika christa krista elke stefanie stephanie gertrud elisabeth elizabeth maria angelika heike gabriele cathrin catrin kathrin katrin ilse nicole anja barbara hildegard martina ingeborg gerda marion jutta ute hannelore irmgard irmgart christine kristine inge christina kristina silvia sylvia margarete margarethe kerstin
A1: streicheln freiheit gesundheit liebe frieden jubeln freund freundin himmel treu vergnügen diamant ehrlich glücklich regenbogen geschenk ehre wunder sonnenaufgang familie glück lachen paradies urlaub freude wunderbar
A2: missbrauch absturz schmutz mord krankheit unfall tod trauer vergiften stinken angriff katastrophe hass tragödie scheidung gefängnis armut hässlich krebs töten faul erbrechen qual furchtbar schrecklich böse


ECT (↑): Corr 84.09% (p-Wert 6.196e-15)

BAT (↓): 31.99%

unable to import 'smart_open.gcs', disabling that module
Not in vocab: irmgart
Using T1: peter michael thomas andreas wolfgang claus klaus jürgen günter günther stefan stephan christian kristian uwe werner horst frank dieter manfred gerhard gerhardt hans bernd berndt bernt thorsten torsten mathias matthias helmut helmuth walter walther heinz martin jörg joerg rolf jens sven swen alexander jan rainer reiner holger carl karl dirk joachim ralf ralph carsten karsten herbert oliver wilhelm curt
Using T2: ursula carin karin helga sabine ingrid renate monica monika susanne gisela petra birgit andrea anna brigitte claudia klaudia erica erika christa krista elke stefanie stephanie gertrud elisabeth elizabeth maria angelika heike gabriele cathrin catrin kathrin katrin ilse nicole anja barbara hildegard martina ingeborg gerda marion jutta ute hannelore irmgard christine kristine inge christina kristina silvia sylvia margarete margarethe kerstin
Using A1: streicheln freiheit gesundheit liebe frieden jubeln freund freundin himmel treu vergnügen diamant ehrlich glücklich regenbogen geschenk ehre wunder sonnenaufgang familie glück lachen paradies urlaub freude wunderbar
Using A2: missbrauch absturz schmutz mord krankheit unfall tod trauer vergiften stinken angriff katastrophe hass tragödie scheidung gefängnis armut hässlich krebs töten faul erbrechen qual furchtbar schrecklich böse
Computing p value - Number of possible permutations: 2.4356699707654616e+34
Computing randomly first 100000  permutations
WEAT (↓): Corr -33.90% (p-Wert 0.9666, test statistic -0.5576)

kMEANS (↓): 91.70%

SVM:
Test 1: peter michael thomas andreas wolfgang claus klaus jürgen günter günther stefan stephan christian kristian uwe werner horst frank dieter manfred gerhard gerhardt hans bernd berndt bernt thorsten torsten mathias matthias helmut helmuth walter walther heinz martin jörg joerg rolf jens sven swen alexander jan rainer reiner holger carl karl dirk joachim ralf ralph carsten karsten herbert oliver wilhelm curt kurt
Train 1 (generated): dr. müller schmitt lübcke mordfall marcks borromäus artvandelay friedrich rakoczy/ksta
Test 2: ursula carin karin helga sabine ingrid renate monica monika susanne gisela petra birgit andrea anna brigitte claudia klaudia erica erika christa krista elke stefanie stephanie gertrud elisabeth elizabeth maria angelika heike gabriele cathrin catrin kathrin katrin ilse nicole anja barbara hildegard martina ingeborg gerda marion jutta ute hannelore irmgard irmgart christine kristine inge christina kristina silvia sylvia margarete margarethe kerstin
Train 2 (generated): marlies tanja göring-eckhardt julia leyen vonderleyen karusseit andress islamophobiereport kommissionspräsidentin
Number of train words: 20
SVM (↓): 76.43%


************************************************** WEAT 11 **************************************************
T1: männlich mann junge bruder er ihm sein sohn vater onkel großvater opa cousin
T2: weiblich frau mädchen schwester sie ihr tochter mutter tante großmutter oma cousine nichte
A1: führungskraft verwaltung konzern gehalt büro geschäft karriere arbeit job
A2: zuhause eltern kinder familie cousins ehe hochzeit verwandtschaft erziehung


ECT (↑): Corr 85.76% (p-Wert 5.389e-06)

BAT (↓): 26.93%

unable to import 'smart_open.gcs', disabling that module
Not in vocab:
Using T1: männlich mann junge bruder er ihm sein sohn vater onkel großvater opa cousin
Using T2: weiblich frau mädchen schwester sie ihr tochter mutter tante großmutter oma cousine nichte
Using A1: führungskraft verwaltung konzern gehalt büro geschäft karriere arbeit job
Using A2: zuhause eltern kinder familie cousins ehe hochzeit verwandtschaft erziehung
Computing p value - Number of possible permutations: 10400600.0
Computing randomly first 100000  permutations
WEAT (↓): Corr 63.79% (p-Wert 0.05627, test statistic 0.8025)

kMEANS (↓): 54.08%

SVM:
Test 1: männlich mann junge bruder er ihm sein sohn vater onkel großvater opa cousin
Train 1 (generated): frau männer ihn schwester freund kumpel mutter papa weil doch obwohl tochter oma cousine
Test 2: weiblich frau mädchen schwester sie ihr tochter mutter tante großmutter oma cousine nichte
Train 2 (generated): frauen freundin männer junge kind mama bruder vater sohn schwägerin
Number of train words: 24
SVM (↓): 38.65%


************************************************** WEAT 12 **************************************************
T1: peter michael thomas andreas wolfgang claus klaus jürgen günter günther stefan stephan christian kristian uwe werner horst frank dieter manfred gerhard gerhardt hans bernd berndt bernt thorsten torsten mathias matthias helmut helmuth walter walther heinz martin jörg joerg rolf jens sven swen alexander jan rainer reiner holger carl karl dirk joachim ralf ralph carsten karsten herbert oliver wilhelm curt kurt
T2: ursula carin karin helga sabine ingrid renate monica monika susanne gisela petra birgit andrea anna brigitte claudia klaudia erica erika christa krista elke stefanie stephanie gertrud elisabeth elizabeth maria angelika heike gabriele cathrin catrin kathrin katrin ilse nicole anja barbara hildegard martina ingeborg gerda marion jutta ute hannelore irmgard irmgart christine kristine inge christina kristina silvia sylvia margarete margarethe kerstin
A1: führungskraft verwaltung konzern gehalt büro geschäft karriere arbeit job
A2: zuhause eltern kinder familie cousins ehe hochzeit verwandtschaft erziehung


ECT (↑): Corr 30.86% (p-Wert 0.2128)

BAT (↓): 33.02%

unable to import 'smart_open.gcs', disabling that module
Not in vocab: irmgart
Using T1: peter michael thomas andreas wolfgang claus klaus jürgen günter günther stefan stephan christian kristian uwe werner horst frank dieter manfred gerhard gerhardt hans bernd berndt bernt thorsten torsten mathias matthias helmut helmuth walter walther heinz martin jörg joerg rolf jens sven swen alexander jan rainer reiner holger carl karl dirk joachim ralf ralph carsten karsten herbert oliver wilhelm curt
Using T2: ursula carin karin helga sabine ingrid renate monica monika susanne gisela petra birgit andrea anna brigitte claudia klaudia erica erika christa krista elke stefanie stephanie gertrud elisabeth elizabeth maria angelika heike gabriele cathrin catrin kathrin katrin ilse nicole anja barbara hildegard martina ingeborg gerda marion jutta ute hannelore irmgard christine kristine inge christina kristina silvia sylvia margarete margarethe kerstin
Using A1: führungskraft verwaltung konzern gehalt büro geschäft karriere arbeit job
Using A2: zuhause eltern kinder familie cousins ehe hochzeit verwandtschaft erziehung
Computing p value - Number of possible permutations: 2.4356699707654616e+34
Computing randomly first 100000  permutations
WEAT (↓): Corr 110.33% (p-Wert 0.0, test statistic 2.547)

kMEANS (↓): 91.68%

SVM:
Test 1: peter michael thomas andreas wolfgang claus klaus jürgen günter günther stefan stephan christian kristian uwe werner horst frank dieter manfred gerhard gerhardt hans bernd berndt bernt thorsten torsten mathias matthias helmut helmuth walter walther heinz martin jörg joerg rolf jens sven swen alexander jan rainer reiner holger carl karl dirk joachim ralf ralph carsten karsten herbert oliver wilhelm curt kurt
Train 1 (generated): dr. müller schmitt lübcke mordfall marcks borromäus artvandelay friedrich rakoczy/ksta
Test 2: ursula carin karin helga sabine ingrid renate monica monika susanne gisela petra birgit andrea anna brigitte claudia klaudia erica erika christa krista elke stefanie stephanie gertrud elisabeth elizabeth maria angelika heike gabriele cathrin catrin kathrin katrin ilse nicole anja barbara hildegard martina ingeborg gerda marion jutta ute hannelore irmgard irmgart christine kristine inge christina kristina silvia sylvia margarete margarethe kerstin
Train 2 (generated): marlies tanja göring-eckhardt julia leyen vonderleyen karusseit andress islamophobiereport kommissionspräsidentin
Number of train words: 20
SVM (↓): 76.43%


************************************************** WEAT 13 **************************************************
T1: männlich mann junge bruder er ihm sein sohn vater onkel großvater opa cousin
T2: weiblich frau mädchen schwester sie ihr tochter mutter tante großmutter oma cousine nichte
A1: wissenschaft forschung technologie technik physik chemie mathematik algebra experiment astronomie
A2: poesie kunst tanz literatur roman symphonie theater skulptur tanzen kunstwerk


ECT (↑): Corr 97.14% (p-Wert 1.086e-12)

BAT (↓): 28.22%

unable to import 'smart_open.gcs', disabling that module
Not in vocab:
Using T1: männlich mann junge bruder er ihm sein sohn vater onkel großvater opa cousin
Using T2: weiblich frau mädchen schwester sie ihr tochter mutter tante großmutter oma cousine nichte
Using A1: wissenschaft forschung technologie technik physik chemie mathematik algebra experiment astronomie
Using A2: poesie kunst tanz literatur roman symphonie theater skulptur tanzen kunstwerk
Computing p value - Number of possible permutations: 10400600.0
Computing randomly first 100000  permutations
WEAT (↓): Corr 22.43% (p-Wert 0.2938, test statistic 0.1083)

kMEANS (↓): 53.92%

SVM:
Test 1: männlich mann junge bruder er ihm sein sohn vater onkel großvater opa cousin
Train 1 (generated): frau männer ihn schwester freund kumpel mutter papa weil doch obwohl tochter oma cousine
Test 2: weiblich frau mädchen schwester sie ihr tochter mutter tante großmutter oma cousine nichte
Train 2 (generated): frauen freundin männer junge kind mama bruder vater sohn schwägerin
Number of train words: 24
SVM (↓): 38.65%


************************************************** WEAT 14 **************************************************
T1: peter michael thomas andreas wolfgang claus klaus jürgen günter günther stefan stephan christian kristian uwe werner horst frank dieter manfred gerhard gerhardt hans bernd berndt bernt thorsten torsten mathias matthias helmut helmuth walter walther heinz martin jörg joerg rolf jens sven swen alexander jan rainer reiner holger carl karl dirk joachim ralf ralph carsten karsten herbert oliver wilhelm curt kurt
T2: ursula carin karin helga sabine ingrid renate monica monika susanne gisela petra birgit andrea anna brigitte claudia klaudia erica erika christa krista elke stefanie stephanie gertrud elisabeth elizabeth maria angelika heike gabriele cathrin catrin kathrin katrin ilse nicole anja barbara hildegard martina ingeborg gerda marion jutta ute hannelore irmgard irmgart christine kristine inge christina kristina silvia sylvia margarete margarethe kerstin
A1: wissenschaft forschung technologie technik physik chemie mathematik algebra experiment astronomie
A2: poesie kunst tanz literatur roman symphonie theater skulptur tanzen kunstwerk


ECT (↑): Corr 76.39% (p-Wert 8.847e-05)

BAT (↓): 28.83%

unable to import 'smart_open.gcs', disabling that module
Not in vocab: irmgart
Using T1: peter michael thomas andreas wolfgang claus klaus jürgen günter günther stefan stephan christian kristian uwe werner horst frank dieter manfred gerhard gerhardt hans bernd berndt bernt thorsten torsten mathias matthias helmut helmuth walter walther heinz martin jörg joerg rolf jens sven swen alexander jan rainer reiner holger carl karl dirk joachim ralf ralph carsten karsten herbert oliver wilhelm curt
Using T2: ursula carin karin helga sabine ingrid renate monica monika susanne gisela petra birgit andrea anna brigitte claudia klaudia erica erika christa krista elke stefanie stephanie gertrud elisabeth elizabeth maria angelika heike gabriele cathrin catrin kathrin katrin ilse nicole anja barbara hildegard martina ingeborg gerda marion jutta ute hannelore irmgard christine kristine inge christina kristina silvia sylvia margarete margarethe kerstin
Using A1: wissenschaft forschung technologie technik physik chemie mathematik algebra experiment astronomie
Using A2: poesie kunst tanz literatur roman symphonie theater skulptur tanzen kunstwerk
Computing p value - Number of possible permutations: 2.4356699707654616e+34
Computing randomly first 100000  permutations
WEAT (↓): Corr 33.38% (p-Wert 0.03541, test statistic 0.7047)

kMEANS (↓): 91.68%

SVM:
Test 1: peter michael thomas andreas wolfgang claus klaus jürgen günter günther stefan stephan christian kristian uwe werner horst frank dieter manfred gerhard gerhardt hans bernd berndt bernt thorsten torsten mathias matthias helmut helmuth walter walther heinz martin jörg joerg rolf jens sven swen alexander jan rainer reiner holger carl karl dirk joachim ralf ralph carsten karsten herbert oliver wilhelm curt kurt
Train 1 (generated): dr. müller schmitt lübcke mordfall marcks borromäus artvandelay friedrich rakoczy/ksta
Test 2: ursula carin karin helga sabine ingrid renate monica monika susanne gisela petra birgit andrea anna brigitte claudia klaudia erica erika christa krista elke stefanie stephanie gertrud elisabeth elizabeth maria angelika heike gabriele cathrin catrin kathrin katrin ilse nicole anja barbara hildegard martina ingeborg gerda marion jutta ute hannelore irmgard irmgart christine kristine inge christina kristina silvia sylvia margarete margarethe kerstin
Train 2 (generated): marlies tanja göring-eckhardt julia leyen vonderleyen karusseit andress islamophobiereport kommissionspräsidentin
Number of train words: 20
SVM (↓): 76.43%


************************************************** WEAT 15 **************************************************
T1: männlich mann junge bruder er ihm sein sohn vater onkel großvater opa cousin
T2: weiblich frau mädchen schwester sie ihr tochter mutter tante großmutter oma cousine nichte
A1: handwerker handwerkerin wissenschaftler wissenschaftlerin programmierer programmiererin arzt ärztin chef chefin manager managerin politiker politikerin ingenieur ingenieurin bänker bänkerin pilot pilotin
A2: lehrer lehrerin krankenpfleger krankenpflegerin altenpfleger altenpflegerin erzieher erzieherin friseur friseurin sekretär sekretärin hebamme entbindungspfleger kosmetiker kosmetikerin flugbegleiter flugbegleiterin kaufmann kauffrau


ECT (↑): Corr 86.05% (p-Wert 2.176e-12)

BAT (↓): 60.08%

unable to import 'smart_open.gcs', disabling that module
Not in vocab: bänkerin
Using T1: männlich mann junge bruder er ihm sein sohn vater onkel großvater opa cousin
Using T2: weiblich frau mädchen schwester sie ihr tochter mutter tante großmutter oma cousine nichte
Using A1: handwerker handwerkerin wissenschaftler wissenschaftlerin programmierer programmiererin arzt ärztin chef chefin manager managerin politiker politikerin ingenieur ingenieurin bänker pilot pilotin
Using A2: lehrer lehrerin krankenpfleger krankenpflegerin altenpfleger altenpflegerin erzieher erzieherin friseur friseurin sekretär sekretärin hebamme entbindungspfleger kosmetiker kosmetikerin flugbegleiter flugbegleiterin kaufmann
Computing p value - Number of possible permutations: 10400600.0
Computing randomly first 100000  permutations
WEAT (↓): Corr 90.31% (p-Wert 0.01069, test statistic 0.6201)

kMEANS (↓): 54.08%

SVM:
Test 1: männlich mann junge bruder er ihm sein sohn vater onkel großvater opa cousin
Train 1 (generated): frau männer ihn schwester freund kumpel mutter papa weil doch obwohl tochter oma cousine
Test 2: weiblich frau mädchen schwester sie ihr tochter mutter tante großmutter oma cousine nichte
Train 2 (generated): frauen freundin männer junge kind mama bruder vater sohn schwägerin
Number of train words: 24
SVM (↓): 38.65%


************************************************** WEAT 16 **************************************************
T1: peter michael thomas andreas wolfgang claus klaus jürgen günter günther stefan stephan christian kristian uwe werner horst frank dieter manfred gerhard gerhardt hans bernd berndt bernt thorsten torsten mathias matthias helmut helmuth walter walther heinz martin jörg joerg rolf jens sven swen alexander jan rainer reiner holger carl karl dirk joachim ralf ralph carsten karsten herbert oliver wilhelm curt kurt
T2: ursula carin karin helga sabine ingrid renate monica monika susanne gisela petra birgit andrea anna brigitte claudia klaudia erica erika christa krista elke stefanie stephanie gertrud elisabeth elizabeth maria angelika heike gabriele cathrin catrin kathrin katrin ilse nicole anja barbara hildegard martina ingeborg gerda marion jutta ute hannelore irmgard irmgart christine kristine inge christina kristina silvia sylvia margarete margarethe kerstin
A1: handwerker handwerkerin wissenschaftler wissenschaftlerin programmierer programmiererin arzt ärztin chef chefin manager managerin politiker politikerin ingenieur ingenieurin bänker bänkerin pilot pilotin
A2: lehrer lehrerin krankenpfleger krankenpflegerin altenpfleger altenpflegerin erzieher erzieherin friseur friseurin sekretär sekretärin hebamme entbindungspfleger kosmetiker kosmetikerin flugbegleiter flugbegleiterin kaufmann kauffrau


ECT (↑): Corr 43.40% (p-Wert 0.005772)

BAT (↓): 54.53%

unable to import 'smart_open.gcs', disabling that module
Not in vocab: bänkerin irmgart
Using T1: peter michael thomas andreas wolfgang claus klaus jürgen günter günther stefan stephan christian kristian uwe werner horst frank dieter manfred gerhard gerhardt hans bernd berndt bernt thorsten torsten mathias matthias helmut helmuth walter walther heinz martin jörg joerg rolf jens sven swen alexander jan rainer reiner holger carl karl dirk joachim ralf ralph carsten karsten herbert oliver wilhelm curt
Using T2: ursula carin karin helga sabine ingrid renate monica monika susanne gisela petra birgit andrea anna brigitte claudia klaudia erica erika christa krista elke stefanie stephanie gertrud elisabeth elizabeth maria angelika heike gabriele cathrin catrin kathrin katrin ilse nicole anja barbara hildegard martina ingeborg gerda marion jutta ute hannelore irmgard christine kristine inge christina kristina silvia sylvia margarete margarethe kerstin
Using A1: handwerker handwerkerin wissenschaftler wissenschaftlerin programmierer programmiererin arzt ärztin chef chefin manager managerin politiker politikerin ingenieur ingenieurin bänker pilot pilotin
Using A2: lehrer lehrerin krankenpfleger krankenpflegerin altenpfleger altenpflegerin erzieher erzieherin friseur friseurin sekretär sekretärin hebamme entbindungspfleger kosmetiker kosmetikerin flugbegleiter flugbegleiterin kaufmann
Computing p value - Number of possible permutations: 2.4356699707654616e+34
Computing randomly first 100000  permutations
WEAT (↓): Corr 123.80% (p-Wert 0.0, test statistic 2.713)

kMEANS (↓): 91.78%

SVM:
Test 1: peter michael thomas andreas wolfgang claus klaus jürgen günter günther stefan stephan christian kristian uwe werner horst frank dieter manfred gerhard gerhardt hans bernd berndt bernt thorsten torsten mathias matthias helmut helmuth walter walther heinz martin jörg joerg rolf jens sven swen alexander jan rainer reiner holger carl karl dirk joachim ralf ralph carsten karsten herbert oliver wilhelm curt kurt
Train 1 (generated): dr. müller schmitt lübcke mordfall marcks borromäus artvandelay friedrich rakoczy/ksta
Test 2: ursula carin karin helga sabine ingrid renate monica monika susanne gisela petra birgit andrea anna brigitte claudia klaudia erica erika christa krista elke stefanie stephanie gertrud elisabeth elizabeth maria angelika heike gabriele cathrin catrin kathrin katrin ilse nicole anja barbara hildegard martina ingeborg gerda marion jutta ute hannelore irmgard irmgart christine kristine inge christina kristina silvia sylvia margarete margarethe kerstin
Train 2 (generated): marlies tanja göring-eckhardt julia leyen vonderleyen karusseit andress islamophobiereport kommissionspräsidentin
Number of train words: 20
SVM (↓): 76.43%


************************************************** WEAT 17 **************************************************
T1: führungskraft verwaltung konzern gehalt büro geschäft karriere arbeit job
T2: zuhause eltern kinder familie cousins ehe hochzeit verwandtschaft erziehung
A1: männlich mann junge bruder er ihm sein sohn vater onkel großvater opa cousin
A2: weiblich frau mädchen schwester sie ihr tochter mutter tante großmutter oma cousine nichte


ECT (↑): Corr 38.67% (p-Wert 0.05102)

BAT (↓): 62.60%

unable to import 'smart_open.gcs', disabling that module
Not in vocab:
Using T1: führungskraft verwaltung konzern gehalt büro geschäft karriere arbeit job
Using T2: zuhause eltern kinder familie cousins ehe hochzeit verwandtschaft erziehung
Using A1: männlich mann junge bruder er ihm sein sohn vater onkel großvater opa cousin
Using A2: weiblich frau mädchen schwester sie ihr tochter mutter tante großmutter oma cousine nichte
Computing p value - Number of possible permutations: 48620.0
WEAT (↓): Corr 151.72% (p-Wert 2.057e-05, test statistic 0.5556)

kMEANS (↓): 97.00%

SVM:
Test 1: führungskraft verwaltung konzern gehalt büro geschäft karriere arbeit job
Train 1 (generated): unternehmen geld hause ausbildung beruf stellenmarktdirekt teamleiter zertifizierte integre führungsposition
Test 2: zuhause eltern kinder familie cousins ehe hochzeit verwandtschaft erziehung
Train 2 (generated): großeltern kindern mutter familien vater schule geschwister rede.❞ freundin daheim
Number of train words: 20
SVM (↓): 99.72%


************************************************** WEAT 18 **************************************************
T1: führungskraft verwaltung konzern gehalt büro geschäft karriere arbeit job
T2: zuhause eltern kinder familie cousins ehe hochzeit verwandtschaft erziehung
A1: peter michael thomas andreas wolfgang claus klaus jürgen günter günther stefan stephan christian kristian uwe werner horst frank dieter manfred gerhard gerhardt hans bernd berndt bernt thorsten torsten mathias matthias helmut helmuth walter walther heinz martin jörg joerg rolf jens sven swen alexander jan rainer reiner holger carl karl dirk joachim ralf ralph carsten karsten herbert oliver wilhelm curt kurt
A2: ursula carin karin helga sabine ingrid renate monica monika susanne gisela petra birgit andrea anna brigitte claudia klaudia erica erika christa krista elke stefanie stephanie gertrud elisabeth elizabeth maria angelika heike gabriele cathrin catrin kathrin katrin ilse nicole anja barbara hildegard martina ingeborg gerda marion jutta ute hannelore irmgard irmgart christine kristine inge christina kristina silvia sylvia margarete margarethe kerstin


ECT (↑): Corr 74.88% (p-Wert 1.227e-22)

BAT (↓): 57.69%

unable to import 'smart_open.gcs', disabling that module
Not in vocab: irmgart
Using T1: führungskraft verwaltung konzern gehalt büro geschäft karriere arbeit job
Using T2: zuhause eltern kinder familie cousins ehe hochzeit verwandtschaft erziehung
Using A1: peter michael thomas andreas wolfgang claus klaus jürgen günter günther stefan stephan christian kristian uwe werner horst frank dieter manfred gerhard gerhardt hans bernd berndt bernt thorsten torsten mathias matthias helmut helmuth walter walther heinz martin jörg joerg rolf jens sven swen alexander jan rainer reiner holger carl karl dirk joachim ralf ralph carsten karsten herbert oliver wilhelm curt
Using A2: ursula carin karin helga sabine ingrid renate monica monika susanne gisela petra birgit andrea anna brigitte claudia klaudia erica erika christa krista elke stefanie stephanie gertrud elisabeth elizabeth maria angelika heike gabriele cathrin catrin kathrin katrin ilse nicole anja barbara hildegard martina ingeborg gerda marion jutta ute hannelore irmgard christine kristine inge christina kristina silvia sylvia margarete margarethe kerstin
Computing p value - Number of possible permutations: 48620.0
WEAT (↓): Corr 124.50% (p-Wert 0.003702, test statistic 0.3886)

kMEANS (↓): 96.22%

SVM:
Test 1: führungskraft verwaltung konzern gehalt büro geschäft karriere arbeit job
Train 1 (generated): unternehmen geld hause ausbildung beruf stellenmarktdirekt teamleiter zertifizierte integre führungsposition
Test 2: zuhause eltern kinder familie cousins ehe hochzeit verwandtschaft erziehung
Train 2 (generated): großeltern kindern mutter familien vater schule geschwister rede.❞ freundin daheim
Number of train words: 20
SVM (↓): 99.72%


************************************************** WEAT 19 **************************************************
T1: wissenschaft forschung technologie technik physik chemie mathematik algebra experiment astronomie
T2: poesie kunst tanz literatur roman symphonie theater skulptur tanzen kunstwerk
A1: männlich mann junge bruder er ihm sein sohn vater onkel großvater opa cousin
A2: weiblich frau mädchen schwester sie ihr tochter mutter tante großmutter oma cousine nichte


ECT (↑): Corr 84.62% (p-Wert 5.173e-08)

BAT (↓): 39.67%

unable to import 'smart_open.gcs', disabling that module
Not in vocab:
Using T1: wissenschaft forschung technologie technik physik chemie mathematik algebra experiment astronomie
Using T2: poesie kunst tanz literatur roman symphonie theater skulptur tanzen kunstwerk
Using A1: männlich mann junge bruder er ihm sein sohn vater onkel großvater opa cousin
Using A2: weiblich frau mädchen schwester sie ihr tochter mutter tante großmutter oma cousine nichte
Computing p value - Number of possible permutations: 184756.0
Computing randomly first 100000  permutations
WEAT (↓): Corr 39.03% (p-Wert 0.2068, test statistic 0.08329)

kMEANS (↓): 86.70%

SVM:
Test 1: wissenschaft forschung technologie technik physik chemie mathematik algebra experiment astronomie
Train 1 (generated): wissenschaftliche entwicklung technologien industrie biologie mathe informatik naturwissenschaften schlüssel-kategorie politik
Test 2: poesie kunst tanz literatur roman symphonie theater skulptur tanzen kunstwerk
Train 2 (generated): lyrik meisterdrucke verlernte wirkommenzueuchnachhause getanzt tanzt autor buch lesen photographie
Number of train words: 20
SVM (↓): 93.75%


************************************************** WEAT 20 **************************************************
T1: wissenschaft forschung technologie technik physik chemie mathematik algebra experiment astronomie
T2: poesie kunst tanz literatur roman symphonie theater skulptur tanzen kunstwerk
A1: peter michael thomas andreas wolfgang claus klaus jürgen günter günther stefan stephan christian kristian uwe werner horst frank dieter manfred gerhard gerhardt hans bernd berndt bernt thorsten torsten mathias matthias helmut helmuth walter walther heinz martin jörg joerg rolf jens sven swen alexander jan rainer reiner holger carl karl dirk joachim ralf ralph carsten karsten herbert oliver wilhelm curt kurt
A2: ursula carin karin helga sabine ingrid renate monica monika susanne gisela petra birgit andrea anna brigitte claudia klaudia erica erika christa krista elke stefanie stephanie gertrud elisabeth elizabeth maria angelika heike gabriele cathrin catrin kathrin katrin ilse nicole anja barbara hildegard martina ingeborg gerda marion jutta ute hannelore irmgard irmgart christine kristine inge christina kristina silvia sylvia margarete margarethe kerstin


ECT (↑): Corr 67.20% (p-Wert 5.964e-17)

BAT (↓): 28.92%

unable to import 'smart_open.gcs', disabling that module
Not in vocab: irmgart
Using T1: wissenschaft forschung technologie technik physik chemie mathematik algebra experiment astronomie
Using T2: poesie kunst tanz literatur roman symphonie theater skulptur tanzen kunstwerk
Using A1: peter michael thomas andreas wolfgang claus klaus jürgen günter günther stefan stephan christian kristian uwe werner horst frank dieter manfred gerhard gerhardt hans bernd berndt bernt thorsten torsten mathias matthias helmut helmuth walter walther heinz martin jörg joerg rolf jens sven swen alexander jan rainer reiner holger carl karl dirk joachim ralf ralph carsten karsten herbert oliver wilhelm curt
Using A2: ursula carin karin helga sabine ingrid renate monica monika susanne gisela petra birgit andrea anna brigitte claudia klaudia erica erika christa krista elke stefanie stephanie gertrud elisabeth elizabeth maria angelika heike gabriele cathrin catrin kathrin katrin ilse nicole anja barbara hildegard martina ingeborg gerda marion jutta ute hannelore irmgard christine kristine inge christina kristina silvia sylvia margarete margarethe kerstin
Computing p value - Number of possible permutations: 184756.0
Computing randomly first 100000  permutations
WEAT (↓): Corr 45.34% (p-Wert 0.1671, test statistic 0.1194)

kMEANS (↓): 86.90%

SVM:
Test 1: wissenschaft forschung technologie technik physik chemie mathematik algebra experiment astronomie
Train 1 (generated): wissenschaftliche entwicklung technologien industrie biologie mathe informatik naturwissenschaften schlüssel-kategorie politik
Test 2: poesie kunst tanz literatur roman symphonie theater skulptur tanzen kunstwerk
Train 2 (generated): lyrik meisterdrucke verlernte wirkommenzueuchnachhause getanzt tanzt autor buch lesen photographie
Number of train words: 20
SVM (↓): 93.75%


************************************************** WEAT 21 **************************************************
T1: handwerker handwerkerin wissenschaftler wissenschaftlerin programmierer programmiererin arzt ärztin chef chefin manager managerin politiker politikerin ingenieur ingenieurin bänker bänkerin pilot pilotin
T2: lehrer lehrerin krankenpfleger krankenpflegerin altenpfleger altenpflegerin erzieher erzieherin friseur friseurin sekretär sekretärin hebamme entbindungspfleger kosmetiker kosmetikerin flugbegleiter flugbegleiterin kaufmann kauffrau
A1: männlich mann junge bruder er ihm sein sohn vater onkel großvater opa cousin
A2: weiblich frau mädchen schwester sie ihr tochter mutter tante großmutter oma cousine nichte


ECT (↑): Corr 22.53% (p-Wert 0.2685)

BAT (↓): 44.77%

unable to import 'smart_open.gcs', disabling that module
Not in vocab: bänkerin
Using T1: handwerker handwerkerin wissenschaftler wissenschaftlerin programmierer programmiererin arzt ärztin chef chefin manager managerin politiker politikerin ingenieur ingenieurin bänker pilot pilotin
Using T2: lehrer lehrerin krankenpfleger krankenpflegerin altenpfleger altenpflegerin erzieher erzieherin friseur friseurin sekretär sekretärin hebamme entbindungspfleger kosmetiker kosmetikerin flugbegleiter flugbegleiterin kaufmann
Using A1: männlich mann junge bruder er ihm sein sohn vater onkel großvater opa cousin
Using A2: weiblich frau mädchen schwester sie ihr tochter mutter tante großmutter oma cousine nichte
Computing p value - Number of possible permutations: 35345263800.0
Computing randomly first 100000  permutations
WEAT (↓): Corr 78.31% (p-Wert 0.00796, test statistic 0.9062)

kMEANS (↓): 60.05%

SVM:
Test 1: handwerker handwerkerin wissenschaftler wissenschaftlerin programmierer programmiererin arzt ärztin chef chefin manager managerin politiker politikerin ingenieur ingenieurin bänker bänkerin pilot pilotin
Train 1 (generated): unternehmer ingenieure journalistin aktivistin hausarzt kollegin freundin frau senior partei
Test 2: lehrer lehrerin krankenpfleger krankenpflegerin altenpfleger altenpflegerin erzieher erzieherin friseur friseurin sekretär sekretärin hebamme entbindungspfleger kosmetiker kosmetikerin flugbegleiter flugbegleiterin kaufmann kauffrau
Train 2 (generated): schule lehrkräfte klassenlehrerin kollegin schülerin pfleger krankenschwester gesundheits- pflegekräfte examinierte berufslebenlang ärztin psychologin frisör therapeutin efz büromanagement
Number of train words: 27
SVM (↓): 68.59%


************************************************** WEAT 22 **************************************************
T1: handwerker handwerkerin wissenschaftler wissenschaftlerin programmierer programmiererin arzt ärztin chef chefin manager managerin politiker politikerin ingenieur ingenieurin bänker bänkerin pilot pilotin
T2: lehrer lehrerin krankenpfleger krankenpflegerin altenpfleger altenpflegerin erzieher erzieherin friseur friseurin sekretär sekretärin hebamme entbindungspfleger kosmetiker kosmetikerin flugbegleiter flugbegleiterin kaufmann kauffrau
A1: peter michael thomas andreas wolfgang claus klaus jürgen günter günther stefan stephan christian kristian uwe werner horst frank dieter manfred gerhard gerhardt hans bernd berndt bernt thorsten torsten mathias matthias helmut helmuth walter walther heinz martin jörg joerg rolf jens sven swen alexander jan rainer reiner holger carl karl dirk joachim ralf ralph carsten karsten herbert oliver wilhelm curt kurt
A2: ursula carin karin helga sabine ingrid renate monica monika susanne gisela petra birgit andrea anna brigitte claudia klaudia erica erika christa krista elke stefanie stephanie gertrud elisabeth elizabeth maria angelika heike gabriele cathrin catrin kathrin katrin ilse nicole anja barbara hildegard martina ingeborg gerda marion jutta ute hannelore irmgard irmgart christine kristine inge christina kristina silvia sylvia margarete margarethe kerstin


ECT (↑): Corr 34.60% (p-Wert 0.0001159)

BAT (↓): 28.65%

unable to import 'smart_open.gcs', disabling that module
Not in vocab: bänkerin irmgart
Using T1: handwerker handwerkerin wissenschaftler wissenschaftlerin programmierer programmiererin arzt ärztin chef chefin manager managerin politiker politikerin ingenieur ingenieurin bänker pilot pilotin
Using T2: lehrer lehrerin krankenpfleger krankenpflegerin altenpfleger altenpflegerin erzieher erzieherin friseur friseurin sekretär sekretärin hebamme entbindungspfleger kosmetiker kosmetikerin flugbegleiter flugbegleiterin kaufmann
Using A1: peter michael thomas andreas wolfgang claus klaus jürgen günter günther stefan stephan christian kristian uwe werner horst frank dieter manfred gerhard gerhardt hans bernd berndt bernt thorsten torsten mathias matthias helmut helmuth walter walther heinz martin jörg joerg rolf jens sven swen alexander jan rainer reiner holger carl karl dirk joachim ralf ralph carsten karsten herbert oliver wilhelm curt
Using A2: ursula carin karin helga sabine ingrid renate monica monika susanne gisela petra birgit andrea anna brigitte claudia klaudia erica erika christa krista elke stefanie stephanie gertrud elisabeth elizabeth maria angelika heike gabriele cathrin catrin kathrin katrin ilse nicole anja barbara hildegard martina ingeborg gerda marion jutta ute hannelore irmgard christine kristine inge christina kristina silvia sylvia margarete margarethe kerstin
Computing p value - Number of possible permutations: 35345263800.0
Computing randomly first 100000  permutations
WEAT (↓): Corr 68.54% (p-Wert 0.01774, test statistic 0.8738)

kMEANS (↓): 60.21%

SVM:
Test 1: handwerker handwerkerin wissenschaftler wissenschaftlerin programmierer programmiererin arzt ärztin chef chefin manager managerin politiker politikerin ingenieur ingenieurin bänker bänkerin pilot pilotin
Train 1 (generated): unternehmer ingenieure journalistin aktivistin hausarzt kollegin freundin frau senior partei
Test 2: lehrer lehrerin krankenpfleger krankenpflegerin altenpfleger altenpflegerin erzieher erzieherin friseur friseurin sekretär sekretärin hebamme entbindungspfleger kosmetiker kosmetikerin flugbegleiter flugbegleiterin kaufmann kauffrau
Train 2 (generated): schule lehrkräfte klassenlehrerin kollegin schülerin pfleger krankenschwester gesundheits- pflegekräfte examinierte berufslebenlang ärztin psychologin frisör therapeutin efz büromanagement
Number of train words: 27
SVM (↓): 68.59%


************************************************** WEAT 23 **************************************************
T1: traurig hoffnungslos düster tränenreich elend deprimiert
T2: krank krankheit verletzt grippe virus krebs
A1: unbeständig instabil variabel flüchtig kurzfristig kurz gelegentlich
A2: stabil immer konstante ausdauernd chronisch ausgedehnt ewig


ECT (↑): Corr 74.07% (p-Wert 0.002445)

BAT (↓): 67.35%

unable to import 'smart_open.gcs', disabling that module
Not in vocab:
Using T1: traurig hoffnungslos düster tränenreich elend deprimiert
Using T2: krank krankheit verletzt grippe virus krebs
Using A1: unbeständig instabil variabel flüchtig kurzfristig kurz gelegentlich
Using A2: stabil immer konstante ausdauernd chronisch ausgedehnt ewig
Computing p value - Number of possible permutations: 924.0
WEAT (↓): Corr 82.07% (p-Wert 0.0974, test statistic 0.175)

kMEANS (↓): 95.83%

SVM:
Test 1: traurig hoffnungslos düster tränenreich elend deprimiert
Train 1 (generated): wütend unfassbar schlimm echt unglaublich schrecklich schade furchtbar peinlich irgendwie
Test 2: krank krankheit verletzt grippe virus krebs
Train 2 (generated): krankheiten depressionen infektion covid pandemie psychisch schlimm traurig krass weil
Number of train words: 20
SVM (↓): 68.75%

***** Evaluating SimLex/WordSim (benchmarks 0.2-0.3/0.5-0.6)
SimLex                : 0.185 (using 991 of 999 word pairs)
WordSim353            : 0.472 (using 347 of 350 word pairs)
WordSim353 Similarity : 0.488 (using 200 of 201 word pairs)
WordSim353 Relatedness: 0.463 (using 250 of 252 word pairs)
***** Evaluating syntactic & semantic features (benchmarks ~62% correct (34-87), ~76% top 10, coverage 68%)
unable to import 'smart_open.gcs', disabling that module
loading projection weights from ../../data/models/tweets/tweets_glove_w2v_vectors.txt
loaded (996397, 300) matrix from ../../data/models/tweets/tweets_glove_w2v_vectors.txt
precomputing L2-norms of word weight vectors
> EVALUATING SYNTACTIC FEATURES
nouns: SI/PL: 0.0% (0/0), 0.0% (0/0), 0.0% (0/500)
nouns: PL/SI: 0.0% (0/0), 0.0% (0/0), 0.0% (0/500)
adjectives: GR/KOM: 24.4% (122/500), 50.2% (251/500), 100.0% (500/500)
adjectives: KOM/GR: 29.2% (146/500), 57.8% (289/500), 100.0% (500/500)
adjectives: GR/SUP: 2.4% (10/414), 9.4% (39/414), 82.8% (414/500)
adjectives: SUP/GR: 5.1% (21/412), 15.3% (63/412), 82.4% (412/500)
adjectives: KOM/SUP: 5.1% (21/414), 17.1% (71/414), 82.8% (414/500)
adjectives: SUP/KOM: 8.2% (34/413), 20.8% (86/413), 82.6% (413/500)
verbs (pres): INF/1SP: 41.2% (206/500), 75.2% (376/500), 100.0% (500/500)
verbs (pres): 1SP/INF: 64.6% (323/500), 82.8% (414/500), 100.0% (500/500)
verbs (pres): INF/2PP: 53.6% (268/500), 75.8% (379/500), 100.0% (500/500)
verbs (pres): 2PP/INF: 67.6% (338/500), 81.4% (407/500), 100.0% (500/500)
verbs (pres): 1SP/2PP: 26.6% (133/500), 47.8% (239/500), 100.0% (500/500)
verbs (pres): 2PP/1SP: 20.6% (103/500), 49.2% (246/500), 100.0% (500/500)
verbs (past): INF/3SV: 24.0% (120/500), 63.4% (317/500), 100.0% (500/500)
verbs (past): 3SV/INF: 41.4% (207/500), 77.2% (386/500), 100.0% (500/500)
verbs (past): INF/3PV: 20.6% (103/500), 45.0% (225/500), 100.0% (500/500)
verbs (past): 3PV/INF: 46.6% (233/500), 71.0% (355/500), 100.0% (500/500)
verbs (past): 3SV/3PV: 36.6% (183/500), 61.2% (306/500), 100.0% (500/500)
verbs (past): 3PV/3SV: 51.2% (256/500), 70.4% (352/500), 100.0% (500/500)
total correct:  32.7% (2827/8653)
total top 10:   55.5% (4801/8653)
total coverage: 86.5% (8653/10000)
> EVALUATING SEMANTIC FEATURES
opposite correct:  38.6% (59/153)
opposite top 10:   64.7% (99/153)
opposite coverage: 51.0% (153/300)
best match correct:  100.0% (1/1)
best match top 10:   100.0% (1/1)
best match coverage: 0.2% (1/540)
doesn't fit correct:  0.0% (0/0)
doesn't fit coverage: 0.0% (0/110)
***** Evaluating on MUSE datasets
INFO - 08/03/20 01:40:22 - 0:00:00 - ============ Initialized logger ============
INFO - 08/03/20 01:40:22 - 0:00:00 - cuda: True
                                     dico_eval: default
                                     emb_dim: 300
                                     exp_id:
                                     exp_name: debug
                                     exp_path: /home/sj041/bachelorarbeit/Code/frameworks/MUSE/dumped/debug/qnwwnb44be
                                     max_vocab: 1000000
                                     normalize_embeddings:
                                     src_emb: ../../data/models/tweets/tweets_glove_w2v_vectors.txt
                                     src_lang: de
                                     tgt_emb:
                                     tgt_lang:
                                     verbose: 2
INFO - 08/03/20 01:40:22 - 0:00:00 - The experiment will be stored in /home/sj041/bachelorarbeit/Code/frameworks/MUSE/dumped/debug/qnwwnb44be
INFO - 08/03/20 01:41:11 - 0:00:49 - Loaded 996397 pre-trained word embeddings.
INFO - 08/03/20 01:41:17 - 0:00:55 - ====================================================================
INFO - 08/03/20 01:41:17 - 0:00:55 -                        Dataset      Found     Not found          Rho
INFO - 08/03/20 01:41:17 - 0:00:55 - ====================================================================
INFO - 08/03/20 01:41:17 - 0:00:55 -                      DE_GUR350        321            29       0.4613
INFO - 08/03/20 01:41:17 - 0:00:55 -                  DE_SIMLEX-999        991             8       0.1896
INFO - 08/03/20 01:41:17 - 0:00:55 -                       DE_GUR65         65             0       0.5760
INFO - 08/03/20 01:41:17 - 0:00:55 -                       DE_ZG222        184            38       0.3259
INFO - 08/03/20 01:41:17 - 0:00:55 -                   DE_SEMEVAL17        410            36       0.5244
INFO - 08/03/20 01:41:17 - 0:00:55 -                      DE_WS-353        347             3       0.4715
INFO - 08/03/20 01:41:17 - 0:00:55 - ====================================================================
INFO - 08/03/20 01:41:17 - 0:00:55 - Monolingual source word similarity score average: 0.42477
***** Ähnlich zu
apfel           ist am ähnlichsten zu   angebissener    (0.585), banane          (0.568), angebissenen    (0.557)
mann            ist am ähnlichsten zu   frau            (0.699), er              (0.627), männer          (0.625)
frau            ist am ähnlichsten zu   mann            (0.699), frauen          (0.637), b.r.d.-kanzleri̇n (0.636)
er              ist am ähnlichsten zu   ihm             (0.725), ihn             (0.718), man             (0.706)
sie             ist am ähnlichsten zu   weil            (0.708), doch            (0.705), dass            (0.703)
karriere        ist am ähnlichsten zu   ausbildung      (0.530), erreichen-      (0.481), studium         (0.480)
familie         ist am ähnlichsten zu   familien        (0.631), eltern          (0.629), mutter          (0.624)
***** Analogien
deutschland        -> berlin
 ≈ frankreich      -> paris           (0.892), london          (0.810), gelbwesten-proteste (0.807)
deutschland        -> merkel
 ≈ russland        -> putin           (1.018), kanzlerin       (0.861), bundeskanzlerin (0.850)
deutschland        -> deutsch
 ≈ schweden        -> englisch        (0.885), spanisch        (0.844), portugiesisch   (0.840)
deutschland        -> euro
 ≈ großbritannien  -> dollar          (0.834), tk-preis        (0.826), milliarden      (0.811)
mann               -> vater
 ≈ frau            -> mutter          (0.932), tochter         (0.875), schwester       (0.866)
mann               -> bruder
 ≈ frau            -> schwester       (0.889), mutter          (0.844), freundin        (0.835)
mann               -> kunde
 ≈ frau            -> sparkasse       (0.864), eg              (0.791), geschäftsstelle (0.785)
mann               -> patient
 ≈ frau            -> patienten       (0.803), patientin       (0.789), covid           (0.779)
mann               -> chef
 ≈ frau            -> chefin          (0.905), kollegin        (0.826), ministerin      (0.804)
mann               -> arzt
 ≈ frau            -> ärztin          (0.866), hausarzt        (0.834), kollegin        (0.826)
frau               -> ärztin
 ≈ mann            -> arzt            (0.866), arzt/die        (0.781), hausarzt        (0.759)
mann               -> handwerker
 ≈ frau            -> selbständige    (0.773), angestellte     (0.756), freiberufler    (0.750)
frau               -> handwerkerin
 ≈ mann            -> hauptberuflicher (0.801), launischer      (0.768), wintermensch    (0.764)
mann               -> karriere
 ≈ frau            -> erreichen-      (0.839), ihrer           (0.786), ihre            (0.776)
frau               -> karriere
 ≈ mann            -> verbindungsmann (0.774), beruf           (0.767), seinen          (0.758)
frau               -> familie
 ≈ mann            -> vater           (0.854), freund          (0.852), bruder          (0.836)
mann               -> familie
 ≈ frau            -> mutter          (0.838), ihrer           (0.838), tochter         (0.830)
er                 -> wissenschaft
 ≈ sie             -> forschung       (0.882), experten        (0.848), wissenschaftler (0.828)
sie                -> wissenschaft
 ≈ er              -> forschung       (0.807), politik         (0.790), herrausgegeben  (0.789)
