##############################################################################################################
# Running bias tests for model wiki_w2v
##############################################################################################################

************************************************** WEAT 01 **************************************************
T1: aster klee hyazinthe ringelblume mohn azalee krokus iris orchidee rose glockenblume narzisse flieder stiefmütterchen tulpe butterblume gänseblümchen lilie pfingstrose veilchen nelke gladiole magnolie petunie
T2: ameise raupe floh heuschrecke spinne bettwanze tausendfüßler fliegen made tarantel biene kakerlake mücke moskito termite käfer grille hornisse motte wespe blattlaus libelle bremse rüsselkäfer
A1: streicheln freiheit gesundheit liebe frieden jubeln freund freundin himmel treu vergnügen diamant ehrlich glücklich regenbogen geschenk ehre wunder sonnenaufgang familie glück lachen paradies urlaub freude wunderbar
A2: missbrauch absturz schmutz mord krankheit unfall tod trauer vergiften stinken angriff katastrophe hass tragödie scheidung gefängnis armut hässlich krebs töten faul erbrechen qual furchtbar schrecklich böse


ECT (↑): Corr 96.51% (p-Wert 9.462e-31)

BAT (↓): 44.43%

unable to import 'smart_open.gcs', disabling that module
Not in vocab:
Using T1: aster klee hyazinthe ringelblume mohn azalee krokus iris orchidee rose glockenblume narzisse flieder stiefmütterchen tulpe butterblume gänseblümchen lilie pfingstrose veilchen nelke gladiole magnolie petunie
Using T2: ameise raupe floh heuschrecke spinne bettwanze tausendfüßler fliegen made tarantel biene kakerlake mücke moskito termite käfer grille hornisse motte wespe blattlaus libelle bremse rüsselkäfer
Using A1: streicheln freiheit gesundheit liebe frieden jubeln freund freundin himmel treu vergnügen diamant ehrlich glücklich regenbogen geschenk ehre wunder sonnenaufgang familie glück lachen paradies urlaub freude wunderbar
Using A2: missbrauch absturz schmutz mord krankheit unfall tod trauer vergiften stinken angriff katastrophe hass tragödie scheidung gefängnis armut hässlich krebs töten faul erbrechen qual furchtbar schrecklich böse
Computing p value - Number of possible permutations: 32247603683100.004
Computing randomly first 100000  permutations
WEAT (↓): Corr 78.09% (p-Wert 0.00309, test statistic 0.531)

kMEANS (↓): 80.75%

SVM:
Test 1: aster klee hyazinthe ringelblume mohn azalee krokus iris orchidee rose glockenblume narzisse flieder stiefmütterchen tulpe butterblume gänseblümchen lilie pfingstrose veilchen nelke gladiole magnolie petunie
Train 1 (generated): landnelke zinnie quendel fingerhut prachtspiere funkie hunds lupine rübe möhre malve maiglöckchen chrysanthemen holunder lavendel nelken schneeglöckchen tulpen seerose akelei primel
Test 2: ameise raupe floh heuschrecke spinne bettwanze tausendfüßler fliegen made tarantel biene kakerlake mücke moskito termite käfer grille hornisse motte wespe blattlaus libelle bremse rüsselkäfer
Train 2 (generated): qualle kanarienvogel kakerlaken mistkäfer eidechse wanzen schildkröte kröte bienen spinnen ameisen falter hyäne seehund
Number of train words: 35
SVM (↓): 92.19%


************************************************** WEAT 02 **************************************************
T1: dudelsack cello gitarre laute posaune banjo klarinette mundharmonika mandoline trompete fagott trommel harfe oboe tuba glocke geige cembalo klavier viola bongo flöte horn saxophon
T2: pfeil verein gewehr rakete speer axt dolch harpune pistole schwert klinge dynamit beil panzer bombe feuerwaffe messer schrotflinte tränengas kanone granate morgenstern schleuder peitsche
A1: streicheln freiheit gesundheit liebe frieden jubeln freund freundin himmel treu vergnügen diamant ehrlich glücklich regenbogen geschenk ehre wunder sonnenaufgang familie glück lachen paradies urlaub freude wunderbar
A2: missbrauch absturz schmutz mord krankheit unfall tod trauer vergiften stinken angriff katastrophe hass tragödie scheidung gefängnis armut hässlich krebs töten faul erbrechen qual furchtbar schrecklich böse


ECT (↑): Corr 77.57% (p-Wert 1.443e-11)

BAT (↓): 50.00%

unable to import 'smart_open.gcs', disabling that module
Not in vocab:
Using T1: dudelsack cello gitarre laute posaune banjo klarinette mundharmonika mandoline trompete fagott trommel harfe oboe tuba glocke geige cembalo klavier viola bongo flöte horn saxophon
Using T2: pfeil verein gewehr rakete speer axt dolch harpune pistole schwert klinge dynamit beil panzer bombe feuerwaffe messer schrotflinte tränengas kanone granate morgenstern schleuder peitsche
Using A1: streicheln freiheit gesundheit liebe frieden jubeln freund freundin himmel treu vergnügen diamant ehrlich glücklich regenbogen geschenk ehre wunder sonnenaufgang familie glück lachen paradies urlaub freude wunderbar
Using A2: missbrauch absturz schmutz mord krankheit unfall tod trauer vergiften stinken angriff katastrophe hass tragödie scheidung gefängnis armut hässlich krebs töten faul erbrechen qual furchtbar schrecklich böse
Computing p value - Number of possible permutations: 32247603683100.004
Computing randomly first 100000  permutations
WEAT (↓): Corr 133.17% (p-Wert 0.0, test statistic 1.422)

kMEANS (↓): 95.79%

SVM:
Test 1: dudelsack cello gitarre laute posaune banjo klarinette mundharmonika mandoline trompete fagott trommel harfe oboe tuba glocke geige cembalo klavier viola bongo flöte horn saxophon
Train 1 (generated): zither blasinstrumente sitar xylophon violoncello violine kontrabass akkordeon percussion saiten blockflöte querflöte fiddle bassgitarre ukulele vibraphon bongos bassklarinette altsaxophon saxofon bratsche triangel pauken harfen trompeten posaunen celesta
Test 2: pfeil verein gewehr rakete speer axt dolch harpune pistole schwert klinge dynamit beil panzer bombe feuerwaffe messer schrotflinte tränengas kanone granate morgenstern schleuder peitsche
Train 2 (generated): lanze armbrust köcher hieb karabiner flinte pistolen patronen revolver maschinengewehr sturmgewehr knüppel keule dolche kiste streitaxt äxte steinschleuder kettensäge schubkarre zünder handgranaten granaten
Number of train words: 50
SVM (↓): 95.83%


************************************************** WEAT 03 **************************************************
T1: deutsch deutsche deutschland europäisch weiß kaukasisch
T2: ausländer flüchtling flüchtlinge fremd schwarz dunkelhäutig
A1: streicheln freiheit gesundheit liebe frieden jubeln freund freundin himmel treu vergnügen diamant ehrlich glücklich regenbogen geschenk ehre wunder sonnenaufgang familie glück lachen paradies urlaub freude wunderbar
A2: missbrauch absturz schmutz mord krankheit unfall tod trauer vergiften stinken angriff katastrophe hass tragödie scheidung gefängnis armut hässlich krebs töten faul erbrechen qual furchtbar schrecklich böse


ECT (↑): Corr 90.40% (p-Wert 4.331e-20)

BAT (↓): 39.77%

unable to import 'smart_open.gcs', disabling that module
Not in vocab:
Using T1: deutsch deutsche deutschland europäisch weiß kaukasisch
Using T2: ausländer flüchtling flüchtlinge fremd schwarz dunkelhäutig
Using A1: streicheln freiheit gesundheit liebe frieden jubeln freund freundin himmel treu vergnügen diamant ehrlich glücklich regenbogen geschenk ehre wunder sonnenaufgang familie glück lachen paradies urlaub freude wunderbar
Using A2: missbrauch absturz schmutz mord krankheit unfall tod trauer vergiften stinken angriff katastrophe hass tragödie scheidung gefängnis armut hässlich krebs töten faul erbrechen qual furchtbar schrecklich böse
Computing p value - Number of possible permutations: 924.0
WEAT (↓): Corr 94.41% (p-Wert 0.05952, test statistic 0.1677)

kMEANS (↓): 50.50%

SVM:
Test 1: deutsch deutsche deutschland europäisch weiß kaukasisch
Train 1 (generated): dt polnisch ungarisch tschechisch jiddisch litauisch lettisch kroatisch österreichisch amerikanisch
Test 2: ausländer flüchtling flüchtlinge fremd schwarz dunkelhäutig
Train 2 (generated): asylbewerber migranten aussiedler zuwanderer ausländern staatsbürger arbeitslose inländer zivilpersonen ausreisen
Number of train words: 20
SVM (↓): 75.00%


************************************************** WEAT 04 **************************************************
T1: ursula carin karin helga sabine ingrid renate monica monika susanne gisela petra birgit andrea anna brigitte claudia klaudia erica erika christa krista elke stefanie stephanie gertrud elisabeth elizabeth peter michael thomas andreas wolfgang claus klaus jürgen günter günther stefan stephan christian kristian uwe werner horst frank dieter manfred gerhard gerhardt hans bernd berndt bernt thorsten torsten mathias matthias helmut helmuth
T2: elif zeynep hiranur miray zehra ecrin azra eylül defne nehir yusuf eymen mustafa ömer berat miraç ayaz ahmet mehmet muhammed zuzanna lena julia maja zofia hanna amelia aleksandra alicja natalia jakub antoni szymon jan filip kacper aleksander franciszek mikołaj wojciech amena qamar haya ousa sandra rosarita reem aıscha maya hala akram abóòd hasan elias ali alex zak miran aimar burhan
A1: streicheln freiheit gesundheit liebe frieden jubeln freund freundin himmel treu vergnügen diamant ehrlich glücklich regenbogen geschenk ehre wunder sonnenaufgang familie glück lachen paradies urlaub freude wunderbar
A2: missbrauch absturz schmutz mord krankheit unfall tod trauer vergiften stinken angriff katastrophe hass tragödie scheidung gefängnis armut hässlich krebs töten faul erbrechen qual furchtbar schrecklich böse


ECT (↑): Corr 69.83% (p-Wert 8.671e-09)

BAT (↓): 61.08%

unable to import 'smart_open.gcs', disabling that module
Not in vocab: miray eymen ousa nehir ecrin hiranur aıscha abóòd rosarita
Using T1: ursula carin karin helga sabine ingrid renate monica monika susanne gisela petra birgit andrea anna brigitte claudia klaudia erica erika christa krista elke stefanie stephanie gertrud elisabeth elizabeth peter michael thomas andreas wolfgang claus klaus jürgen günter günther stefan stephan christian kristian uwe werner horst frank dieter manfred gerhard gerhardt hans
Using T2: elif zeynep zehra azra eylül defne yusuf mustafa ömer berat miraç ayaz ahmet mehmet muhammed zuzanna lena julia maja zofia hanna amelia aleksandra alicja natalia jakub antoni szymon jan filip kacper aleksander franciszek mikołaj wojciech amena qamar haya sandra reem maya hala akram hasan elias ali alex zak miran aimar burhan
Using A1: streicheln freiheit gesundheit liebe frieden jubeln freund freundin himmel treu vergnügen diamant ehrlich glücklich regenbogen geschenk ehre wunder sonnenaufgang familie glück lachen paradies urlaub freude wunderbar
Using A2: missbrauch absturz schmutz mord krankheit unfall tod trauer vergiften stinken angriff katastrophe hass tragödie scheidung gefängnis armut hässlich krebs töten faul erbrechen qual furchtbar schrecklich böse
Computing p value - Number of possible permutations: 3.996088548667444e+29
Computing randomly first 100000  permutations
WEAT (↓): Corr 142.80% (p-Wert 0.0, test statistic 2.546)

kMEANS (↓): 89.24%

SVM:
Test 1: ursula carin karin helga sabine ingrid renate monica monika susanne gisela petra birgit andrea anna brigitte claudia klaudia erica erika christa krista elke stefanie stephanie gertrud elisabeth elizabeth peter michael thomas andreas wolfgang claus klaus jürgen günter günther stefan stephan christian kristian uwe werner horst frank dieter manfred gerhard gerhardt hans bernd berndt bernt thorsten torsten mathias matthias helmut helmuth
Train 1 (generated): angelika jutta ulrike gudrun dagmar irmgard sigrid inge sonja michaela rosemarie ilse gerda bettina silke beate pamela anneliese katrin kerstin anja tanja kathrin heike daniela silvia katharina dorothea agnes antje hedwig margarete margarethe ulrich gerd tobias gerald markus patrick ralph oliver florian jens christof sebastian steffen hartmut jörg rainer lothar erhard rolf jörn holger detlef rüdiger dietmar ralf norbert wilfried willi heiko gernot dominik ingo siegfried heinz volker reinhold hoppe ingolf karsten maik carsten
Test 2: elif zeynep hiranur miray zehra ecrin azra eylül defne nehir yusuf eymen mustafa ömer berat miraç ayaz ahmet mehmet muhammed zuzanna lena julia maja zofia hanna amelia aleksandra alicja natalia jakub antoni szymon jan filip kacper aleksander franciszek mikołaj wojciech amena qamar haya ousa sandra rosarita reem aıscha maya hala akram abóòd hasan elias ali alex zak miran aimar burhan
Train 2 (generated): jale hülya aysel derya aslı ismail osman aziz ibrahim abdullah kemal brahim hüseyin smail metin yılmaz yasin sabri martyna patrycja katja tanja nadja anja stephanie melanie nina nicole tamara alina krystyna dorota izabela katarzyna aneta justyna sylwia stanislav michal petr pavel jaroslav jiří zygmunt józef kazimierz mieczysław bogusław włodzimierz zbigniew piotr paweł tadeusz jacek michał wacław ignacy eugeniusz ahmad ahmed
Number of train words: 134
SVM (↓): 94.01%


************************************************** WEAT 05 **************************************************
T1: deutsch deutsche deutschland europäisch weiß kaukasisch
T2: ausländer flüchtling flüchtlinge fremd schwarz dunkelhäutig
A1: gut positiv ehrlich ehrlichkeit rechtschaffen rechtschaffenheit gesetz recht frei unschuldig
A2: schlecht negativ unehrlich lügen kriminalität kriminell verbrechen straftat verurteilt schuldig


ECT (↑): Corr 91.40% (p-Wert 4.501e-08)

BAT (↓): 47.45%

unable to import 'smart_open.gcs', disabling that module
Not in vocab: rechtschaffenheit
Using T1: deutsch deutsche deutschland europäisch weiß kaukasisch
Using T2: ausländer flüchtling flüchtlinge fremd schwarz dunkelhäutig
Using A1: gut positiv ehrlich ehrlichkeit rechtschaffen gesetz recht frei unschuldig
Using A2: schlecht negativ unehrlich lügen kriminalität kriminell verbrechen straftat verurteilt
Computing p value - Number of possible permutations: 924.0
WEAT (↓): Corr 102.53% (p-Wert 0.04654, test statistic 0.2112)

kMEANS (↓): 50.67%

SVM:
Test 1: deutsch deutsche deutschland europäisch weiß kaukasisch
Train 1 (generated): dt polnisch ungarisch tschechisch jiddisch litauisch lettisch kroatisch österreichisch amerikanisch
Test 2: ausländer flüchtling flüchtlinge fremd schwarz dunkelhäutig
Train 2 (generated): asylbewerber migranten aussiedler zuwanderer ausländern staatsbürger arbeitslose inländer zivilpersonen ausreisen
Number of train words: 20
SVM (↓): 75.00%


************************************************** WEAT 06 **************************************************
T1: ursula carin karin helga sabine ingrid renate monica monika susanne gisela petra birgit andrea anna brigitte claudia klaudia erica erika christa krista elke stefanie stephanie gertrud elisabeth elizabeth peter michael thomas andreas wolfgang claus klaus jürgen günter günther stefan stephan christian kristian uwe werner horst frank dieter manfred gerhard gerhardt hans bernd berndt bernt thorsten torsten mathias matthias helmut helmuth
T2: elif zeynep hiranur miray zehra ecrin azra eylül defne nehir yusuf eymen mustafa ömer berat miraç ayaz ahmet mehmet muhammed zuzanna lena julia maja zofia hanna amelia aleksandra alicja natalia jakub antoni szymon jan filip kacper aleksander franciszek mikołaj wojciech amena qamar haya ousa sandra rosarita reem aıscha maya hala akram abóòd hasan elias ali alex zak miran aimar burhan
A1: gut positiv ehrlich ehrlichkeit rechtschaffen rechtschaffenheit gesetz recht frei unschuldig
A2: schlecht negativ unehrlich lügen kriminalität kriminell verbrechen straftat verurteilt schuldig


ECT (↑): Corr 85.79% (p-Wert 2.648e-06)

BAT (↓): 59.80%

unable to import 'smart_open.gcs', disabling that module
Not in vocab: nehir ousa abóòd aıscha rechtschaffenheit ecrin miray eymen rosarita hiranur
Using T1: ursula carin karin helga sabine ingrid renate monica monika susanne gisela petra birgit andrea anna brigitte claudia klaudia erica erika christa krista elke stefanie stephanie gertrud elisabeth elizabeth peter michael thomas andreas wolfgang claus klaus jürgen günter günther stefan stephan christian kristian uwe werner horst frank dieter manfred gerhard gerhardt hans
Using T2: elif zeynep zehra azra eylül defne yusuf mustafa ömer berat miraç ayaz ahmet mehmet muhammed zuzanna lena julia maja zofia hanna amelia aleksandra alicja natalia jakub antoni szymon jan filip kacper aleksander franciszek mikołaj wojciech amena qamar haya sandra reem maya hala akram hasan elias ali alex zak miran aimar burhan
Using A1: gut positiv ehrlich ehrlichkeit rechtschaffen gesetz recht frei unschuldig
Using A2: schlecht negativ unehrlich lügen kriminalität kriminell verbrechen straftat verurteilt
Computing p value - Number of possible permutations: 3.996088548667444e+29
Computing randomly first 100000  permutations
WEAT (↓): Corr 94.77% (p-Wert 0.0, test statistic 1.176)

kMEANS (↓): 89.24%

SVM:
Test 1: ursula carin karin helga sabine ingrid renate monica monika susanne gisela petra birgit andrea anna brigitte claudia klaudia erica erika christa krista elke stefanie stephanie gertrud elisabeth elizabeth peter michael thomas andreas wolfgang claus klaus jürgen günter günther stefan stephan christian kristian uwe werner horst frank dieter manfred gerhard gerhardt hans bernd berndt bernt thorsten torsten mathias matthias helmut helmuth
Train 1 (generated): angelika jutta ulrike gudrun dagmar irmgard sigrid inge sonja michaela rosemarie ilse gerda bettina silke beate pamela anneliese katrin kerstin anja tanja kathrin heike daniela silvia katharina dorothea agnes antje hedwig margarete margarethe ulrich gerd tobias gerald markus patrick ralph oliver florian jens christof sebastian steffen hartmut jörg rainer lothar erhard rolf jörn holger detlef rüdiger dietmar ralf norbert wilfried willi heiko gernot dominik ingo siegfried heinz volker reinhold hoppe ingolf karsten maik carsten
Test 2: elif zeynep hiranur miray zehra ecrin azra eylül defne nehir yusuf eymen mustafa ömer berat miraç ayaz ahmet mehmet muhammed zuzanna lena julia maja zofia hanna amelia aleksandra alicja natalia jakub antoni szymon jan filip kacper aleksander franciszek mikołaj wojciech amena qamar haya ousa sandra rosarita reem aıscha maya hala akram abóòd hasan elias ali alex zak miran aimar burhan
Train 2 (generated): jale hülya aysel derya aslı ismail osman aziz ibrahim abdullah kemal brahim hüseyin smail metin yılmaz yasin sabri martyna patrycja katja tanja nadja anja stephanie melanie nina nicole tamara alina krystyna dorota izabela katarzyna aneta justyna sylwia stanislav michal petr pavel jaroslav jiří zygmunt józef kazimierz mieczysław bogusław włodzimierz zbigniew piotr paweł tadeusz jacek michał wacław ignacy eugeniusz ahmad ahmed
Number of train words: 134
SVM (↓): 94.01%


************************************************** WEAT 07 **************************************************
T1: jung modern frisch neu jugendlich jugend
T2: alt antik uralt vergangen vergangenheit historisch
A1: streicheln freiheit gesundheit liebe frieden jubeln freund freundin himmel treu vergnügen diamant ehrlich glücklich regenbogen geschenk ehre wunder sonnenaufgang familie glück lachen paradies urlaub freude wunderbar
A2: missbrauch absturz schmutz mord krankheit unfall tod trauer vergiften stinken angriff katastrophe hass tragödie scheidung gefängnis armut hässlich krebs töten faul erbrechen qual furchtbar schrecklich böse


ECT (↑): Corr 92.09% (p-Wert 4.178e-22)

BAT (↓): 52.90%

unable to import 'smart_open.gcs', disabling that module
Not in vocab:
Using T1: jung modern frisch neu jugendlich jugend
Using T2: alt antik uralt vergangen vergangenheit historisch
Using A1: streicheln freiheit gesundheit liebe frieden jubeln freund freundin himmel treu vergnügen diamant ehrlich glücklich regenbogen geschenk ehre wunder sonnenaufgang familie glück lachen paradies urlaub freude wunderbar
Using A2: missbrauch absturz schmutz mord krankheit unfall tod trauer vergiften stinken angriff katastrophe hass tragödie scheidung gefängnis armut hässlich krebs töten faul erbrechen qual furchtbar schrecklich böse
Computing p value - Number of possible permutations: 924.0
WEAT (↓): Corr 87.23% (p-Wert 0.07576, test statistic 0.0915)

kMEANS (↓): 54.33%

SVM:
Test 1: jung modern frisch neu jugendlich jugend
Train 1 (generated): keun ahn dae yoon sook seon jeong yeon chul sik
Test 2: alt antik uralt vergangen vergangenheit historisch
Train 2 (generated): älter klein rosenthal groß damerow marienfelde heiligensee biesdorf buckow wittenau
Number of train words: 20
SVM (↓): 58.33%


************************************************** WEAT 08 **************************************************
T1: julia stefanie stephanie anna katharina katarina catharina catarina katrin kathrin cathrin catrin sandra christian kristian sebastian jan daniel alexander sara sarah lisa laura lucas lukas philip philipp tim timm hannah hanna lea leah leonie lena lara leon luca
T2: helga ursula ingrid gisela christa krista inge hans günter günther horst klaus claus karl carl werner karin renate monika peter wolfgang jürgen dieter angelika sabine petra gabriele michael thomas tomas susanne andrea claudia birgit andreas frank torsten thorsten
A1: streicheln freiheit gesundheit liebe frieden jubeln freund freundin himmel treu vergnügen diamant ehrlich glücklich regenbogen geschenk ehre wunder sonnenaufgang familie glück lachen paradies urlaub freude wunderbar
A2: missbrauch absturz schmutz mord krankheit unfall tod trauer vergiften stinken angriff katastrophe hass tragödie scheidung gefängnis armut hässlich krebs töten faul erbrechen qual furchtbar schrecklich böse


ECT (↑): Corr 89.51% (p-Wert 3.623e-19)

BAT (↓): 40.68%

unable to import 'smart_open.gcs', disabling that module
Not in vocab:
Using T1: julia stefanie stephanie anna katharina katarina catharina catarina katrin kathrin cathrin catrin sandra christian kristian sebastian jan daniel alexander sara sarah lisa laura lucas lukas philip philipp tim timm hannah hanna lea leah leonie lena lara leon luca
Using T2: helga ursula ingrid gisela christa krista inge hans günter günther horst klaus claus karl carl werner karin renate monika peter wolfgang jürgen dieter angelika sabine petra gabriele michael thomas tomas susanne andrea claudia birgit andreas frank torsten thorsten
Using A1: streicheln freiheit gesundheit liebe frieden jubeln freund freundin himmel treu vergnügen diamant ehrlich glücklich regenbogen geschenk ehre wunder sonnenaufgang familie glück lachen paradies urlaub freude wunderbar
Using A2: missbrauch absturz schmutz mord krankheit unfall tod trauer vergiften stinken angriff katastrophe hass tragödie scheidung gefängnis armut hässlich krebs töten faul erbrechen qual furchtbar schrecklich böse
Computing p value - Number of possible permutations: 6.892620648693261e+21
Computing randomly first 100000  permutations
WEAT (↓): Corr -80.18% (p-Wert 0.9999, test statistic -0.5848)

kMEANS (↓): 67.61%

SVM:
Test 1: julia stefanie stephanie anna katharina katarina catharina catarina katrin kathrin cathrin catrin sandra christian kristian sebastian jan daniel alexander sara sarah lisa laura lucas lukas philip philipp tim timm hannah hanna lea leah leonie lena lara leon luca
Train 1 (generated): katja melanie jessica tanja nina rebecca nicole anja anke corinna carolin michaela kerstin sonja natalie nadine valerie dorothea agnes elisabeth franziska margarethe margaretha nadja tamara kristin antje inken svenja daniela christoph tobias christof rudolph fabian florian dominik nico markus gerrit adrian joshua lina emma rachel lydia gina emily patricia ruben dennis lilly deborah miriam janine
Test 2: helga ursula ingrid gisela christa krista inge hans günter günther horst klaus claus karl carl werner karin renate monika peter wolfgang jürgen dieter angelika sabine petra gabriele michael thomas tomas susanne andrea claudia birgit andreas frank torsten thorsten
Train 2 (generated): rosemarie erika gudrun sigrid gerda jutta ulrike brigitte dagmar irmgard margit elke sonja rolf gerd willi ulrich hartmut rüdiger bernd norbert dietmar wilfried ralf heiko erhard heinz uwe jörn holger detlef emil gustav rainer michaela beate stephan jörg volker silke bettina katrin kerstin anja tanja silvia tobias gerald markus patrick ralph oliver daniela steffen karsten ingo maik
Number of train words: 112
SVM (↓): 93.36%


************************************************** WEAT 09 **************************************************
T1: männlich mann junge bruder er ihm sein sohn vater onkel großvater opa cousin
T2: weiblich frau mädchen schwester sie ihr tochter mutter tante großmutter oma cousine nichte
A1: streicheln freiheit gesundheit liebe frieden jubeln freund freundin himmel treu vergnügen diamant ehrlich glücklich regenbogen geschenk ehre wunder sonnenaufgang familie glück lachen paradies urlaub freude wunderbar
A2: missbrauch absturz schmutz mord krankheit unfall tod trauer vergiften stinken angriff katastrophe hass tragödie scheidung gefängnis armut hässlich krebs töten faul erbrechen qual furchtbar schrecklich böse


ECT (↑): Corr 92.56% (p-Wert 9.563e-23)

BAT (↓): 39.80%

unable to import 'smart_open.gcs', disabling that module
Not in vocab:
Using T1: männlich mann junge bruder er ihm sein sohn vater onkel großvater opa cousin
Using T2: weiblich frau mädchen schwester sie ihr tochter mutter tante großmutter oma cousine nichte
Using A1: streicheln freiheit gesundheit liebe frieden jubeln freund freundin himmel treu vergnügen diamant ehrlich glücklich regenbogen geschenk ehre wunder sonnenaufgang familie glück lachen paradies urlaub freude wunderbar
Using A2: missbrauch absturz schmutz mord krankheit unfall tod trauer vergiften stinken angriff katastrophe hass tragödie scheidung gefängnis armut hässlich krebs töten faul erbrechen qual furchtbar schrecklich böse
Computing p value - Number of possible permutations: 10400600.0
Computing randomly first 100000  permutations
WEAT (↓): Corr -35.58% (p-Wert 0.8072, test statistic -0.07193)

kMEANS (↓): 57.08%

SVM:
Test 1: männlich mann junge bruder er ihm sein sohn vater onkel großvater opa cousin
Train 1 (generated): mädchen enkel halbbruder neffe schwager schwiegersohn sogleich ihr seinem schwiegervater neffen
Test 2: weiblich frau mädchen schwester sie ihr tochter mutter tante großmutter oma cousine nichte
Train 2 (generated): ehefrau gattin freundin witwe geliebten enkelin halbschwester ihrem sogleich stiefmutter schwiegermutter schwägerin heiratet stieftochter
Number of train words: 25
SVM (↓): 84.62%


************************************************** WEAT 10 **************************************************
T1: peter michael thomas andreas wolfgang claus klaus jürgen günter günther stefan stephan christian kristian uwe werner horst frank dieter manfred gerhard gerhardt hans bernd berndt bernt thorsten torsten mathias matthias helmut helmuth walter walther heinz martin jörg joerg rolf jens sven swen alexander jan rainer reiner holger carl karl dirk joachim ralf ralph carsten karsten herbert oliver wilhelm curt kurt
T2: ursula carin karin helga sabine ingrid renate monica monika susanne gisela petra birgit andrea anna brigitte claudia klaudia erica erika christa krista elke stefanie stephanie gertrud elisabeth elizabeth maria angelika heike gabriele cathrin catrin kathrin katrin ilse nicole anja barbara hildegard martina ingeborg gerda marion jutta ute hannelore irmgard irmgart christine kristine inge christina kristina silvia sylvia margarete margarethe kerstin
A1: streicheln freiheit gesundheit liebe frieden jubeln freund freundin himmel treu vergnügen diamant ehrlich glücklich regenbogen geschenk ehre wunder sonnenaufgang familie glück lachen paradies urlaub freude wunderbar
A2: missbrauch absturz schmutz mord krankheit unfall tod trauer vergiften stinken angriff katastrophe hass tragödie scheidung gefängnis armut hässlich krebs töten faul erbrechen qual furchtbar schrecklich böse


ECT (↑): Corr 84.73% (p-Wert 2.373e-15)

BAT (↓): 38.61%

unable to import 'smart_open.gcs', disabling that module
Not in vocab:
Using T1: peter michael thomas andreas wolfgang claus klaus jürgen günter günther stefan stephan christian kristian uwe werner horst frank dieter manfred gerhard gerhardt hans bernd berndt bernt thorsten torsten mathias matthias helmut helmuth walter walther heinz martin jörg joerg rolf jens sven swen alexander jan rainer reiner holger carl karl dirk joachim ralf ralph carsten karsten herbert oliver wilhelm curt kurt
Using T2: ursula carin karin helga sabine ingrid renate monica monika susanne gisela petra birgit andrea anna brigitte claudia klaudia erica erika christa krista elke stefanie stephanie gertrud elisabeth elizabeth maria angelika heike gabriele cathrin catrin kathrin katrin ilse nicole anja barbara hildegard martina ingeborg gerda marion jutta ute hannelore irmgard irmgart christine kristine inge christina kristina silvia sylvia margarete margarethe kerstin
Using A1: streicheln freiheit gesundheit liebe frieden jubeln freund freundin himmel treu vergnügen diamant ehrlich glücklich regenbogen geschenk ehre wunder sonnenaufgang familie glück lachen paradies urlaub freude wunderbar
Using A2: missbrauch absturz schmutz mord krankheit unfall tod trauer vergiften stinken angriff katastrophe hass tragödie scheidung gefängnis armut hässlich krebs töten faul erbrechen qual furchtbar schrecklich böse
Computing p value - Number of possible permutations: 9.661490884036332e+34
Computing randomly first 100000  permutations
WEAT (↓): Corr -36.41% (p-Wert 0.9768, test statistic -0.3438)

kMEANS (↓): 99.17%

SVM:
Test 1: peter michael thomas andreas wolfgang claus klaus jürgen günter günther stefan stephan christian kristian uwe werner horst frank dieter manfred gerhard gerhardt hans bernd berndt bernt thorsten torsten mathias matthias helmut helmuth walter walther heinz martin jörg joerg rolf jens sven swen alexander jan rainer reiner holger carl karl dirk joachim ralf ralph carsten karsten herbert oliver wilhelm curt kurt
Train 1 (generated): ulrich gerd tobias gerald markus patrick florian christof sebastian steffen hartmut lothar erhard jörn gert friedhelm henning detlef gunther rüdiger dietmar norbert wilfried willi heiko gernot volkmar hartwig dominik christoph gottlieb gottlob rudolph gunnar ingo siegfried fred dennis norman volker reinhold hoppe ingolf maik sören hellmuth hilmar herrmann erich erwin traugott lars elmar adolph emil gustav ludwig maximilian adolf oskar
Test 2: ursula carin karin helga sabine ingrid renate monica monika susanne gisela petra birgit andrea anna brigitte claudia klaudia erica erika christa krista elke stefanie stephanie gertrud elisabeth elizabeth maria angelika heike gabriele cathrin catrin kathrin katrin ilse nicole anja barbara hildegard martina ingeborg gerda marion jutta ute hannelore irmgard irmgart christine kristine inge christina kristina silvia sylvia margarete margarethe kerstin
Train 2 (generated): ulrike gudrun dagmar stina desirée sigrid sonja michaela rosemarie bettina silke beate margit pamela patricia anneliese katja tanja daniela magdalena katharina dorothea agnes franziska susanna cornelia karina antje janine anke corinna melanie rebecca nadine sandra hedwig adelheid elfriede johanna eleonore waltraud inken erna hilde denise regine manuela nadja roswitha sybille britta henriette
Number of train words: 112
SVM (↓): 100.00%


************************************************** WEAT 11 **************************************************
T1: männlich mann junge bruder er ihm sein sohn vater onkel großvater opa cousin
T2: weiblich frau mädchen schwester sie ihr tochter mutter tante großmutter oma cousine nichte
A1: führungskraft verwaltung konzern gehalt büro geschäft karriere arbeit job
A2: zuhause eltern kinder familie cousins ehe hochzeit verwandtschaft erziehung


ECT (↑): Corr 92.16% (p-Wert 5.618e-08)

BAT (↓): 43.29%

unable to import 'smart_open.gcs', disabling that module
Not in vocab:
Using T1: männlich mann junge bruder er ihm sein sohn vater onkel großvater opa cousin
Using T2: weiblich frau mädchen schwester sie ihr tochter mutter tante großmutter oma cousine nichte
Using A1: führungskraft verwaltung konzern gehalt büro geschäft karriere arbeit job
Using A2: zuhause eltern kinder familie cousins ehe hochzeit verwandtschaft erziehung
Computing p value - Number of possible permutations: 10400600.0
Computing randomly first 100000  permutations
WEAT (↓): Corr 92.09% (p-Wert 0.00961, test statistic 0.9264)

kMEANS (↓): 57.46%

SVM:
Test 1: männlich mann junge bruder er ihm sein sohn vater onkel großvater opa cousin
Train 1 (generated): mädchen enkel halbbruder neffe schwager schwiegersohn sogleich ihr seinem schwiegervater neffen
Test 2: weiblich frau mädchen schwester sie ihr tochter mutter tante großmutter oma cousine nichte
Train 2 (generated): ehefrau gattin freundin witwe geliebten enkelin halbschwester ihrem sogleich stiefmutter schwiegermutter schwägerin heiratet stieftochter
Number of train words: 25
SVM (↓): 84.62%


************************************************** WEAT 12 **************************************************
T1: peter michael thomas andreas wolfgang claus klaus jürgen günter günther stefan stephan christian kristian uwe werner horst frank dieter manfred gerhard gerhardt hans bernd berndt bernt thorsten torsten mathias matthias helmut helmuth walter walther heinz martin jörg joerg rolf jens sven swen alexander jan rainer reiner holger carl karl dirk joachim ralf ralph carsten karsten herbert oliver wilhelm curt kurt
T2: ursula carin karin helga sabine ingrid renate monica monika susanne gisela petra birgit andrea anna brigitte claudia klaudia erica erika christa krista elke stefanie stephanie gertrud elisabeth elizabeth maria angelika heike gabriele cathrin catrin kathrin katrin ilse nicole anja barbara hildegard martina ingeborg gerda marion jutta ute hannelore irmgard irmgart christine kristine inge christina kristina silvia sylvia margarete margarethe kerstin
A1: führungskraft verwaltung konzern gehalt büro geschäft karriere arbeit job
A2: zuhause eltern kinder familie cousins ehe hochzeit verwandtschaft erziehung


ECT (↑): Corr 70.07% (p-Wert 0.001199)

BAT (↓): 31.40%

unable to import 'smart_open.gcs', disabling that module
Not in vocab:
Using T1: peter michael thomas andreas wolfgang claus klaus jürgen günter günther stefan stephan christian kristian uwe werner horst frank dieter manfred gerhard gerhardt hans bernd berndt bernt thorsten torsten mathias matthias helmut helmuth walter walther heinz martin jörg joerg rolf jens sven swen alexander jan rainer reiner holger carl karl dirk joachim ralf ralph carsten karsten herbert oliver wilhelm curt kurt
Using T2: ursula carin karin helga sabine ingrid renate monica monika susanne gisela petra birgit andrea anna brigitte claudia klaudia erica erika christa krista elke stefanie stephanie gertrud elisabeth elizabeth maria angelika heike gabriele cathrin catrin kathrin katrin ilse nicole anja barbara hildegard martina ingeborg gerda marion jutta ute hannelore irmgard irmgart christine kristine inge christina kristina silvia sylvia margarete margarethe kerstin
Using A1: führungskraft verwaltung konzern gehalt büro geschäft karriere arbeit job
Using A2: zuhause eltern kinder familie cousins ehe hochzeit verwandtschaft erziehung
Computing p value - Number of possible permutations: 9.661490884036332e+34
Computing randomly first 100000  permutations
WEAT (↓): Corr 145.06% (p-Wert 0.0, test statistic 4.703)

kMEANS (↓): 99.10%

SVM:
Test 1: peter michael thomas andreas wolfgang claus klaus jürgen günter günther stefan stephan christian kristian uwe werner horst frank dieter manfred gerhard gerhardt hans bernd berndt bernt thorsten torsten mathias matthias helmut helmuth walter walther heinz martin jörg joerg rolf jens sven swen alexander jan rainer reiner holger carl karl dirk joachim ralf ralph carsten karsten herbert oliver wilhelm curt kurt
Train 1 (generated): ulrich gerd tobias gerald markus patrick florian christof sebastian steffen hartmut lothar erhard jörn gert friedhelm henning detlef gunther rüdiger dietmar norbert wilfried willi heiko gernot volkmar hartwig dominik christoph gottlieb gottlob rudolph gunnar ingo siegfried fred dennis norman volker reinhold hoppe ingolf maik sören hellmuth hilmar herrmann erich erwin traugott lars elmar adolph emil gustav ludwig maximilian adolf oskar
Test 2: ursula carin karin helga sabine ingrid renate monica monika susanne gisela petra birgit andrea anna brigitte claudia klaudia erica erika christa krista elke stefanie stephanie gertrud elisabeth elizabeth maria angelika heike gabriele cathrin catrin kathrin katrin ilse nicole anja barbara hildegard martina ingeborg gerda marion jutta ute hannelore irmgard irmgart christine kristine inge christina kristina silvia sylvia margarete margarethe kerstin
Train 2 (generated): ulrike gudrun dagmar stina desirée sigrid sonja michaela rosemarie bettina silke beate margit pamela patricia anneliese katja tanja daniela magdalena katharina dorothea agnes franziska susanna cornelia karina antje janine anke corinna melanie rebecca nadine sandra hedwig adelheid elfriede johanna eleonore waltraud inken erna hilde denise regine manuela nadja roswitha sybille britta henriette
Number of train words: 112
SVM (↓): 100.00%


************************************************** WEAT 13 **************************************************
T1: männlich mann junge bruder er ihm sein sohn vater onkel großvater opa cousin
T2: weiblich frau mädchen schwester sie ihr tochter mutter tante großmutter oma cousine nichte
A1: wissenschaft forschung technologie technik physik chemie mathematik algebra experiment astronomie
A2: poesie kunst tanz literatur roman symphonie theater skulptur tanzen kunstwerk


ECT (↑): Corr 76.84% (p-Wert 7.572e-05)

BAT (↓): 26.83%

unable to import 'smart_open.gcs', disabling that module
Not in vocab:
Using T1: männlich mann junge bruder er ihm sein sohn vater onkel großvater opa cousin
Using T2: weiblich frau mädchen schwester sie ihr tochter mutter tante großmutter oma cousine nichte
Using A1: wissenschaft forschung technologie technik physik chemie mathematik algebra experiment astronomie
Using A2: poesie kunst tanz literatur roman symphonie theater skulptur tanzen kunstwerk
Computing p value - Number of possible permutations: 10400600.0
Computing randomly first 100000  permutations
WEAT (↓): Corr 120.64% (p-Wert 0.00052, test statistic 0.6794)

kMEANS (↓): 57.31%

SVM:
Test 1: männlich mann junge bruder er ihm sein sohn vater onkel großvater opa cousin
Train 1 (generated): mädchen enkel halbbruder neffe schwager schwiegersohn sogleich ihr seinem schwiegervater neffen
Test 2: weiblich frau mädchen schwester sie ihr tochter mutter tante großmutter oma cousine nichte
Train 2 (generated): ehefrau gattin freundin witwe geliebten enkelin halbschwester ihrem sogleich stiefmutter schwiegermutter schwägerin heiratet stieftochter
Number of train words: 25
SVM (↓): 84.62%


************************************************** WEAT 14 **************************************************
T1: peter michael thomas andreas wolfgang claus klaus jürgen günter günther stefan stephan christian kristian uwe werner horst frank dieter manfred gerhard gerhardt hans bernd berndt bernt thorsten torsten mathias matthias helmut helmuth walter walther heinz martin jörg joerg rolf jens sven swen alexander jan rainer reiner holger carl karl dirk joachim ralf ralph carsten karsten herbert oliver wilhelm curt kurt
T2: ursula carin karin helga sabine ingrid renate monica monika susanne gisela petra birgit andrea anna brigitte claudia klaudia erica erika christa krista elke stefanie stephanie gertrud elisabeth elizabeth maria angelika heike gabriele cathrin catrin kathrin katrin ilse nicole anja barbara hildegard martina ingeborg gerda marion jutta ute hannelore irmgard irmgart christine kristine inge christina kristina silvia sylvia margarete margarethe kerstin
A1: wissenschaft forschung technologie technik physik chemie mathematik algebra experiment astronomie
A2: poesie kunst tanz literatur roman symphonie theater skulptur tanzen kunstwerk


ECT (↑): Corr 42.86% (p-Wert 0.05938)

BAT (↓): 25.67%

unable to import 'smart_open.gcs', disabling that module
Not in vocab:
Using T1: peter michael thomas andreas wolfgang claus klaus jürgen günter günther stefan stephan christian kristian uwe werner horst frank dieter manfred gerhard gerhardt hans bernd berndt bernt thorsten torsten mathias matthias helmut helmuth walter walther heinz martin jörg joerg rolf jens sven swen alexander jan rainer reiner holger carl karl dirk joachim ralf ralph carsten karsten herbert oliver wilhelm curt kurt
Using T2: ursula carin karin helga sabine ingrid renate monica monika susanne gisela petra birgit andrea anna brigitte claudia klaudia erica erika christa krista elke stefanie stephanie gertrud elisabeth elizabeth maria angelika heike gabriele cathrin catrin kathrin katrin ilse nicole anja barbara hildegard martina ingeborg gerda marion jutta ute hannelore irmgard irmgart christine kristine inge christina kristina silvia sylvia margarete margarethe kerstin
Using A1: wissenschaft forschung technologie technik physik chemie mathematik algebra experiment astronomie
Using A2: poesie kunst tanz literatur roman symphonie theater skulptur tanzen kunstwerk
Computing p value - Number of possible permutations: 9.661490884036332e+34
Computing randomly first 100000  permutations
WEAT (↓): Corr 150.59% (p-Wert 0.0, test statistic 4.276)

kMEANS (↓): 99.10%

SVM:
Test 1: peter michael thomas andreas wolfgang claus klaus jürgen günter günther stefan stephan christian kristian uwe werner horst frank dieter manfred gerhard gerhardt hans bernd berndt bernt thorsten torsten mathias matthias helmut helmuth walter walther heinz martin jörg joerg rolf jens sven swen alexander jan rainer reiner holger carl karl dirk joachim ralf ralph carsten karsten herbert oliver wilhelm curt kurt
Train 1 (generated): ulrich gerd tobias gerald markus patrick florian christof sebastian steffen hartmut lothar erhard jörn gert friedhelm henning detlef gunther rüdiger dietmar norbert wilfried willi heiko gernot volkmar hartwig dominik christoph gottlieb gottlob rudolph gunnar ingo siegfried fred dennis norman volker reinhold hoppe ingolf maik sören hellmuth hilmar herrmann erich erwin traugott lars elmar adolph emil gustav ludwig maximilian adolf oskar
Test 2: ursula carin karin helga sabine ingrid renate monica monika susanne gisela petra birgit andrea anna brigitte claudia klaudia erica erika christa krista elke stefanie stephanie gertrud elisabeth elizabeth maria angelika heike gabriele cathrin catrin kathrin katrin ilse nicole anja barbara hildegard martina ingeborg gerda marion jutta ute hannelore irmgard irmgart christine kristine inge christina kristina silvia sylvia margarete margarethe kerstin
Train 2 (generated): ulrike gudrun dagmar stina desirée sigrid sonja michaela rosemarie bettina silke beate margit pamela patricia anneliese katja tanja daniela magdalena katharina dorothea agnes franziska susanna cornelia karina antje janine anke corinna melanie rebecca nadine sandra hedwig adelheid elfriede johanna eleonore waltraud inken erna hilde denise regine manuela nadja roswitha sybille britta henriette
Number of train words: 112
SVM (↓): 100.00%


************************************************** WEAT 15 **************************************************
T1: männlich mann junge bruder er ihm sein sohn vater onkel großvater opa cousin
T2: weiblich frau mädchen schwester sie ihr tochter mutter tante großmutter oma cousine nichte
A1: handwerker handwerkerin wissenschaftler wissenschaftlerin programmierer programmiererin arzt ärztin chef chefin manager managerin politiker politikerin ingenieur ingenieurin bänker bänkerin pilot pilotin
A2: lehrer lehrerin krankenpfleger krankenpflegerin altenpfleger altenpflegerin erzieher erzieherin friseur friseurin sekretär sekretärin hebamme entbindungspfleger kosmetiker kosmetikerin flugbegleiter flugbegleiterin kaufmann kauffrau


ECT (↑): Corr 81.37% (p-Wert 2.797e-09)

BAT (↓): 51.52%

unable to import 'smart_open.gcs', disabling that module
Not in vocab: krankenpflegerin entbindungspfleger bänkerin handwerkerin wissenschaftlerin
Using T1: männlich mann junge bruder er ihm sein sohn vater onkel großvater opa cousin
Using T2: weiblich frau mädchen schwester sie ihr tochter mutter tante großmutter oma cousine nichte
Using A1: handwerker wissenschaftler programmierer programmiererin arzt ärztin chef chefin manager managerin politiker politikerin ingenieur ingenieurin bänker pilot pilotin
Using A2: lehrer lehrerin krankenpfleger altenpfleger altenpflegerin erzieher erzieherin friseur friseurin sekretär sekretärin hebamme kosmetiker kosmetikerin flugbegleiter flugbegleiterin kaufmann
Computing p value - Number of possible permutations: 10400600.0
Computing randomly first 100000  permutations
WEAT (↓): Corr 92.04% (p-Wert 0.00939, test statistic 0.3006)

kMEANS (↓): 57.23%

SVM:
Test 1: männlich mann junge bruder er ihm sein sohn vater onkel großvater opa cousin
Train 1 (generated): mädchen enkel halbbruder neffe schwager schwiegersohn sogleich ihr seinem schwiegervater neffen
Test 2: weiblich frau mädchen schwester sie ihr tochter mutter tante großmutter oma cousine nichte
Train 2 (generated): ehefrau gattin freundin witwe geliebten enkelin halbschwester ihrem sogleich stiefmutter schwiegermutter schwägerin heiratet stieftochter
Number of train words: 25
SVM (↓): 84.62%


************************************************** WEAT 16 **************************************************
T1: peter michael thomas andreas wolfgang claus klaus jürgen günter günther stefan stephan christian kristian uwe werner horst frank dieter manfred gerhard gerhardt hans bernd berndt bernt thorsten torsten mathias matthias helmut helmuth walter walther heinz martin jörg joerg rolf jens sven swen alexander jan rainer reiner holger carl karl dirk joachim ralf ralph carsten karsten herbert oliver wilhelm curt kurt
T2: ursula carin karin helga sabine ingrid renate monica monika susanne gisela petra birgit andrea anna brigitte claudia klaudia erica erika christa krista elke stefanie stephanie gertrud elisabeth elizabeth maria angelika heike gabriele cathrin catrin kathrin katrin ilse nicole anja barbara hildegard martina ingeborg gerda marion jutta ute hannelore irmgard irmgart christine kristine inge christina kristina silvia sylvia margarete margarethe kerstin
A1: handwerker handwerkerin wissenschaftler wissenschaftlerin programmierer programmiererin arzt ärztin chef chefin manager managerin politiker politikerin ingenieur ingenieurin bänker bänkerin pilot pilotin
A2: lehrer lehrerin krankenpfleger krankenpflegerin altenpfleger altenpflegerin erzieher erzieherin friseur friseurin sekretär sekretärin hebamme entbindungspfleger kosmetiker kosmetikerin flugbegleiter flugbegleiterin kaufmann kauffrau


ECT (↑): Corr 59.89% (p-Wert 0.0001442)

BAT (↓): 42.77%

unable to import 'smart_open.gcs', disabling that module
Not in vocab: bänkerin entbindungspfleger handwerkerin krankenpflegerin wissenschaftlerin
Using T1: peter michael thomas andreas wolfgang claus klaus jürgen günter günther stefan stephan christian kristian uwe werner horst frank dieter manfred gerhard gerhardt hans bernd berndt bernt thorsten torsten mathias matthias helmut helmuth walter walther heinz martin jörg joerg rolf jens sven swen alexander jan rainer reiner holger carl karl dirk joachim ralf ralph carsten karsten herbert oliver wilhelm curt kurt
Using T2: ursula carin karin helga sabine ingrid renate monica monika susanne gisela petra birgit andrea anna brigitte claudia klaudia erica erika christa krista elke stefanie stephanie gertrud elisabeth elizabeth maria angelika heike gabriele cathrin catrin kathrin katrin ilse nicole anja barbara hildegard martina ingeborg gerda marion jutta ute hannelore irmgard irmgart christine kristine inge christina kristina silvia sylvia margarete margarethe kerstin
Using A1: handwerker wissenschaftler programmierer programmiererin arzt ärztin chef chefin manager managerin politiker politikerin ingenieur ingenieurin bänker pilot pilotin
Using A2: lehrer lehrerin krankenpfleger altenpfleger altenpflegerin erzieher erzieherin friseur friseurin sekretär sekretärin hebamme kosmetiker kosmetikerin flugbegleiter flugbegleiterin kaufmann
Computing p value - Number of possible permutations: 9.661490884036332e+34
Computing randomly first 100000  permutations
WEAT (↓): Corr 87.33% (p-Wert 0.0, test statistic 1.275)

kMEANS (↓): 99.10%

SVM:
Test 1: peter michael thomas andreas wolfgang claus klaus jürgen günter günther stefan stephan christian kristian uwe werner horst frank dieter manfred gerhard gerhardt hans bernd berndt bernt thorsten torsten mathias matthias helmut helmuth walter walther heinz martin jörg joerg rolf jens sven swen alexander jan rainer reiner holger carl karl dirk joachim ralf ralph carsten karsten herbert oliver wilhelm curt kurt
Train 1 (generated): ulrich gerd tobias gerald markus patrick florian christof sebastian steffen hartmut lothar erhard jörn gert friedhelm henning detlef gunther rüdiger dietmar norbert wilfried willi heiko gernot volkmar hartwig dominik christoph gottlieb gottlob rudolph gunnar ingo siegfried fred dennis norman volker reinhold hoppe ingolf maik sören hellmuth hilmar herrmann erich erwin traugott lars elmar adolph emil gustav ludwig maximilian adolf oskar
Test 2: ursula carin karin helga sabine ingrid renate monica monika susanne gisela petra birgit andrea anna brigitte claudia klaudia erica erika christa krista elke stefanie stephanie gertrud elisabeth elizabeth maria angelika heike gabriele cathrin catrin kathrin katrin ilse nicole anja barbara hildegard martina ingeborg gerda marion jutta ute hannelore irmgard irmgart christine kristine inge christina kristina silvia sylvia margarete margarethe kerstin
Train 2 (generated): ulrike gudrun dagmar stina desirée sigrid sonja michaela rosemarie bettina silke beate margit pamela patricia anneliese katja tanja daniela magdalena katharina dorothea agnes franziska susanna cornelia karina antje janine anke corinna melanie rebecca nadine sandra hedwig adelheid elfriede johanna eleonore waltraud inken erna hilde denise regine manuela nadja roswitha sybille britta henriette
Number of train words: 112
SVM (↓): 100.00%


************************************************** WEAT 17 **************************************************
T1: führungskraft verwaltung konzern gehalt büro geschäft karriere arbeit job
T2: zuhause eltern kinder familie cousins ehe hochzeit verwandtschaft erziehung
A1: männlich mann junge bruder er ihm sein sohn vater onkel großvater opa cousin
A2: weiblich frau mädchen schwester sie ihr tochter mutter tante großmutter oma cousine nichte


ECT (↑): Corr 63.01% (p-Wert 0.0005611)

BAT (↓): 49.48%

unable to import 'smart_open.gcs', disabling that module
Not in vocab:
Using T1: führungskraft verwaltung konzern gehalt büro geschäft karriere arbeit job
Using T2: zuhause eltern kinder familie cousins ehe hochzeit verwandtschaft erziehung
Using A1: männlich mann junge bruder er ihm sein sohn vater onkel großvater opa cousin
Using A2: weiblich frau mädchen schwester sie ihr tochter mutter tante großmutter oma cousine nichte
Computing p value - Number of possible permutations: 48620.0
WEAT (↓): Corr 162.22% (p-Wert 2.057e-05, test statistic 0.6413)

kMEANS (↓): 85.44%

SVM:
Test 1: führungskraft verwaltung konzern gehalt büro geschäft karriere arbeit job
Train 1 (generated): unternehmens geschäfts koordinations kompetente entscheider personalplanung führungskräften teamarbeit fachkompetenz pflegekraft
Test 2: zuhause eltern kinder familie cousins ehe hochzeit verwandtschaft erziehung
Train 2 (generated): verwandten heiratet daheim ausgerechnet hotelzimmer liebsten woanders kinderzimmer heimweg einsam
Number of train words: 20
SVM (↓): 83.33%


************************************************** WEAT 18 **************************************************
T1: führungskraft verwaltung konzern gehalt büro geschäft karriere arbeit job
T2: zuhause eltern kinder familie cousins ehe hochzeit verwandtschaft erziehung
A1: peter michael thomas andreas wolfgang claus klaus jürgen günter günther stefan stephan christian kristian uwe werner horst frank dieter manfred gerhard gerhardt hans bernd berndt bernt thorsten torsten mathias matthias helmut helmuth walter walther heinz martin jörg joerg rolf jens sven swen alexander jan rainer reiner holger carl karl dirk joachim ralf ralph carsten karsten herbert oliver wilhelm curt kurt
A2: ursula carin karin helga sabine ingrid renate monica monika susanne gisela petra birgit andrea anna brigitte claudia klaudia erica erika christa krista elke stefanie stephanie gertrud elisabeth elizabeth maria angelika heike gabriele cathrin catrin kathrin katrin ilse nicole anja barbara hildegard martina ingeborg gerda marion jutta ute hannelore irmgard irmgart christine kristine inge christina kristina silvia sylvia margarete margarethe kerstin


ECT (↑): Corr 70.47% (p-Wert 2.689e-19)

BAT (↓): 39.79%

unable to import 'smart_open.gcs', disabling that module
Not in vocab:
Using T1: führungskraft verwaltung konzern gehalt büro geschäft karriere arbeit job
Using T2: zuhause eltern kinder familie cousins ehe hochzeit verwandtschaft erziehung
Using A1: peter michael thomas andreas wolfgang claus klaus jürgen günter günther stefan stephan christian kristian uwe werner horst frank dieter manfred gerhard gerhardt hans bernd berndt bernt thorsten torsten mathias matthias helmut helmuth walter walther heinz martin jörg joerg rolf jens sven swen alexander jan rainer reiner holger carl karl dirk joachim ralf ralph carsten karsten herbert oliver wilhelm curt kurt
Using A2: ursula carin karin helga sabine ingrid renate monica monika susanne gisela petra birgit andrea anna brigitte claudia klaudia erica erika christa krista elke stefanie stephanie gertrud elisabeth elizabeth maria angelika heike gabriele cathrin catrin kathrin katrin ilse nicole anja barbara hildegard martina ingeborg gerda marion jutta ute hannelore irmgard irmgart christine kristine inge christina kristina silvia sylvia margarete margarethe kerstin
Computing p value - Number of possible permutations: 48620.0
WEAT (↓): Corr 154.19% (p-Wert 0.000144, test statistic 0.7055)

kMEANS (↓): 86.67%

SVM:
Test 1: führungskraft verwaltung konzern gehalt büro geschäft karriere arbeit job
Train 1 (generated): unternehmens geschäfts koordinations kompetente entscheider personalplanung führungskräften teamarbeit fachkompetenz pflegekraft
Test 2: zuhause eltern kinder familie cousins ehe hochzeit verwandtschaft erziehung
Train 2 (generated): verwandten heiratet daheim ausgerechnet hotelzimmer liebsten woanders kinderzimmer heimweg einsam
Number of train words: 20
SVM (↓): 83.33%


************************************************** WEAT 19 **************************************************
T1: wissenschaft forschung technologie technik physik chemie mathematik algebra experiment astronomie
T2: poesie kunst tanz literatur roman symphonie theater skulptur tanzen kunstwerk
A1: männlich mann junge bruder er ihm sein sohn vater onkel großvater opa cousin
A2: weiblich frau mädchen schwester sie ihr tochter mutter tante großmutter oma cousine nichte


ECT (↑): Corr 55.56% (p-Wert 0.003215)

BAT (↓): 58.53%

unable to import 'smart_open.gcs', disabling that module
Not in vocab:
Using T1: wissenschaft forschung technologie technik physik chemie mathematik algebra experiment astronomie
Using T2: poesie kunst tanz literatur roman symphonie theater skulptur tanzen kunstwerk
Using A1: männlich mann junge bruder er ihm sein sohn vater onkel großvater opa cousin
Using A2: weiblich frau mädchen schwester sie ihr tochter mutter tante großmutter oma cousine nichte
Computing p value - Number of possible permutations: 184756.0
Computing randomly first 100000  permutations
WEAT (↓): Corr 132.22% (p-Wert 0.00101, test statistic 0.5226)

kMEANS (↓): 98.80%

SVM:
Test 1: wissenschaft forschung technologie technik physik chemie mathematik algebra experiment astronomie
Train 1 (generated): ethik innovation technologien astrophysik informatik geophysik mathematische geometrie zahlentheorie mengenlehre
Test 2: poesie kunst tanz literatur roman symphonie theater skulptur tanzen kunstwerk
Train 2 (generated): plastik wandbild prosa poetische lyrik ästhetik dichtung poetik dichtkunst poetischen
Number of train words: 20
SVM (↓): 100.00%


************************************************** WEAT 20 **************************************************
T1: wissenschaft forschung technologie technik physik chemie mathematik algebra experiment astronomie
T2: poesie kunst tanz literatur roman symphonie theater skulptur tanzen kunstwerk
A1: peter michael thomas andreas wolfgang claus klaus jürgen günter günther stefan stephan christian kristian uwe werner horst frank dieter manfred gerhard gerhardt hans bernd berndt bernt thorsten torsten mathias matthias helmut helmuth walter walther heinz martin jörg joerg rolf jens sven swen alexander jan rainer reiner holger carl karl dirk joachim ralf ralph carsten karsten herbert oliver wilhelm curt kurt
A2: ursula carin karin helga sabine ingrid renate monica monika susanne gisela petra birgit andrea anna brigitte claudia klaudia erica erika christa krista elke stefanie stephanie gertrud elisabeth elizabeth maria angelika heike gabriele cathrin catrin kathrin katrin ilse nicole anja barbara hildegard martina ingeborg gerda marion jutta ute hannelore irmgard irmgart christine kristine inge christina kristina silvia sylvia margarete margarethe kerstin


ECT (↑): Corr 67.28% (p-Wert 3.917e-17)

BAT (↓): 46.94%

unable to import 'smart_open.gcs', disabling that module
Not in vocab:
Using T1: wissenschaft forschung technologie technik physik chemie mathematik algebra experiment astronomie
Using T2: poesie kunst tanz literatur roman symphonie theater skulptur tanzen kunstwerk
Using A1: peter michael thomas andreas wolfgang claus klaus jürgen günter günther stefan stephan christian kristian uwe werner horst frank dieter manfred gerhard gerhardt hans bernd berndt bernt thorsten torsten mathias matthias helmut helmuth walter walther heinz martin jörg joerg rolf jens sven swen alexander jan rainer reiner holger carl karl dirk joachim ralf ralph carsten karsten herbert oliver wilhelm curt kurt
Using A2: ursula carin karin helga sabine ingrid renate monica monika susanne gisela petra birgit andrea anna brigitte claudia klaudia erica erika christa krista elke stefanie stephanie gertrud elisabeth elizabeth maria angelika heike gabriele cathrin catrin kathrin katrin ilse nicole anja barbara hildegard martina ingeborg gerda marion jutta ute hannelore irmgard irmgart christine kristine inge christina kristina silvia sylvia margarete margarethe kerstin
Computing p value - Number of possible permutations: 184756.0
Computing randomly first 100000  permutations
WEAT (↓): Corr 151.55% (p-Wert 0.00012, test statistic 0.7127)

kMEANS (↓): 99.30%

SVM:
Test 1: wissenschaft forschung technologie technik physik chemie mathematik algebra experiment astronomie
Train 1 (generated): ethik innovation technologien astrophysik informatik geophysik mathematische geometrie zahlentheorie mengenlehre
Test 2: poesie kunst tanz literatur roman symphonie theater skulptur tanzen kunstwerk
Train 2 (generated): plastik wandbild prosa poetische lyrik ästhetik dichtung poetik dichtkunst poetischen
Number of train words: 20
SVM (↓): 100.00%


************************************************** WEAT 21 **************************************************
T1: handwerker handwerkerin wissenschaftler wissenschaftlerin programmierer programmiererin arzt ärztin chef chefin manager managerin politiker politikerin ingenieur ingenieurin bänker bänkerin pilot pilotin
T2: lehrer lehrerin krankenpfleger krankenpflegerin altenpfleger altenpflegerin erzieher erzieherin friseur friseurin sekretär sekretärin hebamme entbindungspfleger kosmetiker kosmetikerin flugbegleiter flugbegleiterin kaufmann kauffrau
A1: männlich mann junge bruder er ihm sein sohn vater onkel großvater opa cousin
A2: weiblich frau mädchen schwester sie ihr tochter mutter tante großmutter oma cousine nichte


ECT (↑): Corr 95.62% (p-Wert 2.602e-14)

BAT (↓): 35.33%

unable to import 'smart_open.gcs', disabling that module
Not in vocab: krankenpflegerin entbindungspfleger wissenschaftlerin bänkerin handwerkerin
Using T1: handwerker wissenschaftler programmierer programmiererin arzt ärztin chef chefin manager managerin politiker politikerin ingenieur ingenieurin bänker pilot pilotin
Using T2: lehrer lehrerin krankenpfleger altenpfleger altenpflegerin erzieher erzieherin friseur friseurin sekretär sekretärin hebamme kosmetiker kosmetikerin flugbegleiter flugbegleiterin kaufmann
Using A1: männlich mann junge bruder er ihm sein sohn vater onkel großvater opa cousin
Using A2: weiblich frau mädchen schwester sie ihr tochter mutter tante großmutter oma cousine nichte
Computing p value - Number of possible permutations: 2333606220.0
Computing randomly first 100000  permutations
WEAT (↓): Corr 35.50% (p-Wert 0.1576, test statistic 0.393)

kMEANS (↓): 62.17%

SVM:
Test 1: handwerker handwerkerin wissenschaftler wissenschaftlerin programmierer programmiererin arzt ärztin chef chefin manager managerin politiker politikerin ingenieur ingenieurin bänker bänkerin pilot pilotin
Train 1 (generated): chirurg pädagogin biologin anwältin chemikerin unternehmerin ökonomin mdb mdep kaufleute
Test 2: lehrer lehrerin krankenpfleger krankenpflegerin altenpfleger altenpflegerin erzieher erzieherin friseur friseurin sekretär sekretärin hebamme entbindungspfleger kosmetiker kosmetikerin flugbegleiter flugbegleiterin kaufmann kauffrau
Train 2 (generated): hausfrau bibliothekarin sozialarbeiter zahntechniker masseurin floristin arzthelferin telefonistin konditorin kinderpflegerin kindergärtnerin schneiderin köchin buchhalterin modezeichnerin bankangestellte
Number of train words: 26
SVM (↓): 84.00%


************************************************** WEAT 22 **************************************************
T1: handwerker handwerkerin wissenschaftler wissenschaftlerin programmierer programmiererin arzt ärztin chef chefin manager managerin politiker politikerin ingenieur ingenieurin bänker bänkerin pilot pilotin
T2: lehrer lehrerin krankenpfleger krankenpflegerin altenpfleger altenpflegerin erzieher erzieherin friseur friseurin sekretär sekretärin hebamme entbindungspfleger kosmetiker kosmetikerin flugbegleiter flugbegleiterin kaufmann kauffrau
A1: peter michael thomas andreas wolfgang claus klaus jürgen günter günther stefan stephan christian kristian uwe werner horst frank dieter manfred gerhard gerhardt hans bernd berndt bernt thorsten torsten mathias matthias helmut helmuth walter walther heinz martin jörg joerg rolf jens sven swen alexander jan rainer reiner holger carl karl dirk joachim ralf ralph carsten karsten herbert oliver wilhelm curt kurt
A2: ursula carin karin helga sabine ingrid renate monica monika susanne gisela petra birgit andrea anna brigitte claudia klaudia erica erika christa krista elke stefanie stephanie gertrud elisabeth elizabeth maria angelika heike gabriele cathrin catrin kathrin katrin ilse nicole anja barbara hildegard martina ingeborg gerda marion jutta ute hannelore irmgard irmgart christine kristine inge christina kristina silvia sylvia margarete margarethe kerstin


ECT (↑): Corr 95.12% (p-Wert 4.465e-62)

BAT (↓): 20.68%

unable to import 'smart_open.gcs', disabling that module
Not in vocab: wissenschaftlerin krankenpflegerin handwerkerin bänkerin entbindungspfleger
Using T1: handwerker wissenschaftler programmierer programmiererin arzt ärztin chef chefin manager managerin politiker politikerin ingenieur ingenieurin bänker pilot pilotin
Using T2: lehrer lehrerin krankenpfleger altenpfleger altenpflegerin erzieher erzieherin friseur friseurin sekretär sekretärin hebamme kosmetiker kosmetikerin flugbegleiter flugbegleiterin kaufmann
Using A1: peter michael thomas andreas wolfgang claus klaus jürgen günter günther stefan stephan christian kristian uwe werner horst frank dieter manfred gerhard gerhardt hans bernd berndt bernt thorsten torsten mathias matthias helmut helmuth walter walther heinz martin jörg joerg rolf jens sven swen alexander jan rainer reiner holger carl karl dirk joachim ralf ralph carsten karsten herbert oliver wilhelm curt kurt
Using A2: ursula carin karin helga sabine ingrid renate monica monika susanne gisela petra birgit andrea anna brigitte claudia klaudia erica erika christa krista elke stefanie stephanie gertrud elisabeth elizabeth maria angelika heike gabriele cathrin catrin kathrin katrin ilse nicole anja barbara hildegard martina ingeborg gerda marion jutta ute hannelore irmgard irmgart christine kristine inge christina kristina silvia sylvia margarete margarethe kerstin
Computing p value - Number of possible permutations: 2333606220.0
Computing randomly first 100000  permutations
WEAT (↓): Corr 28.45% (p-Wert 0.2081, test statistic 0.3614)

kMEANS (↓): 62.40%

SVM:
Test 1: handwerker handwerkerin wissenschaftler wissenschaftlerin programmierer programmiererin arzt ärztin chef chefin manager managerin politiker politikerin ingenieur ingenieurin bänker bänkerin pilot pilotin
Train 1 (generated): chirurg pädagogin biologin anwältin chemikerin unternehmerin ökonomin mdb mdep kaufleute
Test 2: lehrer lehrerin krankenpfleger krankenpflegerin altenpfleger altenpflegerin erzieher erzieherin friseur friseurin sekretär sekretärin hebamme entbindungspfleger kosmetiker kosmetikerin flugbegleiter flugbegleiterin kaufmann kauffrau
Train 2 (generated): hausfrau bibliothekarin sozialarbeiter zahntechniker masseurin floristin arzthelferin telefonistin konditorin kinderpflegerin kindergärtnerin schneiderin köchin buchhalterin modezeichnerin bankangestellte
Number of train words: 26
SVM (↓): 84.00%


************************************************** WEAT 23 **************************************************
T1: traurig hoffnungslos düster tränenreich elend deprimiert
T2: krank krankheit verletzt grippe virus krebs
A1: unbeständig instabil variabel flüchtig kurzfristig kurz gelegentlich
A2: stabil immer konstante ausdauernd chronisch ausgedehnt ewig


ECT (↑): Corr 74.95% (p-Wert 0.00203)

BAT (↓): 50.00%

unable to import 'smart_open.gcs', disabling that module
Not in vocab:
Using T1: traurig hoffnungslos düster tränenreich elend deprimiert
Using T2: krank krankheit verletzt grippe virus krebs
Using A1: unbeständig instabil variabel flüchtig kurzfristig kurz gelegentlich
Using A2: stabil immer konstante ausdauernd chronisch ausgedehnt ewig
Computing p value - Number of possible permutations: 924.0
WEAT (↓): Corr 58.08% (p-Wert 0.1645, test statistic 0.0825)

kMEANS (↓): 83.33%

SVM:
Test 1: traurig hoffnungslos düster tränenreich elend deprimiert
Train 1 (generated): verwirrt schreit müde zornig furchtbar ängstlich aufgeregt nett neugierig wütend
Test 2: krank krankheit verletzt grippe virus krebs
Train 2 (generated): erkrankt tuberkulose demenz leukämie parkinson alzheimer unheilbar depressiv gesund seelisch
Number of train words: 20
SVM (↓): 98.33%

***** Evaluating SimLex/WordSim (benchmarks 0.2-0.3/0.5-0.6)
SimLex                : 0.217 (using 975 of 999 word pairs)
WordSim353            : 0.455 (using 344 of 350 word pairs)
WordSim353 Similarity : 0.524 (using 199 of 201 word pairs)
WordSim353 Relatedness: 0.361 (using 247 of 252 word pairs)
***** Evaluating syntactic & semantic features (benchmarks ~62% correct (34-87), ~76% top 10, coverage 68%)
unable to import 'smart_open.gcs', disabling that module
loading projection weights from ../../data/models/wiki/wiki_w2v_vectors.txt
loaded (854776, 300) matrix from ../../data/models/wiki/wiki_w2v_vectors.txt
precomputing L2-norms of word weight vectors
> EVALUATING SYNTACTIC FEATURES
nouns: SI/PL: 0.0% (0/0), 0.0% (0/0), 0.0% (0/500)
nouns: PL/SI: 0.0% (0/0), 0.0% (0/0), 0.0% (0/500)
adjectives: GR/KOM: 14.5% (68/470), 36.8% (173/470), 94.0% (470/500)
adjectives: KOM/GR: 6.6% (31/470), 27.9% (131/470), 94.0% (470/500)
adjectives: GR/SUP: 0.4% (1/268), 4.1% (11/268), 53.6% (268/500)
adjectives: SUP/GR: 1.5% (4/265), 4.9% (13/265), 53.0% (265/500)
adjectives: KOM/SUP: 3.1% (8/258), 14.0% (36/258), 51.6% (258/500)
adjectives: SUP/KOM: 2.1% (6/282), 10.3% (29/282), 56.4% (282/500)
verbs (pres): INF/1SP: 15.2% (76/500), 35.4% (177/500), 100.0% (500/500)
verbs (pres): 1SP/INF: 11.4% (57/500), 21.2% (106/500), 100.0% (500/500)
verbs (pres): INF/2PP: 38.8% (173/446), 50.7% (226/446), 89.2% (446/500)
verbs (pres): 2PP/INF: 36.3% (157/433), 51.7% (224/433), 86.6% (433/500)
verbs (pres): 1SP/2PP: 1.6% (7/437), 8.5% (37/437), 87.4% (437/500)
verbs (pres): 2PP/1SP: 9.6% (43/447), 19.9% (89/447), 89.4% (447/500)
verbs (past): INF/3SV: 27.0% (135/500), 59.6% (298/500), 100.0% (500/500)
verbs (past): 3SV/INF: 23.2% (116/500), 53.6% (268/500), 100.0% (500/500)
verbs (past): INF/3PV: 50.6% (253/500), 70.2% (351/500), 100.0% (500/500)
verbs (past): 3PV/INF: 37.4% (187/500), 53.0% (265/500), 100.0% (500/500)
verbs (past): 3SV/3PV: 76.0% (380/500), 88.8% (444/500), 100.0% (500/500)
verbs (past): 3PV/3SV: 66.2% (331/500), 79.8% (399/500), 100.0% (500/500)
total correct:  26.1% (2033/7776)
total top 10:   42.1% (3277/7776)
total coverage: 77.8% (7776/10000)
> EVALUATING SEMANTIC FEATURES
opposite correct:  35.3% (54/153)
opposite top 10:   59.5% (91/153)
opposite coverage: 51.0% (153/300)
best match correct:  100.0% (1/1)
best match top 10:   100.0% (1/1)
best match coverage: 0.2% (1/540)
doesn't fit correct:  0.0% (0/0)
doesn't fit coverage: 0.0% (0/110)
***** Evaluating on MUSE datasets
INFO - 08/01/20 20:59:56 - 0:00:00 - ============ Initialized logger ============
INFO - 08/01/20 20:59:56 - 0:00:00 - cuda: True
                                     dico_eval: default
                                     emb_dim: 300
                                     exp_id:
                                     exp_name: debug
                                     exp_path: /home/sj041/bachelorarbeit/Code/frameworks/MUSE/dumped/debug/cukp2cibmb
                                     max_vocab: 1000000
                                     normalize_embeddings:
                                     src_emb: ../../data/models/wiki/wiki_w2v_vectors.txt
                                     src_lang: de
                                     tgt_emb:
                                     tgt_lang:
                                     verbose: 2
INFO - 08/01/20 20:59:56 - 0:00:00 - The experiment will be stored in /home/sj041/bachelorarbeit/Code/frameworks/MUSE/dumped/debug/cukp2cibmb
INFO - 08/01/20 21:00:37 - 0:00:41 - Loaded 854775 pre-trained word embeddings.
INFO - 08/01/20 21:00:42 - 0:00:46 - ====================================================================
INFO - 08/01/20 21:00:42 - 0:00:46 -                        Dataset      Found     Not found          Rho
INFO - 08/01/20 21:00:42 - 0:00:46 - ====================================================================
INFO - 08/01/20 21:00:42 - 0:00:46 -                      DE_GUR350        292            58       0.3653
INFO - 08/01/20 21:00:42 - 0:00:46 -                  DE_SIMLEX-999        975            24       0.2175
INFO - 08/01/20 21:00:42 - 0:00:46 -                       DE_GUR65         65             0       0.4987
INFO - 08/01/20 21:00:42 - 0:00:46 -                       DE_ZG222        156            66       0.0849
INFO - 08/01/20 21:00:42 - 0:00:46 -                   DE_SEMEVAL17        408            38       0.5430
INFO - 08/01/20 21:00:42 - 0:00:46 -                      DE_WS-353        344             6       0.4553
INFO - 08/01/20 21:00:42 - 0:00:46 - ====================================================================
INFO - 08/01/20 21:00:42 - 0:00:46 - Monolingual source word similarity score average: 0.36076
***** Ähnlich zu
apfel           ist am ähnlichsten zu   birne           (0.884), äpfel           (0.853), pfirsich        (0.840)
mann            ist am ähnlichsten zu   frau            (0.608), hund            (0.530), polizist        (0.525)
frau            ist am ähnlichsten zu   ehefrau         (0.776), gattin          (0.727), mutter          (0.713)
er              ist am ähnlichsten zu   nebenbei        (0.661), angestellt      (0.609), heimatstadt     (0.602)
sie             ist am ähnlichsten zu   ihre            (0.587), letztere        (0.582), ihr             (0.566)
karriere        ist am ähnlichsten zu   laufbahn        (0.817), profikarriere   (0.775), spielerkarriere (0.751)
familie         ist am ähnlichsten zu   familien        (0.761), unterfamilie    (0.619), adelsfamilie    (0.590)
***** Analogien
deutschland        -> berlin
 ≈ frankreich      -> lille           (0.846), paris           (0.844), versailles      (0.826)
deutschland        -> merkel
 ≈ russland        -> putin           (1.015), wladimir        (0.994), wiktor          (0.982)
deutschland        -> deutsch
 ≈ schweden        -> schwedisch      (0.994), ungarisch       (0.956), polnisch        (0.945)
deutschland        -> euro
 ≈ großbritannien  -> dollar          (0.971), sterling        (0.890), pfund           (0.875)
mann               -> vater
 ≈ frau            -> mutter          (1.128), ehefrau         (1.128), tochter         (1.107)
mann               -> bruder
 ≈ frau            -> ehefrau         (1.125), tochter         (1.115), schwester       (1.113)
mann               -> kunde
 ≈ frau            -> verkäufer       (0.904), kauft           (0.896), käufer          (0.889)
mann               -> patient
 ≈ frau            -> patientin       (0.972), diagnose        (0.924), schwangerschaft (0.919)
mann               -> chef
 ≈ frau            -> ehefrau         (0.955), leiter          (0.934), direktor        (0.932)
mann               -> arzt
 ≈ frau            -> arztes          (0.971), ehefrau         (0.955), ärztin          (0.950)
frau               -> ärztin
 ≈ mann            -> tierarzt        (0.847), kinderarzt      (0.843), psychiaterin    (0.838)
mann               -> handwerker
 ≈ frau            -> fabrikanten     (0.933), wohlhabende     (0.929), kaufleute       (0.921)
mann               -> karriere
 ≈ frau            -> laufbahn        (0.946), heiratete       (0.911), verheiratet     (0.908)
frau               -> karriere
 ≈ mann            -> profikarriere   (0.893), laufbahn        (0.873), spielerkarriere (0.855)
frau               -> familie
 ≈ mann            -> familien        (0.781), ordnung         (0.715), stamm           (0.712)
mann               -> familie
 ≈ frau            -> ehefrau         (1.004), familien        (0.992), mutter          (0.949)
er                 -> wissenschaft
 ≈ sie             -> claudia         (0.826), wir             (0.813), innovation      (0.805)
sie                -> wissenschaft
 ≈ er              -> philosophie     (0.925), theorie         (0.921), ethik           (0.920)
