##############################################################################################################
# Running bias tests for model all_glove_w2v
##############################################################################################################

************************************************** WEAT 01 **************************************************
T1:aster klee hyazinthe ringelblume mohn azalee krokus iris orchidee rose glockenblume narzisse flieder stiefmütterchen tulpe butterblume gänseblümchen lilie pfingstrose veilchen nelke gladiole magnolie petunie
T2:ameise raupe floh heuschrecke spinne bettwanze tausendfüßler fliegen made tarantel biene kakerlake mücke moskito termite käfer grille hornisse motte wespe blattlaus libelle bremse rüsselkäfer
A1:streicheln freiheit gesundheit liebe frieden jubeln freund freundin himmel treu vergnügen diamant ehrlich glücklich regenbogen geschenk ehre wunder sonnenaufgang familie glück lachen paradies urlaub freude wunderbar
A2:missbrauch absturz schmutz mord krankheit unfall tod trauer vergiften stinken angriff katastrophe hass tragödie scheidung gefängnis armut hässlich krebs töten faul erbrechen qual furchtbar schrecklich böse


ECT (↑): Corr 65.14% (p-Wert 1.698e-07)

BAT (↓): 53.42%

unable to import 'smart_open.gcs', disabling that module
Not in vocab: gladiole petunie
Using T1: aster klee hyazinthe ringelblume mohn azalee krokus iris orchidee rose glockenblume narzisse flieder stiefmütterchen tulpe butterblume gänseblümchen lilie pfingstrose veilchen nelke magnolie
Using T2: ameise raupe floh heuschrecke spinne bettwanze tausendfüßler fliegen made tarantel biene kakerlake mücke moskito termite käfer grille hornisse motte wespe blattlaus libelle
Using A1: streicheln freiheit gesundheit liebe frieden jubeln freund freundin himmel treu vergnügen diamant ehrlich glücklich regenbogen geschenk ehre wunder sonnenaufgang familie glück lachen paradies urlaub freude wunderbar
Using A2: missbrauch absturz schmutz mord krankheit unfall tod trauer vergiften stinken angriff katastrophe hass tragödie scheidung gefängnis armut hässlich krebs töten faul erbrechen qual furchtbar schrecklich böse
Computing p value - Number of possible permutations: 2104098963720.0
Computing randomly first 100000  permutations
WEAT (↓): Corr 73.26% (p-Wert 0.00713, test statistic 0.5531)

kMEANS (↓): 72.00%

SVM:
Test 1: aster klee hyazinthe ringelblume mohn azalee krokus iris orchidee rose glockenblume narzisse flieder stiefmütterchen tulpe butterblume gänseblümchen lilie pfingstrose veilchen nelke gladiole magnolie petunie
Train 1 (generated): passionsblume rosen pfingstrosen blume tulpen vergissmeinnicht blühen lilien zierkirsche einbaumotor
Test 2: ameise raupe floh heuschrecke spinne bettwanze tausendfüßler fliegen made tarantel biene kakerlake mücke moskito termite käfer grille hornisse motte wespe blattlaus libelle bremse rüsselkäfer
Train 2 (generated): schildkröte eidechse eule raupen larven schmetterling spinnen fliege insekt 嵐 gestochen hummel
Number of train words: 22
SVM (↓): 92.83%


************************************************** WEAT 02 **************************************************
T1:dudelsack cello gitarre laute posaune banjo klarinette mundharmonika mandoline trompete fagott trommel harfe oboe tuba glocke geige cembalo klavier viola bongo flöte horn saxophon
T2:pfeil verein gewehr rakete speer axt dolch harpune pistole schwert klinge dynamit beil panzer bombe feuerwaffe messer schrotflinte tränengas kanone granate morgenstern schleuder peitsche
A1:streicheln freiheit gesundheit liebe frieden jubeln freund freundin himmel treu vergnügen diamant ehrlich glücklich regenbogen geschenk ehre wunder sonnenaufgang familie glück lachen paradies urlaub freude wunderbar
A2:missbrauch absturz schmutz mord krankheit unfall tod trauer vergiften stinken angriff katastrophe hass tragödie scheidung gefängnis armut hässlich krebs töten faul erbrechen qual furchtbar schrecklich böse


ECT (↑): Corr 40.01% (p-Wert 0.003297)

BAT (↓): 39.64%

unable to import 'smart_open.gcs', disabling that module
Not in vocab:
Using T1: dudelsack cello gitarre laute posaune banjo klarinette mundharmonika mandoline trompete fagott trommel harfe oboe tuba glocke geige cembalo klavier viola bongo flöte horn saxophon
Using T2: pfeil verein gewehr rakete speer axt dolch harpune pistole schwert klinge dynamit beil panzer bombe feuerwaffe messer schrotflinte tränengas kanone granate morgenstern schleuder peitsche
Using A1: streicheln freiheit gesundheit liebe frieden jubeln freund freundin himmel treu vergnügen diamant ehrlich glücklich regenbogen geschenk ehre wunder sonnenaufgang familie glück lachen paradies urlaub freude wunderbar
Using A2: missbrauch absturz schmutz mord krankheit unfall tod trauer vergiften stinken angriff katastrophe hass tragödie scheidung gefängnis armut hässlich krebs töten faul erbrechen qual furchtbar schrecklich böse
Computing p value - Number of possible permutations: 32247603683100.004
Computing randomly first 100000  permutations
WEAT (↓): Corr 96.04% (p-Wert 0.00034, test statistic 0.6761)

kMEANS (↓): 93.75%

SVM:
Test 1: dudelsack cello gitarre laute posaune banjo klarinette mundharmonika mandoline trompete fagott trommel harfe oboe tuba glocke geige cembalo klavier viola bongo flöte horn saxophon
Train 1 (generated): akkordeon zither violine kontrabass violoncello bratsche schlagzeug bass tenorsaxophon altsaxophon fiddle trompeten violinen
Test 2: pfeil verein gewehr rakete speer axt dolch harpune pistole schwert klinge dynamit beil panzer bombe feuerwaffe messer schrotflinte tränengas kanone granate morgenstern schleuder peitsche
Train 2 (generated): armbrust kugel schild waffe säbel revolver pistolen geschütz bewaffnet raketen lanze schlachtermesser machete kettensäge maschinenpistole geschütze explodierte sprengladung granaten
Number of train words: 32
SVM (↓): 93.75%


************************************************** WEAT 03 **************************************************
T1:deutsch deutsche deutschland europäisch weiß kaukasisch
T2:ausländer flüchtling flüchtlinge fremd schwarz dunkelhäutig
A1:streicheln freiheit gesundheit liebe frieden jubeln freund freundin himmel treu vergnügen diamant ehrlich glücklich regenbogen geschenk ehre wunder sonnenaufgang familie glück lachen paradies urlaub freude wunderbar
A2:missbrauch absturz schmutz mord krankheit unfall tod trauer vergiften stinken angriff katastrophe hass tragödie scheidung gefängnis armut hässlich krebs töten faul erbrechen qual furchtbar schrecklich böse


ECT (↑): Corr 80.88% (p-Wert 4.053e-13)

BAT (↓): 31.71%

unable to import 'smart_open.gcs', disabling that module
Not in vocab:
Using T1: deutsch deutsche deutschland europäisch weiß kaukasisch
Using T2: ausländer flüchtling flüchtlinge fremd schwarz dunkelhäutig
Using A1: streicheln freiheit gesundheit liebe frieden jubeln freund freundin himmel treu vergnügen diamant ehrlich glücklich regenbogen geschenk ehre wunder sonnenaufgang familie glück lachen paradies urlaub freude wunderbar
Using A2: missbrauch absturz schmutz mord krankheit unfall tod trauer vergiften stinken angriff katastrophe hass tragödie scheidung gefängnis armut hässlich krebs töten faul erbrechen qual furchtbar schrecklich böse
Computing p value - Number of possible permutations: 924.0
WEAT (↓): Corr 56.68% (p-Wert 0.1851, test statistic 0.1786)

kMEANS (↓): 58.00%

SVM:
Test 1: deutsch deutsche deutschland europäisch weiß kaukasisch
Train 1 (generated): deutschen englisch französisch spanisch italienisch türkisch sprache übersetzt japanisch russisch
Test 2: ausländer flüchtling flüchtlinge fremd schwarz dunkelhäutig
Train 2 (generated): migranten asylbewerber aufenthg ausländern ausländers bundesgebiet abschiebung einreise syrischer asyl
Number of train words: 20
SVM (↓): 74.58%


************************************************** WEAT 04 **************************************************
T1:ursula carin karin helga sabine ingrid renate monica monika susanne gisela petra birgit andrea anna brigitte claudia klaudia erica erika christa krista elke stefanie stephanie gertrud elisabeth elizabeth peter michael thomas andreas wolfgang claus klaus jürgen günter günther stefan stephan christian kristian uwe werner horst frank dieter manfred gerhard gerhardt hans bernd berndt bernt thorsten torsten mathias matthias helmut helmuth
T2:elif zeynep hiranur miray zehra ecrin azra eylül defne nehir yusuf eymen mustafa ömer berat miraç ayaz ahmet mehmet muhammed zuzanna lena julia maja zofia hanna amelia aleksandra alicja natalia jakub antoni szymon jan filip kacper aleksander franciszek mikołaj wojciech amena qamar haya ousa sandra rosarita reem aıscha maya hala akram abóòd hasan elias ali alex zak miran aimar burhan
A1:streicheln freiheit gesundheit liebe frieden jubeln freund freundin himmel treu vergnügen diamant ehrlich glücklich regenbogen geschenk ehre wunder sonnenaufgang familie glück lachen paradies urlaub freude wunderbar
A2:missbrauch absturz schmutz mord krankheit unfall tod trauer vergiften stinken angriff katastrophe hass tragödie scheidung gefängnis armut hässlich krebs töten faul erbrechen qual furchtbar schrecklich böse


ECT (↑): Corr 16.78% (p-Wert 0.2343)

BAT (↓): 40.51%

unable to import 'smart_open.gcs', disabling that module
Not in vocab: rosarita abóòd ecrin miraç ousa hiranur eymen aıscha
Using T1: ursula carin karin helga sabine ingrid renate monica monika susanne gisela petra birgit andrea anna brigitte claudia klaudia erica erika christa krista elke stefanie stephanie gertrud elisabeth elizabeth peter michael thomas andreas wolfgang claus klaus jürgen günter günther stefan stephan christian kristian uwe werner horst frank dieter manfred gerhard gerhardt hans bernd
Using T2: elif zeynep miray zehra azra eylül defne nehir yusuf mustafa ömer berat ayaz ahmet mehmet muhammed zuzanna lena julia maja zofia hanna amelia aleksandra alicja natalia jakub antoni szymon jan filip kacper aleksander franciszek mikołaj wojciech amena qamar haya sandra reem maya hala akram hasan elias ali alex zak miran aimar burhan
Using A1: streicheln freiheit gesundheit liebe frieden jubeln freund freundin himmel treu vergnügen diamant ehrlich glücklich regenbogen geschenk ehre wunder sonnenaufgang familie glück lachen paradies urlaub freude wunderbar
Using A2: missbrauch absturz schmutz mord krankheit unfall tod trauer vergiften stinken angriff katastrophe hass tragödie scheidung gefängnis armut hässlich krebs töten faul erbrechen qual furchtbar schrecklich böse
Computing p value - Number of possible permutations: 1.5830658481259492e+30
Computing randomly first 100000  permutations
WEAT (↓): Corr 109.13% (p-Wert 0.0, test statistic 1.766)

kMEANS (↓): 87.18%

SVM:
Test 1: ursula carin karin helga sabine ingrid renate monica monika susanne gisela petra birgit andrea anna brigitte claudia klaudia erica erika christa krista elke stefanie stephanie gertrud elisabeth elizabeth peter michael thomas andreas wolfgang claus klaus jürgen günter günther stefan stephan christian kristian uwe werner horst frank dieter manfred gerhard gerhardt hans bernd berndt bernt thorsten torsten mathias matthias helmut helmuth
Train 1 (generated): christine katharina barbara dagmar kerstin eva sandra anja sonja jutta doris tanja agnes martina heike dorothea johanna sophie marianne margarethe martin paul schneider müller david john robert patrick walter christoph schmidt georg markus weber ulrich heinz erwin hermann bernhard schmid sven hartmann johann philipp jens ralf karsten jörg willi schröder otto zimmermann krause björn
Test 2: elif zeynep hiranur miray zehra ecrin azra eylül defne nehir yusuf eymen mustafa ömer berat miraç ayaz ahmet mehmet muhammed zuzanna lena julia maja zofia hanna amelia aleksandra alicja natalia jakub antoni szymon jan filip kacper aleksander franciszek mikołaj wojciech amena qamar haya ousa sandra rosarita reem aıscha maya hala akram abóòd hasan elias ali alex zak miran aimar burhan
Train 2 (generated): bighit_exhibition ahmed muhammad pascha özkan altan mohammed mohammad sarah lisa nicole eva anna emma patočka jerzy józef krzysztof stanisław marcin michał tadeusz piotr
Number of train words: 77
SVM (↓): 90.18%


************************************************** WEAT 05 **************************************************
T1:deutsch deutsche deutschland europäisch weiß kaukasisch
T2:ausländer flüchtling flüchtlinge fremd schwarz dunkelhäutig
A1:gut positiv ehrlich ehrlichkeit rechtschaffen rechtschaffenheit gesetz recht frei unschuldig
A2:schlecht negativ unehrlich lügen kriminalität kriminell verbrechen straftat verurteilt schuldig


ECT (↑): Corr 69.17% (p-Wert 0.0007285)

BAT (↓): 49.22%

unable to import 'smart_open.gcs', disabling that module
Not in vocab:
Using T1: deutsch deutsche deutschland europäisch weiß kaukasisch
Using T2: ausländer flüchtling flüchtlinge fremd schwarz dunkelhäutig
Using A1: gut positiv ehrlich ehrlichkeit rechtschaffen rechtschaffenheit gesetz recht frei unschuldig
Using A2: schlecht negativ unehrlich lügen kriminalität kriminell verbrechen straftat verurteilt schuldig
Computing p value - Number of possible permutations: 924.0
WEAT (↓): Corr 91.28% (p-Wert 0.06494, test statistic 0.2701)

kMEANS (↓): 59.00%

SVM:
Test 1: deutsch deutsche deutschland europäisch weiß kaukasisch
Train 1 (generated): deutschen englisch französisch spanisch italienisch türkisch sprache übersetzt japanisch russisch
Test 2: ausländer flüchtling flüchtlinge fremd schwarz dunkelhäutig
Train 2 (generated): migranten asylbewerber aufenthg ausländern ausländers bundesgebiet abschiebung einreise syrischer asyl
Number of train words: 20
SVM (↓): 74.58%


************************************************** WEAT 06 **************************************************
T1:ursula carin karin helga sabine ingrid renate monica monika susanne gisela petra birgit andrea anna brigitte claudia klaudia erica erika christa krista elke stefanie stephanie gertrud elisabeth elizabeth peter michael thomas andreas wolfgang claus klaus jürgen günter günther stefan stephan christian kristian uwe werner horst frank dieter manfred gerhard gerhardt hans bernd berndt bernt thorsten torsten mathias matthias helmut helmuth
T2:elif zeynep hiranur miray zehra ecrin azra eylül defne nehir yusuf eymen mustafa ömer berat miraç ayaz ahmet mehmet muhammed zuzanna lena julia maja zofia hanna amelia aleksandra alicja natalia jakub antoni szymon jan filip kacper aleksander franciszek mikołaj wojciech amena qamar haya ousa sandra rosarita reem aıscha maya hala akram abóòd hasan elias ali alex zak miran aimar burhan
A1:gut positiv ehrlich ehrlichkeit rechtschaffen rechtschaffenheit gesetz recht frei unschuldig
A2:schlecht negativ unehrlich lügen kriminalität kriminell verbrechen straftat verurteilt schuldig


ECT (↑): Corr -39.25% (p-Wert 0.08696)

BAT (↓): 45.11%

unable to import 'smart_open.gcs', disabling that module
Not in vocab: eymen hiranur ousa ecrin aıscha rosarita abóòd miraç
Using T1: ursula carin karin helga sabine ingrid renate monica monika susanne gisela petra birgit andrea anna brigitte claudia klaudia erica erika christa krista elke stefanie stephanie gertrud elisabeth elizabeth peter michael thomas andreas wolfgang claus klaus jürgen günter günther stefan stephan christian kristian uwe werner horst frank dieter manfred gerhard gerhardt hans bernd
Using T2: elif zeynep miray zehra azra eylül defne nehir yusuf mustafa ömer berat ayaz ahmet mehmet muhammed zuzanna lena julia maja zofia hanna amelia aleksandra alicja natalia jakub antoni szymon jan filip kacper aleksander franciszek mikołaj wojciech amena qamar haya sandra reem maya hala akram hasan elias ali alex zak miran aimar burhan
Using A1: gut positiv ehrlich ehrlichkeit rechtschaffen rechtschaffenheit gesetz recht frei unschuldig
Using A2: schlecht negativ unehrlich lügen kriminalität kriminell verbrechen straftat verurteilt schuldig
Computing p value - Number of possible permutations: 1.5830658481259492e+30
Computing randomly first 100000  permutations
WEAT (↓): Corr 74.73% (p-Wert 9e-05, test statistic 1.038)

kMEANS (↓): 87.05%

SVM:
Test 1: ursula carin karin helga sabine ingrid renate monica monika susanne gisela petra birgit andrea anna brigitte claudia klaudia erica erika christa krista elke stefanie stephanie gertrud elisabeth elizabeth peter michael thomas andreas wolfgang claus klaus jürgen günter günther stefan stephan christian kristian uwe werner horst frank dieter manfred gerhard gerhardt hans bernd berndt bernt thorsten torsten mathias matthias helmut helmuth
Train 1 (generated): christine katharina barbara dagmar kerstin eva sandra anja sonja jutta doris tanja agnes martina heike dorothea johanna sophie marianne margarethe martin paul schneider müller david john robert patrick walter christoph schmidt georg markus weber ulrich heinz erwin hermann bernhard schmid sven hartmann johann philipp jens ralf karsten jörg willi schröder otto zimmermann krause björn
Test 2: elif zeynep hiranur miray zehra ecrin azra eylül defne nehir yusuf eymen mustafa ömer berat miraç ayaz ahmet mehmet muhammed zuzanna lena julia maja zofia hanna amelia aleksandra alicja natalia jakub antoni szymon jan filip kacper aleksander franciszek mikołaj wojciech amena qamar haya ousa sandra rosarita reem aıscha maya hala akram abóòd hasan elias ali alex zak miran aimar burhan
Train 2 (generated): bighit_exhibition ahmed muhammad pascha özkan altan mohammed mohammad sarah lisa nicole eva anna emma patočka jerzy józef krzysztof stanisław marcin michał tadeusz piotr
Number of train words: 77
SVM (↓): 90.18%


************************************************** WEAT 07 **************************************************
T1:jung modern frisch neu jugendlich jugend
T2:alt antik uralt vergangen vergangenheit historisch
A1:streicheln freiheit gesundheit liebe frieden jubeln freund freundin himmel treu vergnügen diamant ehrlich glücklich regenbogen geschenk ehre wunder sonnenaufgang familie glück lachen paradies urlaub freude wunderbar
A2:missbrauch absturz schmutz mord krankheit unfall tod trauer vergiften stinken angriff katastrophe hass tragödie scheidung gefängnis armut hässlich krebs töten faul erbrechen qual furchtbar schrecklich böse


ECT (↑): Corr 69.19% (p-Wert 1.345e-08)

BAT (↓): 51.90%

unable to import 'smart_open.gcs', disabling that module
Not in vocab:
Using T1: jung modern frisch neu jugendlich jugend
Using T2: alt antik uralt vergangen vergangenheit historisch
Using A1: streicheln freiheit gesundheit liebe frieden jubeln freund freundin himmel treu vergnügen diamant ehrlich glücklich regenbogen geschenk ehre wunder sonnenaufgang familie glück lachen paradies urlaub freude wunderbar
Using A2: missbrauch absturz schmutz mord krankheit unfall tod trauer vergiften stinken angriff katastrophe hass tragödie scheidung gefängnis armut hässlich krebs töten faul erbrechen qual furchtbar schrecklich böse
Computing p value - Number of possible permutations: 924.0
WEAT (↓): Corr 150.97% (p-Wert 0.002165, test statistic 0.3241)

kMEANS (↓): 58.00%

SVM:
Test 1: jung modern frisch neu jugendlich jugend
Train 1 (generated): alt klein hübsch junge bist jaechan sehr klug schlau geworden
Test 2: alt antik uralt vergangen vergangenheit historisch
Train 2 (generated): älter jung alter jahre geworden jahren groß bin schon alte
Number of train words: 20
SVM (↓): 50.42%


************************************************** WEAT 08 **************************************************
T1:julia stefanie stephanie anna katharina katarina catharina catarina katrin kathrin cathrin catrin sandra christian kristian sebastian jan daniel alexander sara sarah lisa laura lucas lukas philip philipp tim timm hannah hanna lea leah leonie lena lara leon luca
T2:helga ursula ingrid gisela christa krista inge hans günter günther horst klaus claus karl carl werner karin renate monika peter wolfgang jürgen dieter angelika sabine petra gabriele michael thomas tomas susanne andrea claudia birgit andreas frank torsten thorsten
A1:streicheln freiheit gesundheit liebe frieden jubeln freund freundin himmel treu vergnügen diamant ehrlich glücklich regenbogen geschenk ehre wunder sonnenaufgang familie glück lachen paradies urlaub freude wunderbar
A2:missbrauch absturz schmutz mord krankheit unfall tod trauer vergiften stinken angriff katastrophe hass tragödie scheidung gefängnis armut hässlich krebs töten faul erbrechen qual furchtbar schrecklich böse


ECT (↑): Corr 89.27% (p-Wert 6.182e-19)

BAT (↓): 39.62%

unable to import 'smart_open.gcs', disabling that module
Not in vocab:
Using T1: julia stefanie stephanie anna katharina katarina catharina catarina katrin kathrin cathrin catrin sandra christian kristian sebastian jan daniel alexander sara sarah lisa laura lucas lukas philip philipp tim timm hannah hanna lea leah leonie lena lara leon luca
Using T2: helga ursula ingrid gisela christa krista inge hans günter günther horst klaus claus karl carl werner karin renate monika peter wolfgang jürgen dieter angelika sabine petra gabriele michael thomas tomas susanne andrea claudia birgit andreas frank torsten thorsten
Using A1: streicheln freiheit gesundheit liebe frieden jubeln freund freundin himmel treu vergnügen diamant ehrlich glücklich regenbogen geschenk ehre wunder sonnenaufgang familie glück lachen paradies urlaub freude wunderbar
Using A2: missbrauch absturz schmutz mord krankheit unfall tod trauer vergiften stinken angriff katastrophe hass tragödie scheidung gefängnis armut hässlich krebs töten faul erbrechen qual furchtbar schrecklich böse
Computing p value - Number of possible permutations: 6.892620648693261e+21
Computing randomly first 100000  permutations
WEAT (↓): Corr -39.51% (p-Wert 0.9561, test statistic -0.3339)

kMEANS (↓): 60.58%

SVM:
Test 1: julia stefanie stephanie anna katharina katarina catharina catarina katrin kathrin cathrin catrin sandra christian kristian sebastian jan daniel alexander sara sarah lisa laura lucas lukas philip philipp tim timm hannah hanna lea leah leonie lena lara leon luca
Train 1 (generated): nicole eva claudia anja sabine jessica sophie tina anne elisabeth maria dorothea schwester johanna margaretha margarethe kerstin silke christoph johann friedrich karl andreas georg martin florian michael markus peter david james alex ruth jane emma gina rachel rebecca tanja ilona
Test 2: helga ursula ingrid gisela christa krista inge hans günter günther horst klaus claus karl carl werner karin renate monika peter wolfgang jürgen dieter angelika sabine petra gabriele michael thomas tomas susanne andrea claudia birgit andreas frank torsten thorsten
Train 2 (generated): erika eva christine katharina barbara dagmar elke sonja sandra jutta martina brigitte georg müller otto ulrich christoph rudolf heinrich heinz gerhard helmut hermann schmidt manfred bernd stefan schneider friedrich wilhelm ludwig franz kerstin doris martin paul uwe heike david john robert patrick walter ralf
Number of train words: 84
SVM (↓): 80.13%


************************************************** WEAT 09 **************************************************
T1:männlich mann junge bruder er ihm sein sohn vater onkel großvater opa cousin
T2:weiblich frau mädchen schwester sie ihr tochter mutter tante großmutter oma cousine nichte
A1:streicheln freiheit gesundheit liebe frieden jubeln freund freundin himmel treu vergnügen diamant ehrlich glücklich regenbogen geschenk ehre wunder sonnenaufgang familie glück lachen paradies urlaub freude wunderbar
A2:missbrauch absturz schmutz mord krankheit unfall tod trauer vergiften stinken angriff katastrophe hass tragödie scheidung gefängnis armut hässlich krebs töten faul erbrechen qual furchtbar schrecklich böse


ECT (↑): Corr 92.31% (p-Wert 2.162e-22)

BAT (↓): 32.98%

unable to import 'smart_open.gcs', disabling that module
Not in vocab:
Using T1: männlich mann junge bruder er ihm sein sohn vater onkel großvater opa cousin
Using T2: weiblich frau mädchen schwester sie ihr tochter mutter tante großmutter oma cousine nichte
Using A1: streicheln freiheit gesundheit liebe frieden jubeln freund freundin himmel treu vergnügen diamant ehrlich glücklich regenbogen geschenk ehre wunder sonnenaufgang familie glück lachen paradies urlaub freude wunderbar
Using A2: missbrauch absturz schmutz mord krankheit unfall tod trauer vergiften stinken angriff katastrophe hass tragödie scheidung gefängnis armut hässlich krebs töten faul erbrechen qual furchtbar schrecklich böse
Computing p value - Number of possible permutations: 10400600.0
Computing randomly first 100000  permutations
WEAT (↓): Corr -12.27% (p-Wert 0.6178, test statistic -0.04111)

kMEANS (↓): 54.38%

SVM:
Test 1: männlich mann junge bruder er ihm sein sohn vater onkel großvater opa cousin
Train 1 (generated): frau männer doch freund jungen schwager bruders neffe seiner ihn seinem enkel neffen schwiegervater
Test 2: weiblich frau mädchen schwester sie ihr tochter mutter tante großmutter oma cousine nichte
Train 2 (generated): ehefrau mann freundin frauen kind schwägerin enkelin witwe schwiegermutter großeltern
Number of train words: 24
SVM (↓): 80.96%


************************************************** WEAT 10 **************************************************
T1:peter michael thomas andreas wolfgang claus klaus jürgen günter günther stefan stephan christian kristian uwe werner horst frank dieter manfred gerhard gerhardt hans bernd berndt bernt thorsten torsten mathias matthias helmut helmuth walter walther heinz martin jörg joerg rolf jens sven swen alexander jan rainer reiner holger carl karl dirk joachim ralf ralph carsten karsten herbert oliver wilhelm curt kurt
T2:ursula carin karin helga sabine ingrid renate monica monika susanne gisela petra birgit andrea anna brigitte claudia klaudia erica erika christa krista elke stefanie stephanie gertrud elisabeth elizabeth maria angelika heike gabriele cathrin catrin kathrin katrin ilse nicole anja barbara hildegard martina ingeborg gerda marion jutta ute hannelore irmgard irmgart christine kristine inge christina kristina silvia sylvia margarete margarethe kerstin
A1:streicheln freiheit gesundheit liebe frieden jubeln freund freundin himmel treu vergnügen diamant ehrlich glücklich regenbogen geschenk ehre wunder sonnenaufgang familie glück lachen paradies urlaub freude wunderbar
A2:missbrauch absturz schmutz mord krankheit unfall tod trauer vergiften stinken angriff katastrophe hass tragödie scheidung gefängnis armut hässlich krebs töten faul erbrechen qual furchtbar schrecklich böse


ECT (↑): Corr 77.95% (p-Wert 9.93e-12)

BAT (↓): 30.08%

unable to import 'smart_open.gcs', disabling that module
Not in vocab: irmgart
Using T1: peter michael thomas andreas wolfgang claus klaus jürgen günter günther stefan stephan christian kristian uwe werner horst frank dieter manfred gerhard gerhardt hans bernd berndt bernt thorsten torsten mathias matthias helmut helmuth walter walther heinz martin jörg joerg rolf jens sven swen alexander jan rainer reiner holger carl karl dirk joachim ralf ralph carsten karsten herbert oliver wilhelm curt
Using T2: ursula carin karin helga sabine ingrid renate monica monika susanne gisela petra birgit andrea anna brigitte claudia klaudia erica erika christa krista elke stefanie stephanie gertrud elisabeth elizabeth maria angelika heike gabriele cathrin catrin kathrin katrin ilse nicole anja barbara hildegard martina ingeborg gerda marion jutta ute hannelore irmgard christine kristine inge christina kristina silvia sylvia margarete margarethe kerstin
Using A1: streicheln freiheit gesundheit liebe frieden jubeln freund freundin himmel treu vergnügen diamant ehrlich glücklich regenbogen geschenk ehre wunder sonnenaufgang familie glück lachen paradies urlaub freude wunderbar
Using A2: missbrauch absturz schmutz mord krankheit unfall tod trauer vergiften stinken angriff katastrophe hass tragödie scheidung gefängnis armut hässlich krebs töten faul erbrechen qual furchtbar schrecklich böse
Computing p value - Number of possible permutations: 2.4356699707654616e+34
Computing randomly first 100000  permutations
WEAT (↓): Corr 9.28% (p-Wert 0.3084, test statistic 0.1247)

kMEANS (↓): 96.97%

SVM:
Test 1: peter michael thomas andreas wolfgang claus klaus jürgen günter günther stefan stephan christian kristian uwe werner horst frank dieter manfred gerhard gerhardt hans bernd berndt bernt thorsten torsten mathias matthias helmut helmuth walter walther heinz martin jörg joerg rolf jens sven swen alexander jan rainer reiner holger carl karl dirk joachim ralf ralph carsten karsten herbert oliver wilhelm curt kurt
Train 1 (generated): paul schneider müller david john robert richard patrick henry william christoph schmidt georg markus johannes weber franz ulrich erwin hermann bernhard schmid hartmann johann friedrich philipp arne meyer willi schröder eberhard otto zimmermann krause rudolf heinrich björn schulz sascha ingo volker anton fritz hoffmann ludwig erich baumann lars wagner
Test 2: ursula carin karin helga sabine ingrid renate monica monika susanne gisela petra birgit andrea anna brigitte claudia klaudia erica erika christa krista elke stefanie stephanie gertrud elisabeth elizabeth maria angelika heike gabriele cathrin catrin kathrin katrin ilse nicole anja barbara hildegard martina ingeborg gerda marion jutta ute hannelore irmgard irmgart christine kristine inge christina kristina silvia sylvia margarete margarethe kerstin
Train 2 (generated): katharina dagmar eva sandra silke sonja doris tanja christiane bettina agnes britta dorothea johanna sophie catharina margaretha marianne ruth cornelia jessica tina hedwig mathilde luise marie magdalena sophia edith klara julia adelheid louise
Number of train words: 82
SVM (↓): 100.00%


************************************************** WEAT 11 **************************************************
T1:männlich mann junge bruder er ihm sein sohn vater onkel großvater opa cousin
T2:weiblich frau mädchen schwester sie ihr tochter mutter tante großmutter oma cousine nichte
A1:führungskraft verwaltung konzern gehalt büro geschäft karriere arbeit job
A2:zuhause eltern kinder familie cousins ehe hochzeit verwandtschaft erziehung


ECT (↑): Corr 89.47% (p-Wert 5.422e-07)

BAT (↓): 37.27%

unable to import 'smart_open.gcs', disabling that module
Not in vocab:
Using T1: männlich mann junge bruder er ihm sein sohn vater onkel großvater opa cousin
Using T2: weiblich frau mädchen schwester sie ihr tochter mutter tante großmutter oma cousine nichte
Using A1: führungskraft verwaltung konzern gehalt büro geschäft karriere arbeit job
Using A2: zuhause eltern kinder familie cousins ehe hochzeit verwandtschaft erziehung
Computing p value - Number of possible permutations: 10400600.0
Computing randomly first 100000  permutations
WEAT (↓): Corr 68.93% (p-Wert 0.04226, test statistic 0.948)

kMEANS (↓): 54.15%

SVM:
Test 1: männlich mann junge bruder er ihm sein sohn vater onkel großvater opa cousin
Train 1 (generated): frau männer doch freund jungen schwager bruders neffe seiner ihn seinem enkel neffen schwiegervater
Test 2: weiblich frau mädchen schwester sie ihr tochter mutter tante großmutter oma cousine nichte
Train 2 (generated): ehefrau mann freundin frauen kind schwägerin enkelin witwe schwiegermutter großeltern
Number of train words: 24
SVM (↓): 80.96%


************************************************** WEAT 12 **************************************************
T1:peter michael thomas andreas wolfgang claus klaus jürgen günter günther stefan stephan christian kristian uwe werner horst frank dieter manfred gerhard gerhardt hans bernd berndt bernt thorsten torsten mathias matthias helmut helmuth walter walther heinz martin jörg joerg rolf jens sven swen alexander jan rainer reiner holger carl karl dirk joachim ralf ralph carsten karsten herbert oliver wilhelm curt kurt
T2:ursula carin karin helga sabine ingrid renate monica monika susanne gisela petra birgit andrea anna brigitte claudia klaudia erica erika christa krista elke stefanie stephanie gertrud elisabeth elizabeth maria angelika heike gabriele cathrin catrin kathrin katrin ilse nicole anja barbara hildegard martina ingeborg gerda marion jutta ute hannelore irmgard irmgart christine kristine inge christina kristina silvia sylvia margarete margarethe kerstin
A1:führungskraft verwaltung konzern gehalt büro geschäft karriere arbeit job
A2:zuhause eltern kinder familie cousins ehe hochzeit verwandtschaft erziehung


ECT (↑): Corr 76.88% (p-Wert 0.0001926)

BAT (↓): 22.53%

unable to import 'smart_open.gcs', disabling that module
Not in vocab: irmgart
Using T1: peter michael thomas andreas wolfgang claus klaus jürgen günter günther stefan stephan christian kristian uwe werner horst frank dieter manfred gerhard gerhardt hans bernd berndt bernt thorsten torsten mathias matthias helmut helmuth walter walther heinz martin jörg joerg rolf jens sven swen alexander jan rainer reiner holger carl karl dirk joachim ralf ralph carsten karsten herbert oliver wilhelm curt
Using T2: ursula carin karin helga sabine ingrid renate monica monika susanne gisela petra birgit andrea anna brigitte claudia klaudia erica erika christa krista elke stefanie stephanie gertrud elisabeth elizabeth maria angelika heike gabriele cathrin catrin kathrin katrin ilse nicole anja barbara hildegard martina ingeborg gerda marion jutta ute hannelore irmgard christine kristine inge christina kristina silvia sylvia margarete margarethe kerstin
Using A1: führungskraft verwaltung konzern gehalt büro geschäft karriere arbeit job
Using A2: zuhause eltern kinder familie cousins ehe hochzeit verwandtschaft erziehung
Computing p value - Number of possible permutations: 2.4356699707654616e+34
Computing randomly first 100000  permutations
WEAT (↓): Corr 98.80% (p-Wert 0.0, test statistic 2.857)

kMEANS (↓): 97.03%

SVM:
Test 1: peter michael thomas andreas wolfgang claus klaus jürgen günter günther stefan stephan christian kristian uwe werner horst frank dieter manfred gerhard gerhardt hans bernd berndt bernt thorsten torsten mathias matthias helmut helmuth walter walther heinz martin jörg joerg rolf jens sven swen alexander jan rainer reiner holger carl karl dirk joachim ralf ralph carsten karsten herbert oliver wilhelm curt kurt
Train 1 (generated): paul schneider müller david john robert richard patrick henry william christoph schmidt georg markus johannes weber franz ulrich erwin hermann bernhard schmid hartmann johann friedrich philipp arne meyer willi schröder eberhard otto zimmermann krause rudolf heinrich björn schulz sascha ingo volker anton fritz hoffmann ludwig erich baumann lars wagner
Test 2: ursula carin karin helga sabine ingrid renate monica monika susanne gisela petra birgit andrea anna brigitte claudia klaudia erica erika christa krista elke stefanie stephanie gertrud elisabeth elizabeth maria angelika heike gabriele cathrin catrin kathrin katrin ilse nicole anja barbara hildegard martina ingeborg gerda marion jutta ute hannelore irmgard irmgart christine kristine inge christina kristina silvia sylvia margarete margarethe kerstin
Train 2 (generated): katharina dagmar eva sandra silke sonja doris tanja christiane bettina agnes britta dorothea johanna sophie catharina margaretha marianne ruth cornelia jessica tina hedwig mathilde luise marie magdalena sophia edith klara julia adelheid louise
Number of train words: 82
SVM (↓): 100.00%


************************************************** WEAT 13 **************************************************
T1:männlich mann junge bruder er ihm sein sohn vater onkel großvater opa cousin
T2:weiblich frau mädchen schwester sie ihr tochter mutter tante großmutter oma cousine nichte
A1:wissenschaft forschung technologie technik physik chemie mathematik algebra experiment astronomie
A2:poesie kunst tanz literatur roman symphonie theater skulptur tanzen kunstwerk


ECT (↑): Corr 85.11% (p-Wert 1.962e-06)

BAT (↓): 27.33%

unable to import 'smart_open.gcs', disabling that module
Not in vocab:
Using T1: männlich mann junge bruder er ihm sein sohn vater onkel großvater opa cousin
Using T2: weiblich frau mädchen schwester sie ihr tochter mutter tante großmutter oma cousine nichte
Using A1: wissenschaft forschung technologie technik physik chemie mathematik algebra experiment astronomie
Using A2: poesie kunst tanz literatur roman symphonie theater skulptur tanzen kunstwerk
Computing p value - Number of possible permutations: 10400600.0
Computing randomly first 100000  permutations
WEAT (↓): Corr 111.60% (p-Wert 0.00125, test statistic 0.5282)

kMEANS (↓): 54.38%

SVM:
Test 1: männlich mann junge bruder er ihm sein sohn vater onkel großvater opa cousin
Train 1 (generated): frau männer doch freund jungen schwager bruders neffe seiner ihn seinem enkel neffen schwiegervater
Test 2: weiblich frau mädchen schwester sie ihr tochter mutter tante großmutter oma cousine nichte
Train 2 (generated): ehefrau mann freundin frauen kind schwägerin enkelin witwe schwiegermutter großeltern
Number of train words: 24
SVM (↓): 80.96%


************************************************** WEAT 14 **************************************************
T1:peter michael thomas andreas wolfgang claus klaus jürgen günter günther stefan stephan christian kristian uwe werner horst frank dieter manfred gerhard gerhardt hans bernd berndt bernt thorsten torsten mathias matthias helmut helmuth walter walther heinz martin jörg joerg rolf jens sven swen alexander jan rainer reiner holger carl karl dirk joachim ralf ralph carsten karsten herbert oliver wilhelm curt kurt
T2:ursula carin karin helga sabine ingrid renate monica monika susanne gisela petra birgit andrea anna brigitte claudia klaudia erica erika christa krista elke stefanie stephanie gertrud elisabeth elizabeth maria angelika heike gabriele cathrin catrin kathrin katrin ilse nicole anja barbara hildegard martina ingeborg gerda marion jutta ute hannelore irmgard irmgart christine kristine inge christina kristina silvia sylvia margarete margarethe kerstin
A1:wissenschaft forschung technologie technik physik chemie mathematik algebra experiment astronomie
A2:poesie kunst tanz literatur roman symphonie theater skulptur tanzen kunstwerk


ECT (↑): Corr 55.04% (p-Wert 0.01192)

BAT (↓): 30.61%

unable to import 'smart_open.gcs', disabling that module
Not in vocab: irmgart
Using T1: peter michael thomas andreas wolfgang claus klaus jürgen günter günther stefan stephan christian kristian uwe werner horst frank dieter manfred gerhard gerhardt hans bernd berndt bernt thorsten torsten mathias matthias helmut helmuth walter walther heinz martin jörg joerg rolf jens sven swen alexander jan rainer reiner holger carl karl dirk joachim ralf ralph carsten karsten herbert oliver wilhelm curt
Using T2: ursula carin karin helga sabine ingrid renate monica monika susanne gisela petra birgit andrea anna brigitte claudia klaudia erica erika christa krista elke stefanie stephanie gertrud elisabeth elizabeth maria angelika heike gabriele cathrin catrin kathrin katrin ilse nicole anja barbara hildegard martina ingeborg gerda marion jutta ute hannelore irmgard christine kristine inge christina kristina silvia sylvia margarete margarethe kerstin
Using A1: wissenschaft forschung technologie technik physik chemie mathematik algebra experiment astronomie
Using A2: poesie kunst tanz literatur roman symphonie theater skulptur tanzen kunstwerk
Computing p value - Number of possible permutations: 2.4356699707654616e+34
Computing randomly first 100000  permutations
WEAT (↓): Corr 94.74% (p-Wert 0.0, test statistic 1.928)

kMEANS (↓): 96.92%

SVM:
Test 1: peter michael thomas andreas wolfgang claus klaus jürgen günter günther stefan stephan christian kristian uwe werner horst frank dieter manfred gerhard gerhardt hans bernd berndt bernt thorsten torsten mathias matthias helmut helmuth walter walther heinz martin jörg joerg rolf jens sven swen alexander jan rainer reiner holger carl karl dirk joachim ralf ralph carsten karsten herbert oliver wilhelm curt kurt
Train 1 (generated): paul schneider müller david john robert richard patrick henry william christoph schmidt georg markus johannes weber franz ulrich erwin hermann bernhard schmid hartmann johann friedrich philipp arne meyer willi schröder eberhard otto zimmermann krause rudolf heinrich björn schulz sascha ingo volker anton fritz hoffmann ludwig erich baumann lars wagner
Test 2: ursula carin karin helga sabine ingrid renate monica monika susanne gisela petra birgit andrea anna brigitte claudia klaudia erica erika christa krista elke stefanie stephanie gertrud elisabeth elizabeth maria angelika heike gabriele cathrin catrin kathrin katrin ilse nicole anja barbara hildegard martina ingeborg gerda marion jutta ute hannelore irmgard irmgart christine kristine inge christina kristina silvia sylvia margarete margarethe kerstin
Train 2 (generated): katharina dagmar eva sandra silke sonja doris tanja christiane bettina agnes britta dorothea johanna sophie catharina margaretha marianne ruth cornelia jessica tina hedwig mathilde luise marie magdalena sophia edith klara julia adelheid louise
Number of train words: 82
SVM (↓): 100.00%


************************************************** WEAT 15 **************************************************
T1:männlich mann junge bruder er ihm sein sohn vater onkel großvater opa cousin
T2:weiblich frau mädchen schwester sie ihr tochter mutter tante großmutter oma cousine nichte
A1:handwerker handwerkerin wissenschaftler wissenschaftlerin programmierer programmiererin arzt ärztin chef chefin manager managerin politiker politikerin ingenieur ingenieurin bänker bänkerin pilot pilotin
A2:lehrer lehrerin krankenpfleger krankenpflegerin altenpfleger altenpflegerin erzieher erzieherin friseur friseurin sekretär sekretärin hebamme entbindungspfleger kosmetiker kosmetikerin flugbegleiter flugbegleiterin kaufmann kauffrau


ECT (↑): Corr 62.91% (p-Wert 1.786e-05)

BAT (↓): 48.12%

unable to import 'smart_open.gcs', disabling that module
Not in vocab: bänkerin
Using T1: männlich mann junge bruder er ihm sein sohn vater onkel großvater opa cousin
Using T2: weiblich frau mädchen schwester sie ihr tochter mutter tante großmutter oma cousine nichte
Using A1: handwerker handwerkerin wissenschaftler wissenschaftlerin programmierer programmiererin arzt ärztin chef chefin manager managerin politiker politikerin ingenieur ingenieurin bänker pilot pilotin
Using A2: lehrer lehrerin krankenpfleger krankenpflegerin altenpfleger altenpflegerin erzieher erzieherin friseur friseurin sekretär sekretärin hebamme entbindungspfleger kosmetiker kosmetikerin flugbegleiter flugbegleiterin kaufmann
Computing p value - Number of possible permutations: 10400600.0
Computing randomly first 100000  permutations
WEAT (↓): Corr 92.54% (p-Wert 0.00925, test statistic 0.5091)

kMEANS (↓): 54.46%

SVM:
Test 1: männlich mann junge bruder er ihm sein sohn vater onkel großvater opa cousin
Train 1 (generated): frau männer doch freund jungen schwager bruders neffe seiner ihn seinem enkel neffen schwiegervater
Test 2: weiblich frau mädchen schwester sie ihr tochter mutter tante großmutter oma cousine nichte
Train 2 (generated): ehefrau mann freundin frauen kind schwägerin enkelin witwe schwiegermutter großeltern
Number of train words: 24
SVM (↓): 80.96%


************************************************** WEAT 16 **************************************************
T1:peter michael thomas andreas wolfgang claus klaus jürgen günter günther stefan stephan christian kristian uwe werner horst frank dieter manfred gerhard gerhardt hans bernd berndt bernt thorsten torsten mathias matthias helmut helmuth walter walther heinz martin jörg joerg rolf jens sven swen alexander jan rainer reiner holger carl karl dirk joachim ralf ralph carsten karsten herbert oliver wilhelm curt kurt
T2:ursula carin karin helga sabine ingrid renate monica monika susanne gisela petra birgit andrea anna brigitte claudia klaudia erica erika christa krista elke stefanie stephanie gertrud elisabeth elizabeth maria angelika heike gabriele cathrin catrin kathrin katrin ilse nicole anja barbara hildegard martina ingeborg gerda marion jutta ute hannelore irmgard irmgart christine kristine inge christina kristina silvia sylvia margarete margarethe kerstin
A1:handwerker handwerkerin wissenschaftler wissenschaftlerin programmierer programmiererin arzt ärztin chef chefin manager managerin politiker politikerin ingenieur ingenieurin bänker bänkerin pilot pilotin
A2:lehrer lehrerin krankenpfleger krankenpflegerin altenpfleger altenpflegerin erzieher erzieherin friseur friseurin sekretär sekretärin hebamme entbindungspfleger kosmetiker kosmetikerin flugbegleiter flugbegleiterin kaufmann kauffrau


ECT (↑): Corr 1.03% (p-Wert 0.9503)

BAT (↓): 56.33%

unable to import 'smart_open.gcs', disabling that module
Not in vocab: irmgart bänkerin
Using T1: peter michael thomas andreas wolfgang claus klaus jürgen günter günther stefan stephan christian kristian uwe werner horst frank dieter manfred gerhard gerhardt hans bernd berndt bernt thorsten torsten mathias matthias helmut helmuth walter walther heinz martin jörg joerg rolf jens sven swen alexander jan rainer reiner holger carl karl dirk joachim ralf ralph carsten karsten herbert oliver wilhelm curt
Using T2: ursula carin karin helga sabine ingrid renate monica monika susanne gisela petra birgit andrea anna brigitte claudia klaudia erica erika christa krista elke stefanie stephanie gertrud elisabeth elizabeth maria angelika heike gabriele cathrin catrin kathrin katrin ilse nicole anja barbara hildegard martina ingeborg gerda marion jutta ute hannelore irmgard christine kristine inge christina kristina silvia sylvia margarete margarethe kerstin
Using A1: handwerker handwerkerin wissenschaftler wissenschaftlerin programmierer programmiererin arzt ärztin chef chefin manager managerin politiker politikerin ingenieur ingenieurin bänker pilot pilotin
Using A2: lehrer lehrerin krankenpfleger krankenpflegerin altenpfleger altenpflegerin erzieher erzieherin friseur friseurin sekretär sekretärin hebamme entbindungspfleger kosmetiker kosmetikerin flugbegleiter flugbegleiterin kaufmann
Computing p value - Number of possible permutations: 2.4356699707654616e+34
Computing randomly first 100000  permutations
WEAT (↓): Corr 143.10% (p-Wert 0.0, test statistic 3.102)

kMEANS (↓): 97.26%

SVM:
Test 1: peter michael thomas andreas wolfgang claus klaus jürgen günter günther stefan stephan christian kristian uwe werner horst frank dieter manfred gerhard gerhardt hans bernd berndt bernt thorsten torsten mathias matthias helmut helmuth walter walther heinz martin jörg joerg rolf jens sven swen alexander jan rainer reiner holger carl karl dirk joachim ralf ralph carsten karsten herbert oliver wilhelm curt kurt
Train 1 (generated): paul schneider müller david john robert richard patrick henry william christoph schmidt georg markus johannes weber franz ulrich erwin hermann bernhard schmid hartmann johann friedrich philipp arne meyer willi schröder eberhard otto zimmermann krause rudolf heinrich björn schulz sascha ingo volker anton fritz hoffmann ludwig erich baumann lars wagner
Test 2: ursula carin karin helga sabine ingrid renate monica monika susanne gisela petra birgit andrea anna brigitte claudia klaudia erica erika christa krista elke stefanie stephanie gertrud elisabeth elizabeth maria angelika heike gabriele cathrin catrin kathrin katrin ilse nicole anja barbara hildegard martina ingeborg gerda marion jutta ute hannelore irmgard irmgart christine kristine inge christina kristina silvia sylvia margarete margarethe kerstin
Train 2 (generated): katharina dagmar eva sandra silke sonja doris tanja christiane bettina agnes britta dorothea johanna sophie catharina margaretha marianne ruth cornelia jessica tina hedwig mathilde luise marie magdalena sophia edith klara julia adelheid louise
Number of train words: 82
SVM (↓): 100.00%


************************************************** WEAT 17 **************************************************
T1:führungskraft verwaltung konzern gehalt büro geschäft karriere arbeit job
T2:zuhause eltern kinder familie cousins ehe hochzeit verwandtschaft erziehung
A1:männlich mann junge bruder er ihm sein sohn vater onkel großvater opa cousin
A2:weiblich frau mädchen schwester sie ihr tochter mutter tante großmutter oma cousine nichte


ECT (↑): Corr 6.53% (p-Wert 0.7513)

BAT (↓): 47.34%

unable to import 'smart_open.gcs', disabling that module
Not in vocab:
Using T1: führungskraft verwaltung konzern gehalt büro geschäft karriere arbeit job
Using T2: zuhause eltern kinder familie cousins ehe hochzeit verwandtschaft erziehung
Using A1: männlich mann junge bruder er ihm sein sohn vater onkel großvater opa cousin
Using A2: weiblich frau mädchen schwester sie ihr tochter mutter tante großmutter oma cousine nichte
Computing p value - Number of possible permutations: 48620.0
WEAT (↓): Corr 154.07% (p-Wert 0.0001645, test statistic 0.6563)

kMEANS (↓): 95.22%

SVM:
Test 1: führungskraft verwaltung konzern gehalt büro geschäft karriere arbeit job
Train 1 (generated): unternehmen firma seine führungskräfte kbv pbc-ziele pbc festgelegten vereinbarten vorgesetzte
Test 2: zuhause eltern kinder familie cousins ehe hochzeit verwandtschaft erziehung
Train 2 (generated): mutter kindern vater geschwister kind tochter töchter verwandten heirat beziehung
Number of train words: 20
SVM (↓): 100.00%


************************************************** WEAT 18 **************************************************
T1:führungskraft verwaltung konzern gehalt büro geschäft karriere arbeit job
T2:zuhause eltern kinder familie cousins ehe hochzeit verwandtschaft erziehung
A1:peter michael thomas andreas wolfgang claus klaus jürgen günter günther stefan stephan christian kristian uwe werner horst frank dieter manfred gerhard gerhardt hans bernd berndt bernt thorsten torsten mathias matthias helmut helmuth walter walther heinz martin jörg joerg rolf jens sven swen alexander jan rainer reiner holger carl karl dirk joachim ralf ralph carsten karsten herbert oliver wilhelm curt kurt
A2:ursula carin karin helga sabine ingrid renate monica monika susanne gisela petra birgit andrea anna brigitte claudia klaudia erica erika christa krista elke stefanie stephanie gertrud elisabeth elizabeth maria angelika heike gabriele cathrin catrin kathrin katrin ilse nicole anja barbara hildegard martina ingeborg gerda marion jutta ute hannelore irmgard irmgart christine kristine inge christina kristina silvia sylvia margarete margarethe kerstin


ECT (↑): Corr 71.66% (p-Wert 5.032e-20)

BAT (↓): 32.60%

unable to import 'smart_open.gcs', disabling that module
Not in vocab: irmgart
Using T1: führungskraft verwaltung konzern gehalt büro geschäft karriere arbeit job
Using T2: zuhause eltern kinder familie cousins ehe hochzeit verwandtschaft erziehung
Using A1: peter michael thomas andreas wolfgang claus klaus jürgen günter günther stefan stephan christian kristian uwe werner horst frank dieter manfred gerhard gerhardt hans bernd berndt bernt thorsten torsten mathias matthias helmut helmuth walter walther heinz martin jörg joerg rolf jens sven swen alexander jan rainer reiner holger carl karl dirk joachim ralf ralph carsten karsten herbert oliver wilhelm curt
Using A2: ursula carin karin helga sabine ingrid renate monica monika susanne gisela petra birgit andrea anna brigitte claudia klaudia erica erika christa krista elke stefanie stephanie gertrud elisabeth elizabeth maria angelika heike gabriele cathrin catrin kathrin katrin ilse nicole anja barbara hildegard martina ingeborg gerda marion jutta ute hannelore irmgard christine kristine inge christina kristina silvia sylvia margarete margarethe kerstin
Computing p value - Number of possible permutations: 48620.0
WEAT (↓): Corr 117.28% (p-Wert 0.005965, test statistic 0.4359)

kMEANS (↓): 93.67%

SVM:
Test 1: führungskraft verwaltung konzern gehalt büro geschäft karriere arbeit job
Train 1 (generated): unternehmen firma seine führungskräfte kbv pbc-ziele pbc festgelegten vereinbarten vorgesetzte
Test 2: zuhause eltern kinder familie cousins ehe hochzeit verwandtschaft erziehung
Train 2 (generated): mutter kindern vater geschwister kind tochter töchter verwandten heirat beziehung
Number of train words: 20
SVM (↓): 100.00%


************************************************** WEAT 19 **************************************************
T1:wissenschaft forschung technologie technik physik chemie mathematik algebra experiment astronomie
T2:poesie kunst tanz literatur roman symphonie theater skulptur tanzen kunstwerk
A1:männlich mann junge bruder er ihm sein sohn vater onkel großvater opa cousin
A2:weiblich frau mädchen schwester sie ihr tochter mutter tante großmutter oma cousine nichte


ECT (↑): Corr 87.56% (p-Wert 4.757e-09)

BAT (↓): 42.23%

unable to import 'smart_open.gcs', disabling that module
Not in vocab:
Using T1: wissenschaft forschung technologie technik physik chemie mathematik algebra experiment astronomie
Using T2: poesie kunst tanz literatur roman symphonie theater skulptur tanzen kunstwerk
Using A1: männlich mann junge bruder er ihm sein sohn vater onkel großvater opa cousin
Using A2: weiblich frau mädchen schwester sie ihr tochter mutter tante großmutter oma cousine nichte
Computing p value - Number of possible permutations: 184756.0
Computing randomly first 100000  permutations
WEAT (↓): Corr 127.02% (p-Wert 0.00134, test statistic 0.4063)

kMEANS (↓): 90.30%

SVM:
Test 1: wissenschaft forschung technologie technik physik chemie mathematik algebra experiment astronomie
Train 1 (generated): wissenschaftlichen wissenschaftliche wirtschaft entwicklung technologien biologie mechanik informatik naturwissenschaften geographie astrophysik mathematischen
Test 2: poesie kunst tanz literatur roman symphonie theater skulptur tanzen kunstwerk
Train 2 (generated): lyrik malerei musik schauspiel tanzt künstlers gemälde prosa dichtung ästhetik
Number of train words: 22
SVM (↓): 100.00%


************************************************** WEAT 20 **************************************************
T1:wissenschaft forschung technologie technik physik chemie mathematik algebra experiment astronomie
T2:poesie kunst tanz literatur roman symphonie theater skulptur tanzen kunstwerk
A1:peter michael thomas andreas wolfgang claus klaus jürgen günter günther stefan stephan christian kristian uwe werner horst frank dieter manfred gerhard gerhardt hans bernd berndt bernt thorsten torsten mathias matthias helmut helmuth walter walther heinz martin jörg joerg rolf jens sven swen alexander jan rainer reiner holger carl karl dirk joachim ralf ralph carsten karsten herbert oliver wilhelm curt kurt
A2:ursula carin karin helga sabine ingrid renate monica monika susanne gisela petra birgit andrea anna brigitte claudia klaudia erica erika christa krista elke stefanie stephanie gertrud elisabeth elizabeth maria angelika heike gabriele cathrin catrin kathrin katrin ilse nicole anja barbara hildegard martina ingeborg gerda marion jutta ute hannelore irmgard irmgart christine kristine inge christina kristina silvia sylvia margarete margarethe kerstin


ECT (↑): Corr 83.39% (p-Wert 5.566e-32)

BAT (↓): 20.50%

unable to import 'smart_open.gcs', disabling that module
Not in vocab: irmgart
Using T1: wissenschaft forschung technologie technik physik chemie mathematik algebra experiment astronomie
Using T2: poesie kunst tanz literatur roman symphonie theater skulptur tanzen kunstwerk
Using A1: peter michael thomas andreas wolfgang claus klaus jürgen günter günther stefan stephan christian kristian uwe werner horst frank dieter manfred gerhard gerhardt hans bernd berndt bernt thorsten torsten mathias matthias helmut helmuth walter walther heinz martin jörg joerg rolf jens sven swen alexander jan rainer reiner holger carl karl dirk joachim ralf ralph carsten karsten herbert oliver wilhelm curt
Using A2: ursula carin karin helga sabine ingrid renate monica monika susanne gisela petra birgit andrea anna brigitte claudia klaudia erica erika christa krista elke stefanie stephanie gertrud elisabeth elizabeth maria angelika heike gabriele cathrin catrin kathrin katrin ilse nicole anja barbara hildegard martina ingeborg gerda marion jutta ute hannelore irmgard christine kristine inge christina kristina silvia sylvia margarete margarethe kerstin
Computing p value - Number of possible permutations: 184756.0
Computing randomly first 100000  permutations
WEAT (↓): Corr 89.31% (p-Wert 0.02418, test statistic 0.3268)

kMEANS (↓): 88.80%

SVM:
Test 1: wissenschaft forschung technologie technik physik chemie mathematik algebra experiment astronomie
Train 1 (generated): wissenschaftlichen wissenschaftliche wirtschaft entwicklung technologien biologie mechanik informatik naturwissenschaften geographie astrophysik mathematischen
Test 2: poesie kunst tanz literatur roman symphonie theater skulptur tanzen kunstwerk
Train 2 (generated): lyrik malerei musik schauspiel tanzt künstlers gemälde prosa dichtung ästhetik
Number of train words: 22
SVM (↓): 100.00%


************************************************** WEAT 21 **************************************************
T1:handwerker handwerkerin wissenschaftler wissenschaftlerin programmierer programmiererin arzt ärztin chef chefin manager managerin politiker politikerin ingenieur ingenieurin bänker bänkerin pilot pilotin
T2:lehrer lehrerin krankenpfleger krankenpflegerin altenpfleger altenpflegerin erzieher erzieherin friseur friseurin sekretär sekretärin hebamme entbindungspfleger kosmetiker kosmetikerin flugbegleiter flugbegleiterin kaufmann kauffrau
A1:männlich mann junge bruder er ihm sein sohn vater onkel großvater opa cousin
A2:weiblich frau mädchen schwester sie ihr tochter mutter tante großmutter oma cousine nichte


ECT (↑): Corr 48.24% (p-Wert 0.01257)

BAT (↓): 31.02%

unable to import 'smart_open.gcs', disabling that module
Not in vocab: bänkerin
Using T1: handwerker handwerkerin wissenschaftler wissenschaftlerin programmierer programmiererin arzt ärztin chef chefin manager managerin politiker politikerin ingenieur ingenieurin bänker pilot pilotin
Using T2: lehrer lehrerin krankenpfleger krankenpflegerin altenpfleger altenpflegerin erzieher erzieherin friseur friseurin sekretär sekretärin hebamme entbindungspfleger kosmetiker kosmetikerin flugbegleiter flugbegleiterin kaufmann
Using A1: männlich mann junge bruder er ihm sein sohn vater onkel großvater opa cousin
Using A2: weiblich frau mädchen schwester sie ihr tochter mutter tante großmutter oma cousine nichte
Computing p value - Number of possible permutations: 35345263800.0
Computing randomly first 100000  permutations
WEAT (↓): Corr 35.56% (p-Wert 0.1413, test statistic 0.744)

kMEANS (↓): 64.56%

SVM:
Test 1: handwerker handwerkerin wissenschaftler wissenschaftlerin programmierer programmiererin arzt ärztin chef chefin manager managerin politiker politikerin ingenieur ingenieurin bänker bänkerin pilot pilotin
Train 1 (generated): ingenieure physiker mediziner juristin journalistin psychologin chemikerin konstrukteur modezeichnerin kollegin lehrerin ceo trainerin partei pädagogin
Test 2: lehrer lehrerin krankenpfleger krankenpflegerin altenpfleger altenpflegerin erzieher erzieherin friseur friseurin sekretär sekretärin hebamme entbindungspfleger kosmetiker kosmetikerin flugbegleiter flugbegleiterin kaufmann kauffrau
Train 2 (generated): lehrkräfte krankenschwester ärztin krankenschwestern kinderkrankenpfleger gesundheits- pflegekräfte hebammen pfleger schneiderin sozialarbeiterin krankengymnastin examinierte arzthelferin friseure zahnärztin apothekerin industriekauffrau
Number of train words: 33
SVM (↓): 71.79%


************************************************** WEAT 22 **************************************************
T1:handwerker handwerkerin wissenschaftler wissenschaftlerin programmierer programmiererin arzt ärztin chef chefin manager managerin politiker politikerin ingenieur ingenieurin bänker bänkerin pilot pilotin
T2:lehrer lehrerin krankenpfleger krankenpflegerin altenpfleger altenpflegerin erzieher erzieherin friseur friseurin sekretär sekretärin hebamme entbindungspfleger kosmetiker kosmetikerin flugbegleiter flugbegleiterin kaufmann kauffrau
A1:peter michael thomas andreas wolfgang claus klaus jürgen günter günther stefan stephan christian kristian uwe werner horst frank dieter manfred gerhard gerhardt hans bernd berndt bernt thorsten torsten mathias matthias helmut helmuth walter walther heinz martin jörg joerg rolf jens sven swen alexander jan rainer reiner holger carl karl dirk joachim ralf ralph carsten karsten herbert oliver wilhelm curt kurt
A2:ursula carin karin helga sabine ingrid renate monica monika susanne gisela petra birgit andrea anna brigitte claudia klaudia erica erika christa krista elke stefanie stephanie gertrud elisabeth elizabeth maria angelika heike gabriele cathrin catrin kathrin katrin ilse nicole anja barbara hildegard martina ingeborg gerda marion jutta ute hannelore irmgard irmgart christine kristine inge christina kristina silvia sylvia margarete margarethe kerstin


ECT (↑): Corr 20.55% (p-Wert 0.02498)

BAT (↓): 18.26%

unable to import 'smart_open.gcs', disabling that module
Not in vocab: irmgart bänkerin
Using T1: handwerker handwerkerin wissenschaftler wissenschaftlerin programmierer programmiererin arzt ärztin chef chefin manager managerin politiker politikerin ingenieur ingenieurin bänker pilot pilotin
Using T2: lehrer lehrerin krankenpfleger krankenpflegerin altenpfleger altenpflegerin erzieher erzieherin friseur friseurin sekretär sekretärin hebamme entbindungspfleger kosmetiker kosmetikerin flugbegleiter flugbegleiterin kaufmann
Using A1: peter michael thomas andreas wolfgang claus klaus jürgen günter günther stefan stephan christian kristian uwe werner horst frank dieter manfred gerhard gerhardt hans bernd berndt bernt thorsten torsten mathias matthias helmut helmuth walter walther heinz martin jörg joerg rolf jens sven swen alexander jan rainer reiner holger carl karl dirk joachim ralf ralph carsten karsten herbert oliver wilhelm curt
Using A2: ursula carin karin helga sabine ingrid renate monica monika susanne gisela petra birgit andrea anna brigitte claudia klaudia erica erika christa krista elke stefanie stephanie gertrud elisabeth elizabeth maria angelika heike gabriele cathrin catrin kathrin katrin ilse nicole anja barbara hildegard martina ingeborg gerda marion jutta ute hannelore irmgard christine kristine inge christina kristina silvia sylvia margarete margarethe kerstin
Computing p value - Number of possible permutations: 35345263800.0
Computing randomly first 100000  permutations
WEAT (↓): Corr 41.93% (p-Wert 0.1026, test statistic 0.9991)

kMEANS (↓): 65.85%

SVM:
Test 1: handwerker handwerkerin wissenschaftler wissenschaftlerin programmierer programmiererin arzt ärztin chef chefin manager managerin politiker politikerin ingenieur ingenieurin bänker bänkerin pilot pilotin
Train 1 (generated): ingenieure physiker mediziner juristin journalistin psychologin chemikerin konstrukteur modezeichnerin kollegin lehrerin ceo trainerin partei pädagogin
Test 2: lehrer lehrerin krankenpfleger krankenpflegerin altenpfleger altenpflegerin erzieher erzieherin friseur friseurin sekretär sekretärin hebamme entbindungspfleger kosmetiker kosmetikerin flugbegleiter flugbegleiterin kaufmann kauffrau
Train 2 (generated): lehrkräfte krankenschwester ärztin krankenschwestern kinderkrankenpfleger gesundheits- pflegekräfte hebammen pfleger schneiderin sozialarbeiterin krankengymnastin examinierte arzthelferin friseure zahnärztin apothekerin industriekauffrau
Number of train words: 33
SVM (↓): 71.79%


************************************************** WEAT 23 **************************************************
T1:traurig hoffnungslos düster tränenreich elend deprimiert
T2:krank krankheit verletzt grippe virus krebs
A1:unbeständig instabil variabel flüchtig kurzfristig kurz gelegentlich
A2:stabil immer konstante ausdauernd chronisch ausgedehnt ewig


ECT (↑): Corr 50.33% (p-Wert 0.06656)

BAT (↓): 54.08%

unable to import 'smart_open.gcs', disabling that module
Not in vocab:
Using T1: traurig hoffnungslos düster tränenreich elend deprimiert
Using T2: krank krankheit verletzt grippe virus krebs
Using A1: unbeständig instabil variabel flüchtig kurzfristig kurz gelegentlich
Using A2: stabil immer konstante ausdauernd chronisch ausgedehnt ewig
Computing p value - Number of possible permutations: 924.0
WEAT (↓): Corr 23.33% (p-Wert 0.3582, test statistic 0.0534)

kMEANS (↓): 97.17%

SVM:
Test 1: traurig hoffnungslos düster tränenreich elend deprimiert
Train 1 (generated): wütend schrecklich schlimm unglaublich unfassbar furchtbar peinlich ehrlich echt lustig
Test 2: krank krankheit verletzt grippe virus krebs
Train 2 (generated): erkrankt krankheiten depressionen epidemie corona pandemie infektion schlimm psychisch müde
Number of train words: 20
SVM (↓): 75.42%

***** Evaluating SimLex/WordSim (benchmarks 0.2-0.3/0.5-0.6)
SimLex                : 0.315 (using 993 of 999 word pairs)
WordSim353            : 0.538 (using 348 of 350 word pairs)
WordSim353 Similarity : 0.591 (using 201 of 201 word pairs)
WordSim353 Relatedness: 0.491 (using 250 of 252 word pairs)
***** Evaluating syntactic & semantic features (benchmarks ~62% correct (34-87), ~76% top 10, coverage 68%)
unable to import 'smart_open.gcs', disabling that module
loading projection weights from ../../data/models/all/all_glove_w2v_vectors.txt
loaded (703198, 300) matrix from ../../data/models/all/all_glove_w2v_vectors.txt
precomputing L2-norms of word weight vectors
> EVALUATING SYNTACTIC FEATURES
nouns: SI/PL: 0.0% (0/0), 0.0% (0/0), 0.0% (0/500)
nouns: PL/SI: 0.0% (0/0), 0.0% (0/0), 0.0% (0/500)
adjectives: GR/KOM: 40.2% (201/500), 64.4% (322/500), 100.0% (500/500)
adjectives: KOM/GR: 36.8% (184/500), 68.8% (344/500), 100.0% (500/500)
adjectives: GR/SUP: 6.1% (24/392), 19.6% (77/392), 78.4% (392/500)
adjectives: SUP/GR: 5.8% (23/395), 23.8% (94/395), 79.0% (395/500)
adjectives: KOM/SUP: 13.8% (55/398), 35.9% (143/398), 79.6% (398/500)
adjectives: SUP/KOM: 17.7% (71/401), 40.1% (161/401), 80.2% (401/500)
verbs (pres): INF/1SP: 49.6% (248/500), 78.6% (393/500), 100.0% (500/500)
verbs (pres): 1SP/INF: 59.8% (299/500), 83.8% (419/500), 100.0% (500/500)
verbs (pres): INF/2PP: 52.5% (249/474), 73.4% (348/474), 94.8% (474/500)
verbs (pres): 2PP/INF: 60.9% (285/468), 78.4% (367/468), 93.6% (468/500)
verbs (pres): 1SP/2PP: 35.6% (164/461), 55.5% (256/461), 92.2% (461/500)
verbs (pres): 2PP/1SP: 29.1% (137/470), 51.9% (244/470), 94.0% (470/500)
verbs (past): INF/3SV: 44.8% (224/500), 82.4% (412/500), 100.0% (500/500)
verbs (past): 3SV/INF: 42.0% (210/500), 82.0% (410/500), 100.0% (500/500)
verbs (past): INF/3PV: 64.0% (320/500), 87.8% (439/500), 100.0% (500/500)
verbs (past): 3PV/INF: 69.2% (346/500), 90.2% (451/500), 100.0% (500/500)
verbs (past): 3SV/3PV: 77.8% (389/500), 90.0% (450/500), 100.0% (500/500)
verbs (past): 3PV/3SV: 84.4% (422/500), 93.2% (466/500), 100.0% (500/500)
total correct:  45.5% (3851/8459)
total top 10:   68.5% (5796/8459)
total coverage: 84.6% (8459/10000)
> EVALUATING SEMANTIC FEATURES
opposite correct:  47.1% (72/153)
opposite top 10:   73.2% (112/153)
opposite coverage: 51.0% (153/300)
best match correct:  100.0% (1/1)
best match top 10:   100.0% (1/1)
best match coverage: 0.2% (1/540)
doesn't fit correct:  0.0% (0/0)
doesn't fit coverage: 0.0% (0/110)
***** Evaluating on MUSE datasets
INFO - 07/31/20 12:48:06 - 0:00:00 - ============ Initialized logger ============
INFO - 07/31/20 12:48:06 - 0:00:00 - cuda: True
                                     dico_eval: default
                                     emb_dim: 300
                                     exp_id:
                                     exp_name: debug
                                     exp_path: /home/sj041/bachelorarbeit/Code/frameworks/MUSE/dumped/debug/opzy4i4v3u
                                     max_vocab: 1000000
                                     normalize_embeddings:
                                     src_emb: ../../data/models/all/all_glove_w2v_vectors.txt
                                     src_lang: de
                                     tgt_emb:
                                     tgt_lang:
                                     verbose: 2
INFO - 07/31/20 12:48:06 - 0:00:00 - The experiment will be stored in /home/sj041/bachelorarbeit/Code/frameworks/MUSE/dumped/debug/opzy4i4v3u
INFO - 07/31/20 12:48:40 - 0:00:34 - Loaded 703198 pre-trained word embeddings.
INFO - 07/31/20 12:48:45 - 0:00:39 - ====================================================================
INFO - 07/31/20 12:48:45 - 0:00:39 -                        Dataset      Found     Not found          Rho
INFO - 07/31/20 12:48:45 - 0:00:39 - ====================================================================
INFO - 07/31/20 12:48:45 - 0:00:39 -                      DE_GUR350        316            34       0.5542
INFO - 07/31/20 12:48:45 - 0:00:39 -                  DE_SIMLEX-999        993             6       0.3196
INFO - 07/31/20 12:48:45 - 0:00:39 -                       DE_GUR65         65             0       0.7126
INFO - 07/31/20 12:48:45 - 0:00:39 -                       DE_ZG222        183            39       0.3572
INFO - 07/31/20 12:48:45 - 0:00:39 -                   DE_SEMEVAL17        414            32       0.6651
INFO - 07/31/20 12:48:45 - 0:00:39 -                      DE_WS-353        348             2       0.5377
INFO - 07/31/20 12:48:45 - 0:00:39 - ====================================================================
INFO - 07/31/20 12:48:45 - 0:00:39 - Monolingual source word similarity score average: 0.52439
***** Ähnlich zu
apfel           ist am ähnlichsten zu   banane          (0.566), äpfel           (0.545), zitrone         (0.538)
mann            ist am ähnlichsten zu   frau            (0.682), männer          (0.626), junge           (0.610)
frau            ist am ähnlichsten zu   mutter          (0.703), ehefrau         (0.699), mann            (0.682)
er              ist am ähnlichsten zu   später          (0.654), seiner          (0.649), seine           (0.648)
sie             ist am ähnlichsten zu   ihre            (0.703), aber            (0.678), ihr             (0.657)
karriere        ist am ähnlichsten zu   laufbahn        (0.768), beendete        (0.632), profikarriere   (0.632)
familie         ist am ähnlichsten zu   familien        (0.675), eltern          (0.598), vater           (0.594)
***** Analogien
deutschland        -> berlin
 ≈ frankreich      -> paris           (0.927), pariser         (0.814), london          (0.807)
deutschland        -> merkel
 ≈ russland        -> putin           (0.967), erdogan         (0.846), wladimir        (0.841)
deutschland        -> deutsch
 ≈ schweden        -> schwedisch      (1.030), dänisch         (0.920), norwegisch      (0.919)
deutschland        -> euro
 ≈ großbritannien  -> £               (0.890), pfund           (0.883), dollar          (0.876)
mann               -> vater
 ≈ frau            -> mutter          (0.979), tochter         (0.979), schwester       (0.954)
mann               -> bruder
 ≈ frau            -> schwester       (0.958), tochter         (0.945), sohn            (0.917)
mann               -> kunde
 ≈ frau            -> sparkasse       (0.838), volksbank       (0.799), kreissparkasse  (0.791)
mann               -> patient
 ≈ frau            -> patientin       (0.896), behandelnden    (0.829), patienten       (0.819)
mann               -> chef
 ≈ frau            -> leiterin        (0.847), chefin          (0.832), direktorin      (0.828)
mann               -> arzt
 ≈ frau            -> ärztin          (0.985), behandelnden    (0.949), dr.             (0.923)
frau               -> ärztin
 ≈ mann            -> arzt            (0.808), chirurg         (0.764), krankenschwester (0.753)
mann               -> handwerker
 ≈ frau            -> kaufleute       (0.813), angestellte     (0.775), wohlhabende     (0.773)
frau               -> handwerkerin
 ≈ mann            -> gutherziger     (0.802), comic-fan       (0.800), bewanderter     (0.799)
mann               -> karriere
 ≈ frau            -> laufbahn        (0.895), beendete        (0.843), profikarriere   (0.838)
frau               -> karriere
 ≈ mann            -> laufbahn        (0.874), saison          (0.805), eishockeyspieler (0.800)
frau               -> familie
 ≈ mann            -> familien        (0.869), vater           (0.825), freunden        (0.798)
mann               -> familie
 ≈ frau            -> tochter         (0.916), ehefrau         (0.893), mutter          (0.873)
er                 -> wissenschaft
 ≈ sie             -> experten        (0.860), kultur          (0.847), forschung       (0.833)
sie                -> wissenschaft
 ≈ er              -> forschung       (0.907), wissenschaftlichen (0.863), wissenschaften  (0.861)
