{
  "customers": [
    {
      "id": "1",
      "accounts": [
        {
          "accountType": "MARGIN",
          "accountName": "MARGIN ACCOUNT",
          "assets": [
            {
              "coinSymbol": "USDT",
              "totalAmount": "195.172612",
              "pendingAmount": "188.2315812",
              "availableAmount": "10.333",
              "creditAmount": "3.1",
              "network": "Ethereum",
              "depositAddress": "0xb794f5ea0ba39494ce839613fffba74279579268",
              "depositAddressTag": 1678949391076
            }
          ]
        },
        {
          "accountType": "FUNDING",
          "accountName": "FUNDING ACCOUNT",
          "assets": [
            {
              "coinSymbol": "USDT",
              "totalAmount": "195.172612",
              "pendingAmount": "188.2315812",
              "availableAmount": "10.333",
              "creditAmount": "3.1",
              "network": "Ethereum",
              "depositAddress": "0xb794f5ea0ba39494ce839613fffba74279579268",
              "depositAddressTag": 1678949391076
            },
            {
              "coinSymbol": "USDC",
              "totalAmount": "95.172612",
              "pendingAmount": "88.2315812",
              "availableAmount": "1.333",
              "creditAmount": "1.1",
              "network": "Ethereum",
              "depositAddress": "0xc794f5ea0ba39494ce839613fffba74279579268",
              "depositAddressTag": 1678949391076
            },
            {
              "coinSymbol": "BNB",
              "totalAmount": 0,
              "pendingAmount": 0,
              "availableAmount": 0,
              "creditAmount": 0,
              "network": "Ethereum",
              "depositAddress": "0x07d664fc0b14A079047D584F32Dbc352a082a863",
              "depositAddressTag": 1678949391076
            },
            {
              "coinSymbol": "ALGO",
              "totalAmount": 0,
              "pendingAmount": 0,
              "availableAmount": 0,
              "creditAmount": 0,
              "network": "Ethereum",
              "depositAddress": "0xa6e0bb77Ae30779Eb4915c0205b766FFa97fa15d",
              "depositAddressTag": 1678955947300
            }
          ]
        },
        {
          "accountType": "EXCHANGE",
          "accountName": "EXCHANGE ACCOUNT",
          "assets": [
            {
              "coinSymbol": "USDT",
              "totalAmount": "195.172612",
              "pendingAmount": "188.2315812",
              "availableAmount": "10.333",
              "creditAmount": "3.1",
              "network": "Ethereum",
              "depositAddress": "0xb794f5ea0ba39494ce839613fffba74279579268",
              "depositAddressTag": 1678949391076
            },
            {
              "coinSymbol": "USDC",
              "totalAmount": "95.172612",
              "pendingAmount": "88.2315812",
              "availableAmount": "1.333",
              "creditAmount": "1.1",
              "network": "Ethereum",
              "depositAddress": "0xc794f5ea0ba39494ce839613fffba74279579268",
              "depositAddressTag": 1678949391076
            },
            {
              "coinSymbol": "BNB",
              "totalAmount": 0,
              "pendingAmount": 0,
              "availableAmount": 0,
              "creditAmount": 0,
              "network": "Ethereum",
              "depositAddress": "0x07d664fc0b14A079047D584F32Dbc352a082a863",
              "depositAddressTag": 1678949391076
            },
            {
              "coinSymbol": "ALGO",
              "totalAmount": 0,
              "pendingAmount": 0,
              "availableAmount": 0,
              "creditAmount": 0,
              "network": "Ethereum",
              "depositAddress": "0xa6e0bb77Ae30779Eb4915c0205b766FFa97fa15d",
              "depositAddressTag": 1678955947300
            }
          ]
        }
      ]
    }
  ],
  "transactions": [
    {
      "transactionID": "46bas218d9h21uhib4i1u2h",
      "status": "COMPLETED",
      "txHash": "44e25bc0ed840f9bf0e58d6227db15192d5b89e79ba4304da16b09703f68ceaf",
      "amount": "1.1",
      "serviceFee": "0.000000031",
      "coinSymbol": "USDT",
      "network": "Ethereum",
      "direction": "CRYPTO_WITHDRAWAL",
      "timestamp": 1546658861000,
      "accountType": "FUNDING",
      "toAddress": "bc1qs95ej87htkfy5786anzwh8sz3gmzvqh2d2uey2",
      "tag": "",
      "isGross": true,
      "maxFee": "0.00001616"
    },
    {
      "transactionID": "57bas218d9h21uhib4i1u2h",
      "status": "COMPLETED",
      "txHash": "55e25bc0ed840f9bf0e58d6227db15192d5b89e79ba4304da16b09703f68ceaf",
      "amount": "20.5",
      "serviceFee": "0.000000152",
      "coinSymbol": "USDT",
      "network": "Ethereum",
      "direction": "CRYPTO_WITHDRAWAL",
      "timestamp": 1546658861000,
      "accountType": "FUNDING",
      "toAddress": "bc1qs95ej87htkfy5786anzwh8sz3gmzvqh2d2uey2",
      "tag": "",
      "isGross": true,
      "maxFee": "0.00001616"
    },
    {
      "transactionID": "03e344b37167a73199c7c9b8a9b4ad60",
      "status": "COMPLETED",
      "txHash": "c434b3a9b0f2d194f7d024742dd033bfff5966222a8fdb7520ad38628830b89a",
      "amount": "0.0010597",
      "serviceFee": "0.00001616",
      "coinSymbol": "ETH",
      "network": "Ethereum",
      "direction": "CRYPTO_WITHDRAWAL",
      "timestamp": 1685375558285,
      "accountType": "FUNDING",
      "toAddress": "bc1qs95ej87htkfy5786anzwh8sz3gmzvqh2d2uey2",
      "tag": "ddd",
      "isGross": true,
      "maxFee": "0.00001616"
    },
    {
      "transactionID": "497b9030138c2cd91e821de7fd334b0a",
      "status": "COMPLETED",
      "txHash": "a4152e8ca8fcc1605539d7b2df575f75d789bd28397cfaa08672e4b221912620",
      "amount": "0.0010597",
      "serviceFee": "0.00001616",
      "coinSymbol": "ETH",
      "network": "Ethereum",
      "direction": "CRYPTO_WITHDRAWAL",
      "timestamp": 1685375563118,
      "accountType": "FUNDING",
      "toAddress": "bc1qs95ej87htkfy5786anzwh8sz3gmzvqh2d2uey2",
      "tag": "ddd",
      "isGross": true,
      "maxFee": "0.00001616"
    },
    {
      "transactionID": "a2a0caa0e86dc385674cad845025a707",
      "status": "COMPLETED",
      "txHash": "9d96f79ed4969f8ecf031d9f4f6b9ef911ff5f3bca0294bde2818e9d862c19c2",
      "amount": "0.0010597",
      "serviceFee": "0.00001616",
      "coinSymbol": "ETH",
      "network": "Ethereum",
      "direction": "CRYPTO_WITHDRAWAL",
      "timestamp": 1685375581825,
      "accountType": "FUNDING",
      "toAddress": "bc1qs95ej87htkfy5786anzwh8sz3gmzvqh2d2uey2",
      "tag": "ddd",
      "isGross": true,
      "maxFee": "0.00001616"
    },
    {
      "transactionID": "32c1c0ba460884997e56a491d8aa9f92",
      "status": "COMPLETED",
      "txHash": "7f698b03f17ab5b40426383787cdf682d94dde03ed458cc63eccea018aa8c987",
      "amount": "0.0010597",
      "serviceFee": "0.00001616",
      "coinSymbol": "ETH",
      "network": "Ethereum",
      "direction": "CRYPTO_WITHDRAWAL",
      "timestamp": 1685375584523,
      "accountType": "FUNDING",
      "toAddress": "bc1qs95ej87htkfy5786anzwh8sz3gmzvqh2d2uey2",
      "tag": "ddd",
      "isGross": true,
      "maxFee": "0.00001616"
    },
    {
      "transactionID": "b5f955e07e4eb1536e710232e707e8fb",
      "status": "COMPLETED",
      "txHash": "fe76a7b6edfc065acbe7606f941dfd28d4614438cdb81258a804e183c4b7c364",
      "amount": "0.0010597",
      "serviceFee": "0.00001616",
      "coinSymbol": "ETH",
      "network": "Ethereum",
      "direction": "CRYPTO_WITHDRAWAL",
      "timestamp": 1685375595603,
      "accountType": "FUNDING",
      "toAddress": "bc1qs95ej87htkfy5786anzwh8sz3gmzvqh2d2uey2",
      "tag": "ddd",
      "isGross": true,
      "maxFee": "0.00001616"
    },
    {
      "transactionID": "32e7106b549a82bb83f40a9e47f18b16",
      "status": "COMPLETED",
      "txHash": "80aad97b31a8e39891f5ea0f6e21b7dbd1248960bf215007bbfda50b8bb9f3cd",
      "amount": "0.0010597",
      "serviceFee": "0.00001616",
      "coinSymbol": "ETH",
      "network": "Ethereum",
      "direction": "CRYPTO_WITHDRAWAL",
      "timestamp": 1685375624849,
      "accountType": "FUNDING",
      "toAddress": "bc1qs95ej87htkfy5786anzwh8sz3gmzvqh2d2uey2",
      "tag": "ddd",
      "isGross": true,
      "maxFee": "0.00001616"
    },
    {
      "transactionID": "f72b25b524c1b862b7e7bb25d8823525",
      "status": "COMPLETED",
      "txHash": "6504da4fe8cd1730165f5c425ef10c5cd10fc4cc8c37fcf27e382f7f64dd43a2",
      "amount": "0.0010597",
      "serviceFee": "0.00001616",
      "coinSymbol": "ETH",
      "network": "Ethereum",
      "direction": "CRYPTO_WITHDRAWAL",
      "timestamp": 1685375640070,
      "accountType": "FUNDING",
      "toAddress": "bc1qs95ej87htkfy5786anzwh8sz3gmzvqh2d2uey2",
      "tag": "ddd",
      "isGross": true,
      "maxFee": "0.00001616"
    },
    {
      "transactionID": "8894b3cc781cdcaa652af35072521063",
      "status": "COMPLETED",
      "txHash": "80e6a9ea056661c7bf983d8a40ffeefb5eea27a26d7e164ff8f266713c6ae671",
      "amount": "0.0010597",
      "serviceFee": "0.00001616",
      "coinSymbol": "ETH",
      "network": "Ethereum",
      "direction": "CRYPTO_WITHDRAWAL",
      "timestamp": 1685375673455,
      "accountType": "FUNDING",
      "toAddress": "bc1qs95ej87htkfy5786anzwh8sz3gmzvqh2d2uey2",
      "tag": "ddd",
      "isGross": true,
      "maxFee": "0.00001616"
    },
    {
      "transactionID": "81845d8e6be4b949f345be5306ca9aa5",
      "status": "COMPLETED",
      "txHash": "62f8a04d94fcd143ec5d477d5b5bef3d0e5540c22bb011bac07bdb870940b5a3",
      "amount": "0.0010597",
      "serviceFee": "0.00001616",
      "coinSymbol": "ETH",
      "network": "Ethereum",
      "direction": "CRYPTO_WITHDRAWAL",
      "timestamp": 1685375752060,
      "accountType": "FUNDING",
      "toAddress": "bc1qs95ej87htkfy5786anzwh8sz3gmzvqh2d2uey2",
      "tag": "ddd",
      "isGross": true,
      "maxFee": "0.00001616"
    },
    {
      "transactionID": "b89e755f82326a79d716f98de013540b",
      "status": "COMPLETED",
      "txHash": "b21c64c40012057a9f92f5ca2f2a5b56094b36e930b2595ed6315dd625b6f496",
      "amount": "0.0010597",
      "serviceFee": "0.00001616",
      "coinSymbol": "ETH",
      "network": "Ethereum",
      "direction": "CRYPTO_WITHDRAWAL",
      "timestamp": 1685375758030,
      "accountType": "FUNDING",
      "toAddress": "bc1qs95ej87htkfy5786anzwh8sz3gmzvqh2d2uey2",
      "tag": "ddd",
      "isGross": true,
      "maxFee": "0.00001616"
    }
  ],
  "assets": [
    {
      "coinSymbol": "BTC",
      "network": "Ethereum",
      "coinClass": "TOKEN",
      "identifiers": [
        "0xdAC17F958D2ee523a2206206994597C13D831ec7"
      ]
    },
    {
      "coinSymbol": "ETH",
      "network": "Ethereum",
      "coinClass": "TOKEN",
      "identifiers": [
        "0xdAC17F958D2ee523a2206206994597C13D831ec7"
      ]
    },
    {
      "coinSymbol": "USDT",
      "network": "Ethereum",
      "coinClass": "TOKEN",
      "identifiers": [
        "0xdAC17F958D2ee523a2206206994597C13D831ec7"
      ]
    },
    {
      "coinSymbol": "BNB",
      "network": "Ethereum",
      "coinClass": "TOKEN",
      "identifiers": [
        "0xdAC17F958D2ee523a2206206994597C13D831ec7"
      ]
    },
    {
      "coinSymbol": "USDC",
      "network": "Ethereum",
      "coinClass": "TOKEN",
      "identifiers": [
        "0xdAC17F958D2ee523a2206206994597C13D831ec7"
      ]
    },
    {
      "coinSymbol": "ALGO",
      "network": "Ethereum",
      "coinClass": "TOKEN",
      "identifiers": [
        "0xdAC17F958D2ee523a2206206994597C13D831ec7"
      ]
    },
    {
      "coinSymbol": "XLM",
      "network": "Ethereum",
      "coinClass": "TOKEN",
      "identifiers": [
        "0xdAC17F958D2ee523a2206206994597C13D831ec7"
      ]
    },
    {
      "coinSymbol": "SOL",
      "network": "Ethereum",
      "coinClass": "TOKEN",
      "identifiers": [
        "0xdAC17F958D2ee523a2206206994597C13D831ec7"
      ]
    }
  ]
}