{
   "local_connection" : {
     "user" : "root",
     "pass" : "root",
     "driver" :"com.mysql.jdbc.Driver",
     "url" : "jdbc:mysql://localhost:3306?verifyServerCertificate=false&useSSL=true"
   }
}