%YAML 1.1
%TAG !u! tag:unity3d.com,2011:
--- !u!1 &6639056565414543440
GameObject:
  m_ObjectHideFlags: 0
  m_CorrespondingSourceObject: {fileID: 0}
  m_PrefabInstance: {fileID: 0}
  m_PrefabAsset: {fileID: 0}
  serializedVersion: 6
  m_Component:
  - component: {fileID: 6639056565414543443}
  - component: {fileID: 6639056565414543442}
  - component: {fileID: 363364317}
  m_Layer: 0
  m_Name: GameManager
  m_TagString: Untagged
  m_Icon: {fileID: 0}
  m_NavMeshLayer: 0
  m_StaticEditorFlags: 0
  m_IsActive: 1
--- !u!4 &6639056565414543443
Transform:
  m_ObjectHideFlags: 0
  m_CorrespondingSourceObject: {fileID: 0}
  m_PrefabInstance: {fileID: 0}
  m_PrefabAsset: {fileID: 0}
  m_GameObject: {fileID: 6639056565414543440}
  m_LocalRotation: {x: 0, y: 0, z: 0, w: 1}
  m_LocalPosition: {x: 0, y: 0, z: 0}
  m_LocalScale: {x: 1, y: 1, z: 1}
  m_ConstrainProportionsScale: 0
  m_Children: []
  m_Father: {fileID: 0}
  m_RootOrder: 0
  m_LocalEulerAnglesHint: {x: 0, y: 0, z: 0}
--- !u!114 &6639056565414543442
MonoBehaviour:
  m_ObjectHideFlags: 0
  m_CorrespondingSourceObject: {fileID: 0}
  m_PrefabInstance: {fileID: 0}
  m_PrefabAsset: {fileID: 0}
  m_GameObject: {fileID: 6639056565414543440}
  m_Enabled: 1
  m_EditorHideFlags: 0
  m_Script: {fileID: 11500000, guid: ffac703f59d0a6e4592386e50aeddf9a, type: 3}
  m_Name: 
  m_EditorClassIdentifier: 
  dialogueTutorial: {fileID: 11400000, guid: 21867244e52d9d7499d08261d5158c75, type: 2}
  dialogueEndsTutorial: {fileID: 11400000, guid: 19b0b145ae31a1e46a567f84f0e77b25, type: 2}
  dialogueBossFight: {fileID: 11400000, guid: 0ed1b985064fe8a46af18d51d12e79c7, type: 2}
  dialoguePlayerWin: {fileID: 11400000, guid: 326fba451ec143549a9ffe2c2bdef982, type: 2}
  playerData: {fileID: 11400000, guid: e4b8d54ea82ea5c48bb6c925e916a036, type: 2}
  player: {fileID: 0}
  mainCamera: {fileID: 0}
  uiPauseController: {fileID: 0}
  uiGameOver: {fileID: 0}
  dialogueWindow: {fileID: 0}
  playerWinUI: {fileID: 0}
  playerEndsTutorial: 0
  enemiesDeafeated: 0
  playerWins: 0
  cursorDefaultText: {fileID: 21300000, guid: 9535850fcee6aa14eb6388540496a6c1, type: 3}
--- !u!114 &363364317
MonoBehaviour:
  m_ObjectHideFlags: 0
  m_CorrespondingSourceObject: {fileID: 0}
  m_PrefabInstance: {fileID: 0}
  m_PrefabAsset: {fileID: 0}
  m_GameObject: {fileID: 6639056565414543440}
  m_Enabled: 1
  m_EditorHideFlags: 0
  m_Script: {fileID: 11500000, guid: c3e30502bff053d4c93ef2a9113f9937, type: 3}
  m_Name: 
  m_EditorClassIdentifier: 
