%YAML 1.1
%TAG !u! tag:unity3d.com,2011:
--- !u!114 &11400000
MonoBehaviour:
  m_ObjectHideFlags: 0
  m_CorrespondingSourceObject: {fileID: 0}
  m_PrefabInstance: {fileID: 0}
  m_PrefabAsset: {fileID: 0}
  m_GameObject: {fileID: 0}
  m_Enabled: 1
  m_EditorHideFlags: 0
  m_Script: {fileID: 11500000, guid: f1a3322db9010ac4f94f4434a32963f0, type: 3}
  m_Name: BosssFight
  m_EditorClassIdentifier: 
  dialogToSay:
  - I think you just discovered the lair of the person responsible for all this...
  - Be careful, he may still be hanging around this area. You better prepare yourself
    in case things turn ugly
