%YAML 1.1
%TAG !u! tag:unity3d.com,2011:
--- !u!114 &11400000
MonoBehaviour:
  m_ObjectHideFlags: 0
  m_CorrespondingSourceObject: {fileID: 0}
  m_PrefabInstance: {fileID: 0}
  m_PrefabAsset: {fileID: 0}
  m_GameObject: {fileID: 0}
  m_Enabled: 1
  m_EditorHideFlags: 0
  m_Script: {fileID: 11500000, guid: f1a3322db9010ac4f94f4434a32963f0, type: 3}
  m_Name: TutorialPlayer
  m_EditorClassIdentifier: 
  dialogToSay:
  - Hello adventurer! It seems that you are a bit lost, you are in the castle somewhere
    :)
  - "Right now you are in an abandoned room in the castle, although... \nI don't
    remember the hole in that wall."
  - 'We probably have unexpected visitors...

    Go see what happens...'
