{
    "order" : 13,

    "name": "Nemesis",
    "id": "nemesis-lockdown",
    "image_folder" : "images",    
    "select_image" : "images/select.png",
    "background_video_url" : "http://brannigan.nny/Public/Board%20Game%20Table/videos/nemesis-lockdown/phase-1.mp4",
    "webhook_select" : "bgt-nemesis-lockdown-select",


    "sequence": [

        {"only_on_rounds": [1], "mode": "webhook", "webhook": "bgt-overhead-on"},
        {"only_on_rounds": [1], "mode": "message", "message_text": "Press P1B2 to Enter the Facility", "message_css": {"color" : "orange"} },


        {"only_on_rounds": [1], "mode": "info", "hide_tracker": true, "image": "setup1.png", "comment" : ""},
        {"only_on_rounds": [1], "mode": "info", "hide_tracker": true, "image": "setup2.png", "comment" : ""},


        {"mode": "prime-finite-round"},
        {"mode": "finite-round", "image": "round.png", "comment": "Draw up to 5 cards (once). Perform up to 2 actions"},
        {"mode": "upkeep", "image": "upkeep.png", "comment": "Move time track, resolve Intruder attacks resolve fire damage resolve event card move Intruders, Intruder bag development"},
        {"mode": "move-first-player-token"}     
    ]
}