{
    "order" : 11,

    "name": "Brass: Birmingham",
    "id": "brass-birmingham",
    "image_folder" : "images",
    "select_image" : "images/select.png",    
    "background_video_url" : "http://brannigan.nny/Public/Board%20Game%20Table/videos/brass-birmingham/phase-1.mp4",
    "webhook_select" : "bgt-brass-birmingham-select",


    "sequence": [

        {"only_on_rounds": [1], "mode": "webhook", "webhook": "bgt-overhead-on"},
        {"only_on_rounds": [1], "mode": "message", "message_text": "Press P1B2 to Start the Industrial Revolution", "message_css": {"color" : "gray"} },


        {"only_on_rounds": [1], "mode": "info", "hide_tracker": true, "image": "setup1.png", "comment" : ""},
        {"only_on_rounds": [1], "mode": "info", "hide_tracker": true, "image": "setup2.png", "comment" : ""},

        {"mode": "prime-one-shot" },
        {"only_on_rounds" : [1], "hide_tracker": true, "mode": "one-shot", "image": "actions_first_turn.png"},
        {"not_on_rounds" : [1], "hide_tracker": true, "mode": "one-shot", "image": "actions.png"},
        {"hide_tracker": true, "mode": "upkeep", "image": "upkeep.png"},    
        


        {"only_with_player_counts": [4], "only_on_rounds": [8], "mode": "update_config", "config" : {"background_video_url" : "http://brannigan.nny/Public/Board%20Game%20Table/videos/brass-birmingham/phase-2.mp4"} },
        {"only_with_player_counts": [4], "only_on_rounds": [8], "mode": "upkeep", "hide_tracker": true, "image": "end-of-canal.png"},
        
        {"only_with_player_counts": [3], "only_on_rounds": [9], "mode": "update_config", "config" : {"background_video_url" : "http://brannigan.nny/Public/Board%20Game%20Table/videos/brass-birmingham/phase-2.mp4"} },
        {"only_with_player_counts": [3], "only_on_rounds": [9], "mode": "upkeep", "hide_tracker": true, "image": "end-of-canal.png"},

        {"only_with_player_counts": [2,1], "only_on_rounds": [10], "mode": "update_config", "config" : {"background_video_url" : "http://brannigan.nny/Public/Board%20Game%20Table/videos/brass-birmingham/phase-2.mp4"} },
        {"only_with_player_counts": [2,1], "only_on_rounds": [10], "mode": "upkeep", "hide_tracker": true, "image": "end-of-canal.png"},


        {"only_with_player_counts": [4], "only_on_rounds": [16], "mode": "end", "hide_tracker": true, "image": "end.png"},
        {"only_with_player_counts": [3], "only_on_rounds": [18], "mode": "end", "hide_tracker": true, "image": "end.png"},
        {"only_with_player_counts": [2,1], "only_on_rounds": [20], "mode": "end", "hide_tracker": true, "image": "end.png"}

    ]
}