﻿{
  "0": {
    "inv_id": "1",
    "inv_number": "1",
    "inv_number_string": "2019/07/1",
    "inv_period": "2019",
    "inv_user_id": null,
    "inv_email": "test@przykladowymail12345.pl",
    "inv_order_id": "1",
    "inv_custom": "no",
    "inv_issue_place": "Warszawa",
    "inv_data": "[{\"amount\":2,\"price\":69,\"tax\":\"23\",\"price_net\":56.1,\"name\":\"Produkt Przyk\\u0142adowy \\u017bakiet K169 - Odcienie \\u017c\\u00f3\\u0142tego\",\"pkwiu\":\"\",\"unit\":\"szt.\",\"prod_symbol\":\"181_6\"},{\"amount\":1,\"price\":49,\"tax\":\"23\",\"price_net\":39.84,\"name\":\"Produkt Przyk\\u0142adowy Spodenki K159 - Odcienie b\\u0142ekitu\",\"pkwiu\":\"\",\"unit\":\"szt.\",\"prod_symbol\":\"170_41\"},{\"price\":35,\"amount\":1,\"tax\":\"23\",\"name\":\"Rodzaj dostawy: Kurier\",\"price_net\":28.46}]",
    "inv_date": "2019-07-03",
    "inv_sell_date": "2018-01-18",
    "inv_payment": "",
    "inv_payment_days": null,
    "inv_currency": "{\"equ\":\"PLN\",\"sym\":\"zł\",\"rate\":\"1\"}",
    "inv_note": "",
    "inv_price": "222.00",
    "inv_price_net": "180.49",
    "inv_tax": "41.51",
    "inv_prices_type": "gross",
    "inv_bill_company": "Firma Jednoosobowa",
    "inv_bill_vat": "",
    "inv_bill_city": "Kraków",
    "inv_bill_country": "PL",
    "inv_bill_street": "Ulica 2",
    "inv_bill_code": "01-100",
    "inv_payment_other": "Wpłata na konto bankowe",
    "inv_with_vat": "1"
  },
  "response_code": 200
}