[
  {
    "inputs": [
      {
        "internalType": "contract ISynthereumFinder",
        "name": "_synthereumFinder",
        "type": "address"
      },
      {
        "components": [
          { "internalType": "address", "name": "admin", "type": "address" },
          { "internalType": "address", "name": "maintainer", "type": "address" }
        ],
        "internalType": "struct SynthereumDeployer.Roles",
        "name": "_roles",
        "type": "tuple"
      }
    ],
    "stateMutability": "nonpayable",
    "type": "constructor"
  },
  {
    "anonymous": false,
    "inputs": [
      {
        "indexed": true,
        "internalType": "uint8",
        "name": "fixedRateVersion",
        "type": "uint8"
      },
      {
        "indexed": true,
        "internalType": "address",
        "name": "fixedRate",
        "type": "address"
      }
    ],
    "name": "FixedRateDeployed",
    "type": "event"
  },
  {
    "anonymous": false,
    "inputs": [
      {
        "indexed": false,
        "internalType": "address",
        "name": "fixedRate",
        "type": "address"
      }
    ],
    "name": "FixedRateRemoved",
    "type": "event"
  },
  {
    "anonymous": false,
    "inputs": [
      {
        "indexed": true,
        "internalType": "uint8",
        "name": "poolVersion",
        "type": "uint8"
      },
      {
        "indexed": true,
        "internalType": "address",
        "name": "newPool",
        "type": "address"
      }
    ],
    "name": "PoolDeployed",
    "type": "event"
  },
  {
    "anonymous": false,
    "inputs": [
      {
        "indexed": true,
        "internalType": "address",
        "name": "migratedPool",
        "type": "address"
      },
      {
        "indexed": true,
        "internalType": "uint8",
        "name": "poolVersion",
        "type": "uint8"
      },
      {
        "indexed": true,
        "internalType": "address",
        "name": "newPool",
        "type": "address"
      }
    ],
    "name": "PoolMigrated",
    "type": "event"
  },
  {
    "anonymous": false,
    "inputs": [
      {
        "indexed": false,
        "internalType": "address",
        "name": "pool",
        "type": "address"
      }
    ],
    "name": "PoolRemoved",
    "type": "event"
  },
  {
    "anonymous": false,
    "inputs": [
      {
        "indexed": true,
        "internalType": "bytes32",
        "name": "role",
        "type": "bytes32"
      },
      {
        "indexed": true,
        "internalType": "bytes32",
        "name": "previousAdminRole",
        "type": "bytes32"
      },
      {
        "indexed": true,
        "internalType": "bytes32",
        "name": "newAdminRole",
        "type": "bytes32"
      }
    ],
    "name": "RoleAdminChanged",
    "type": "event"
  },
  {
    "anonymous": false,
    "inputs": [
      {
        "indexed": true,
        "internalType": "bytes32",
        "name": "role",
        "type": "bytes32"
      },
      {
        "indexed": true,
        "internalType": "address",
        "name": "account",
        "type": "address"
      },
      {
        "indexed": true,
        "internalType": "address",
        "name": "sender",
        "type": "address"
      }
    ],
    "name": "RoleGranted",
    "type": "event"
  },
  {
    "anonymous": false,
    "inputs": [
      {
        "indexed": true,
        "internalType": "bytes32",
        "name": "role",
        "type": "bytes32"
      },
      {
        "indexed": true,
        "internalType": "address",
        "name": "account",
        "type": "address"
      },
      {
        "indexed": true,
        "internalType": "address",
        "name": "sender",
        "type": "address"
      }
    ],
    "name": "RoleRevoked",
    "type": "event"
  },
  {
    "anonymous": false,
    "inputs": [
      {
        "indexed": true,
        "internalType": "uint8",
        "name": "selfMintingDerivativeVersion",
        "type": "uint8"
      },
      {
        "indexed": true,
        "internalType": "address",
        "name": "selfMintingDerivative",
        "type": "address"
      }
    ],
    "name": "SelfMintingDerivativeDeployed",
    "type": "event"
  },
  {
    "anonymous": false,
    "inputs": [
      {
        "indexed": false,
        "internalType": "address",
        "name": "selfMintingDerivative",
        "type": "address"
      }
    ],
    "name": "SelfMintingDerivativeRemoved",
    "type": "event"
  },
  {
    "inputs": [],
    "name": "DEFAULT_ADMIN_ROLE",
    "outputs": [{ "internalType": "bytes32", "name": "", "type": "bytes32" }],
    "stateMutability": "view",
    "type": "function"
  },
  {
    "inputs": [],
    "name": "MAINTAINER_ROLE",
    "outputs": [{ "internalType": "bytes32", "name": "", "type": "bytes32" }],
    "stateMutability": "view",
    "type": "function"
  },
  {
    "inputs": [
      { "internalType": "uint8", "name": "_fixedRateVersion", "type": "uint8" },
      {
        "internalType": "bytes",
        "name": "_fixedRateParamsData",
        "type": "bytes"
      }
    ],
    "name": "deployFixedRate",
    "outputs": [
      {
        "internalType": "contract ISynthereumDeployment",
        "name": "fixedRate",
        "type": "address"
      }
    ],
    "stateMutability": "nonpayable",
    "type": "function"
  },
  {
    "inputs": [
      { "internalType": "uint8", "name": "_poolVersion", "type": "uint8" },
      { "internalType": "bytes", "name": "_poolParamsData", "type": "bytes" }
    ],
    "name": "deployPool",
    "outputs": [
      {
        "internalType": "contract ISynthereumDeployment",
        "name": "pool",
        "type": "address"
      }
    ],
    "stateMutability": "nonpayable",
    "type": "function"
  },
  {
    "inputs": [
      {
        "internalType": "uint8",
        "name": "_selfMintingDerVersion",
        "type": "uint8"
      },
      {
        "internalType": "bytes",
        "name": "_selfMintingDerParamsData",
        "type": "bytes"
      }
    ],
    "name": "deploySelfMintingDerivative",
    "outputs": [
      {
        "internalType": "contract ISynthereumDeployment",
        "name": "selfMintingDerivative",
        "type": "address"
      }
    ],
    "stateMutability": "nonpayable",
    "type": "function"
  },
  {
    "inputs": [
      { "internalType": "bytes32", "name": "role", "type": "bytes32" }
    ],
    "name": "getRoleAdmin",
    "outputs": [{ "internalType": "bytes32", "name": "", "type": "bytes32" }],
    "stateMutability": "view",
    "type": "function"
  },
  {
    "inputs": [
      { "internalType": "bytes32", "name": "role", "type": "bytes32" },
      { "internalType": "uint256", "name": "index", "type": "uint256" }
    ],
    "name": "getRoleMember",
    "outputs": [{ "internalType": "address", "name": "", "type": "address" }],
    "stateMutability": "view",
    "type": "function"
  },
  {
    "inputs": [
      { "internalType": "bytes32", "name": "role", "type": "bytes32" }
    ],
    "name": "getRoleMemberCount",
    "outputs": [{ "internalType": "uint256", "name": "", "type": "uint256" }],
    "stateMutability": "view",
    "type": "function"
  },
  {
    "inputs": [
      { "internalType": "bytes32", "name": "role", "type": "bytes32" },
      { "internalType": "address", "name": "account", "type": "address" }
    ],
    "name": "grantRole",
    "outputs": [],
    "stateMutability": "nonpayable",
    "type": "function"
  },
  {
    "inputs": [
      { "internalType": "bytes32", "name": "role", "type": "bytes32" },
      { "internalType": "address", "name": "account", "type": "address" }
    ],
    "name": "hasRole",
    "outputs": [{ "internalType": "bool", "name": "", "type": "bool" }],
    "stateMutability": "view",
    "type": "function"
  },
  {
    "inputs": [
      {
        "internalType": "contract SynthereumPoolMigrationFrom",
        "name": "_migrationPool",
        "type": "address"
      },
      { "internalType": "uint8", "name": "_poolVersion", "type": "uint8" },
      {
        "internalType": "bytes",
        "name": "_migrationParamsData",
        "type": "bytes"
      }
    ],
    "name": "migratePool",
    "outputs": [
      {
        "internalType": "contract ISynthereumDeployment",
        "name": "pool",
        "type": "address"
      }
    ],
    "stateMutability": "nonpayable",
    "type": "function"
  },
  {
    "inputs": [
      {
        "internalType": "contract ISynthereumDeployment",
        "name": "_fixedRate",
        "type": "address"
      }
    ],
    "name": "removeFixedRate",
    "outputs": [],
    "stateMutability": "nonpayable",
    "type": "function"
  },
  {
    "inputs": [
      {
        "internalType": "contract ISynthereumDeployment",
        "name": "_pool",
        "type": "address"
      }
    ],
    "name": "removePool",
    "outputs": [],
    "stateMutability": "nonpayable",
    "type": "function"
  },
  {
    "inputs": [
      {
        "internalType": "contract ISynthereumDeployment",
        "name": "_selfMintingDerivative",
        "type": "address"
      }
    ],
    "name": "removeSelfMintingDerivative",
    "outputs": [],
    "stateMutability": "nonpayable",
    "type": "function"
  },
  {
    "inputs": [
      { "internalType": "bytes32", "name": "role", "type": "bytes32" },
      { "internalType": "address", "name": "account", "type": "address" }
    ],
    "name": "renounceRole",
    "outputs": [],
    "stateMutability": "nonpayable",
    "type": "function"
  },
  {
    "inputs": [
      { "internalType": "bytes32", "name": "role", "type": "bytes32" },
      { "internalType": "address", "name": "account", "type": "address" }
    ],
    "name": "revokeRole",
    "outputs": [],
    "stateMutability": "nonpayable",
    "type": "function"
  },
  {
    "inputs": [
      { "internalType": "bytes4", "name": "interfaceId", "type": "bytes4" }
    ],
    "name": "supportsInterface",
    "outputs": [{ "internalType": "bool", "name": "", "type": "bool" }],
    "stateMutability": "view",
    "type": "function"
  },
  {
    "inputs": [],
    "name": "synthereumFinder",
    "outputs": [
      {
        "internalType": "contract ISynthereumFinder",
        "name": "",
        "type": "address"
      }
    ],
    "stateMutability": "view",
    "type": "function"
  }
]
