[
  {
    "inputs": [],
    "name": "AAVE_LENDING_POOL",
    "outputs": [
      { "internalType": "contract LendingPool", "name": "", "type": "address" }
    ],
    "stateMutability": "view",
    "type": "function"
  },
  {
    "inputs": [],
    "name": "COLLATERAL",
    "outputs": [{ "internalType": "address", "name": "", "type": "address" }],
    "stateMutability": "view",
    "type": "function"
  },
  {
    "inputs": [],
    "name": "CURVE",
    "outputs": [
      {
        "internalType": "contract CurveExchange",
        "name": "",
        "type": "address"
      }
    ],
    "stateMutability": "view",
    "type": "function"
  },
  {
    "inputs": [],
    "name": "METAPOOL",
    "outputs": [{ "internalType": "address", "name": "", "type": "address" }],
    "stateMutability": "view",
    "type": "function"
  },
  {
    "inputs": [],
    "name": "ZAP",
    "outputs": [
      {
        "internalType": "contract CurvePoolHelper",
        "name": "",
        "type": "address"
      }
    ],
    "stateMutability": "view",
    "type": "function"
  },
  {
    "inputs": [
      { "internalType": "address", "name": "from", "type": "address" },
      { "internalType": "address", "name": "to", "type": "address" },
      { "internalType": "uint256", "name": "amountIn", "type": "uint256" },
      {
        "internalType": "uint256",
        "name": "slippageTolerence",
        "type": "uint256"
      },
      {
        "components": [
          { "internalType": "address", "name": "initPool", "type": "address" },
          { "internalType": "address", "name": "destPool", "type": "address" }
        ],
        "internalType": "struct CurveFxRouter.ExchangeParams",
        "name": "params",
        "type": "tuple"
      }
    ],
    "name": "exchange",
    "outputs": [
      { "internalType": "uint256", "name": "received", "type": "uint256" }
    ],
    "stateMutability": "nonpayable",
    "type": "function"
  },
  {
    "inputs": [
      { "internalType": "address", "name": "from", "type": "address" },
      { "internalType": "address", "name": "to", "type": "address" },
      { "internalType": "uint256", "name": "amount", "type": "uint256" }
    ],
    "name": "getExchangeAmount",
    "outputs": [
      { "internalType": "int128", "name": "", "type": "int128" },
      { "internalType": "int128", "name": "", "type": "int128" },
      { "internalType": "uint256", "name": "dy", "type": "uint256" }
    ],
    "stateMutability": "view",
    "type": "function"
  },
  {
    "inputs": [
      { "internalType": "address", "name": "asset", "type": "address" }
    ],
    "name": "getUnderlying",
    "outputs": [{ "internalType": "address", "name": "", "type": "address" }],
    "stateMutability": "view",
    "type": "function"
  },
  {
    "inputs": [
      { "internalType": "address", "name": "token", "type": "address" }
    ],
    "name": "isMeta",
    "outputs": [{ "internalType": "bool", "name": "", "type": "bool" }],
    "stateMutability": "view",
    "type": "function"
  }
]
