{
  "version": 2,
  "cli": {
    "defaultCollection": "@nrwl/node"
  },
  "defaultProject": "creditline",
  "generators": {
    "@nrwl/react": {
      "application": {
        "babel": true
      }
    },
    "@nrwl/next": {
      "application": {
        "style": "@emotion/styled",
        "linter": "eslint"
      }
    }
  },
  "projects": {
    "creditline": {
      "root": "apps/creditline",
      "sourceRoot": "apps/creditline",
      "projectType": "application",
      "targets": {
        "build": {
          "executor": "@nrwl/workspace:run-commands",
          "options": {
            "command": "yarn run build",
            "cwd": "apps/creditline",
            "color": true
          }
        },
        "start": {
          "executor": "@nrwl/workspace:run-commands",
          "options": {
            "command": "yarn start",
            "cwd": "apps/creditline",
            "color": true
          }
        },
        "start:server": {
          "executor": "@nrwl/workspace:run-commands",
          "options": {
            "command": "yarn start-dev",
            "cwd": "apps/creditline",
            "color": true
          }
        },
        "lint": {
          "executor": "@nrwl/linter:eslint",
          "options": {
            "lintFilePatterns": ["apps/creditline/**/*.{ts,tsx}"]
          }
        },
        "test": {
          "executor": "@nrwl/jest:jest",
          "options": {
            "jestConfig": "apps/creditline/jest.config.js",
            "passWithNoTests": true
          }
        }
      }
    }
  }
}
