{
  "version": 2,
  "cli": {
    "defaultCollection": "@nrwl/node"
  },
  "defaultProject": "burner-wallet-v2",
  "generators": {
    "@nrwl/react": {
      "application": {
        "babel": true
      }
    },
    "@nrwl/next": {
      "application": {
        "style": "@emotion/styled",
        "linter": "eslint"
      }
    }
  },
  "projects": {
    "core-utils": {
      "root": "libs/core-utils",
      "sourceRoot": "libs/core-utils/src",
      "projectType": "library",
      "targets": {
        "build": {
          "executor": "@nrwl/node:package",
          "outputs": ["{options.outputPath}"],
          "options": {
            "srcRootForCompilationRoot": "libs/core-utils/src",
            "outputPath": "libs/core-utils/dist",
            "tsConfig": "libs/core-utils/tsconfig.lib.json",
            "packageJson": "libs/core-utils/package.json",
            "main": "libs/core-utils/src/index.ts",
            "assets": ["libs/core-utils/*.md"]
          }
        },
        "lint": {
          "executor": "@nrwl/linter:eslint",
          "options": {
            "lintFilePatterns": ["libs/core-utils/src/**/*.ts"]
          }
        },
        "test": {
          "executor": "@nrwl/jest:jest",
          "outputs": ["coverage/libs/core-utils"],
          "options": {
            "jestConfig": "libs/core-utils/jest.config.js",
            "passWithNoTests": true
          }
        }
      }
    },
    "ui": {
      "root": "libs/ui",
      "sourceRoot": "libs/ui/src/",
      "projectType": "library",
      "generators": {},
      "targets": {
        "lint": {
          "executor": "@nrwl/linter:eslint",
          "options": {
            "lintFilePatterns": ["libs/ui/src/**/*.{ts,tsx}"]
          }
        },
        "build": {
          "executor": "@nrwl/workspace:run-commands",
          "options": {
            "commands": ["yarn run build:package", "cp ./package.json ./dist/"],
            "cwd": "./libs/ui",
            "color": true,
            "parallel": false
          }
        },
        "build-storybook": {
          "executor": "@nrwl/workspace:run-commands",
          "options": {
            "command": "yarn run build:storybook",
            "cwd": "./libs/ui",
            "color": true
          }
        },
        "deploy-chromatic": {
          "executor": "@nrwl/workspace:run-commands",
          "options": {
            "command": "yarn run deploy:chromatic",
            "cwd": "./libs/ui",
            "color": true
          }
        },
        "start": {
          "executor": "@nrwl/workspace:run-commands",
          "options": {
            "command": "yarn run start",
            "cwd": "./libs/ui",
            "color": true
          }
        }
      }
    },
    "toolkit": {
      "root": "libs/toolkit",
      "sourceRoot": "libs/toolkit/src/",
      "projectType": "library",
      "generators": {},
      "targets": {
        "lint": {
          "executor": "@nrwl/linter:eslint",
          "options": {
            "lintFilePatterns": ["libs/toolkit/src/**/*.{ts,tsx}"]
          }
        },
        "build": {
          "executor": "@nrwl/workspace:run-commands",
          "options": {
            "commands": ["yarn run build", "cp ./package.json ./dist/"],
            "cwd": "./libs/toolkit",
            "parallel": false,
            "color": true
          }
        }
      }
    },
    "synthereum-ts": {
      "root": "libs/synthereum-ts",
      "sourceRoot": "libs/synthereum-ts/src",
      "projectType": "library",
      "targets": {
        "build": {
          "executor": "@nrwl/node:package",
          "outputs": ["{options.outputPath}"],
          "options": {
            "outputPath": "libs/synthereum-ts/dist",
            "srcRootForCompilationRoot": "libs/synthereum-ts/src",
            "tsConfig": "libs/synthereum-ts/tsconfig.lib.json",
            "packageJson": "libs/synthereum-ts/package.json",
            "main": "libs/synthereum-ts/src/index.ts",
            "assets": ["libs/synthereum-ts/*.md"]
          }
        },
        "lint": {
          "executor": "@nrwl/linter:eslint",
          "options": {
            "lintFilePatterns": ["libs/synthereum-ts/src/**/*.ts"]
          }
        },
        "test": {
          "executor": "@nrwl/jest:jest",
          "outputs": ["coverage/libs/synthereum-ts"],
          "options": {
            "jestConfig": "libs/synthereum-ts/jest.config.js",
            "passWithNoTests": true
          }
        }
      }
    },
    "synthereum-config": {
      "root": "libs/synthereum-config",
      "sourceRoot": "libs/synthereum-config/src",
      "projectType": "library",
      "targets": {
        "build": {
          "executor": "@nrwl/node:package",
          "outputs": ["{options.outputPath}"],
          "options": {
            "outputPath": "libs/synthereum-config/dist",
            "srcRootForCompilationRoot": "libs/synthereum-config/src",
            "tsConfig": "libs/synthereum-config/tsconfig.lib.json",
            "packageJson": "libs/synthereum-config/package.json",
            "main": "libs/synthereum-config/src/index.ts",
            "assets": ["libs/synthereum-config/*.md"]
          }
        },
        "lint": {
          "executor": "@nrwl/linter:eslint",
          "options": {
            "lintFilePatterns": ["libs/synthereum-config/src/**/*.ts"]
          }
        },
        "test": {
          "executor": "@nrwl/jest:jest",
          "outputs": ["coverage/libs/synthereum-config"],
          "options": {
            "jestConfig": "libs/synthereum-config/jest.config.js",
            "passWithNoTests": true
          }
        }
      }
    },
    "meta-tx-lib": {
      "root": "libs/meta-tx-lib",
      "sourceRoot": "libs/meta-tx-lib/src",
      "projectType": "library",
      "targets": {
        "build": {
          "executor": "@nrwl/workspace:run-commands",
          "options": {
            "command": "yarn run build",
            "cwd": "libs/meta-tx-lib",
            "color": true
          }
        },
        "start": {
          "executor": "@nrwl/workspace:run-commands",
          "options": {
            "command": "yarn run start",
            "cwd": "libs/meta-tx-lib",
            "color": true
          }
        },
        "lint": {
          "executor": "@nrwl/linter:eslint",
          "options": {
            "lintFilePatterns": ["libs/meta-tx-lib/src/**/*.ts"]
          }
        },
        "test": {
          "executor": "@nrwl/jest:jest",
          "outputs": ["coverage/libs/meta-tx-lib"],
          "options": {
            "jestConfig": "libs/meta-tx-lib/jest.config.js",
            "passWithNoTests": true
          }
        }
      }
    },
    "burner-wallet-v2": {
      "root": "apps/burner-wallet-v2",
      "sourceRoot": "apps/burner-wallet-v2",
      "projectType": "application",
      "targets": {
        "build": {
          "executor": "@nrwl/next:build",
          "outputs": ["{options.outputPath}"],
          "options": {
            "root": "apps/burner-wallet-v2",
            "outputPath": "apps/burner-wallet-v2/out"
          },
          "configurations": {
            "production": {}
          },
          "dependsOn": [
            {
              "target": "copy-assets",
              "projects": "self"
            }
          ]
        },
        "start": {
          "executor": "@nrwl/next:server",
          "options": {
            "buildTarget": "burner-wallet-v2:build",
            "dev": true
          },
          "configurations": {
            "production": {
              "buildTarget": "burner-wallet-v2:build:production",
              "dev": false
            }
          },
          "dependsOn": [
            {
              "target": "copy-assets",
              "projects": "self"
            }
          ]
        },
        "copy-assets": {
          "executor": "@nrwl/workspace:run-commands",
          "outputs": ["apps/burner-wallet-v2/public/assets"],
          "options": {
            "command": "cp -r ../../libs/ui/dist/assets/ public/",
            "cwd": "./apps/burner-wallet-v2",
            "color": true
          },
          "dependsOn": [
            {
              "target": "build",
              "projects": "dependencies"
            }
          ]
        },
        "export": {
          "executor": "@nrwl/next:export",
          "options": {
            "buildTarget": "burner-wallet-v2:build:production"
          },
          "dependsOn": [
            {
              "target": "copy-assets",
              "projects": "self"
            }
          ]
        },
        "test": {
          "executor": "@nrwl/jest:jest",
          "outputs": ["coverage/apps/burner-wallet-v2"],
          "options": {
            "jestConfig": "apps/burner-wallet-v2/jest.config.js",
            "passWithNoTests": true
          }
        },
        "lint": {
          "executor": "@nrwl/linter:eslint",
          "options": {
            "lintFilePatterns": ["apps/burner-wallet-v2/**/*.{ts,tsx,js,jsx}"]
          }
        }
      }
    }
  }
}
