{
  "root": "libs/crypto-utils",
  "sourceRoot": "libs/crypto-utils/src",
  "projectType": "library",
  "targets": {
    "build": {
      "executor": "@nrwl/node:package",
      "outputs": ["{options.outputPath}"],
      "options": {
        "outputPath": "libs/crypto-utils/dist",
        "tsConfig": "libs/crypto-utils/tsconfig.lib.json",
        "packageJson": "libs/crypto-utils/package.json",
        "main": "libs/crypto-utils/src/index.ts",
        "assets": ["libs/crypto-utils/*.md"],
        "srcRootForCompilationRoot": "libs/crypto-utils/src"
      }
    },
    "lint": {
      "executor": "@nrwl/linter:eslint",
      "outputs": ["{options.outputFile}"],
      "options": {
        "lintFilePatterns": ["libs/crypto-utils/**/*.ts"]
      }
    },
    "test": {
      "executor": "@nrwl/jest:jest",
      "outputs": ["coverage/libs/crypto-utils"],
      "options": {
        "jestConfig": "libs/crypto-utils/jest.config.js",
        "passWithNoTests": true
      }
    }
  },
  "tags": []
}
