{
  "0xBeFaa064Ad33668C97D4C8C4d0237682B7D04E34": [
    {
      "admin": "0x539E625172026F8d2AC50648a55871FA728618e8",
      "maintainer": "0x5F960A547b2E67b9207AB0463e65b3817A5768B5"
    }
  ],
  "0x96452fFc312a5Bbf2C1Bf25F2196d3dC4ebe109b": [
    "0xBeFaa064Ad33668C97D4C8C4d0237682B7D04E34",
    {
      "admin": "0x539E625172026F8d2AC50648a55871FA728618e8",
      "maintainer": "0x8Eadb31D981509c1a2e55111C5b9c56788c89486"
    }
  ],
  "0x6De2dd54A1FBBaCAd9a42eC289c5B371be2C9EF1": [
    "0xBeFaa064Ad33668C97D4C8C4d0237682B7D04E34"
  ],
  "0x61fa26046F9D5e47d15495Ef00efD9339E14E568": [
    "0xBeFaa064Ad33668C97D4C8C4d0237682B7D04E34"
  ],
  "0x88e6BBcB14ab9E9103378230C4A8a0FC3c50e0B8": [
    {
      "admin": "0x539E625172026F8d2AC50648a55871FA728618e8",
      "maintainer": "0x8Eadb31D981509c1a2e55111C5b9c56788c89486"
    }
  ],
  "0x15a2870d62d7e08622bafC5832404e284AF5CdC7": [
    "0xBeFaa064Ad33668C97D4C8C4d0237682B7D04E34",
    {
      "admin": "0x539E625172026F8d2AC50648a55871FA728618e8",
      "maintainer": "0x8Eadb31D981509c1a2e55111C5b9c56788c89486"
    }
  ],
  "0x77Bbf165C375291dF0C9158B7974FA3e152eAfB3": [
    "0xBeFaa064Ad33668C97D4C8C4d0237682B7D04E34"
  ],
  "0x3ae9d557CCBbC6906B4DCA9C361eA081A214eA40": [],
  "0xbe5aD359f3C02A948eFE75edA874E55E43f4F953": [],
  "0x8549ECFE2Dd52DB22b54F8dA78A2DBef4bcde21b": [],
  "0xD024dCD46fa5466CECC5ccd805ff74593764307c": [],
  "0xdFF7F1719bBC39Af1677E332c5141e363fC851dF": [
    "0xeD0169a88d267063184b0853BaAAAe66c3c154B2",
    "0xBeFaa064Ad33668C97D4C8C4d0237682B7D04E34",
    "0x0000000000000000000000000000000000000000"
  ],
  "0x962Ad60336fA5ECCc85733c60aAD07b27D427d9C": [],
  "0x7Cd3461d04cEE6EbEB9DE75B377D05b65B01738a": [
    "0xBeFaa064Ad33668C97D4C8C4d0237682B7D04E34"
  ],
  "0x44384251bd7f6734D7A885CEF35B78ab35F68a6B": [
    "0xBeFaa064Ad33668C97D4C8C4d0237682B7D04E34",
    {
      "admin": "0x539E625172026F8d2AC50648a55871FA728618e8",
      "maintainer": "0x8Eadb31D981509c1a2e55111C5b9c56788c89486"
    }
  ],
  "0x2D6c31B3eca8bBeb090460b933D7eb14c61281d5": [],
  "0xEE49dc75EA6630050A73ee33704955Ae8896432b": [],
  "0x18393070127688f4eBD3e38d369cf3DBA70bA46D": [],
  "0xBef33c8048DC361D770CD1D84560c899b7Ee5249": [
    "0xeD0169a88d267063184b0853BaAAAe66c3c154B2",
    "0xBeFaa064Ad33668C97D4C8C4d0237682B7D04E34",
    "0x0000000000000000000000000000000000000000"
  ],
  "0x307e29696a9460f7ca9BA1F0E6A23303bb90fBf3": [
    "0xBeFaa064Ad33668C97D4C8C4d0237682B7D04E34",
    {
      "admin": "0x539E625172026F8d2AC50648a55871FA728618e8",
      "maintainer": "0x8Eadb31D981509c1a2e55111C5b9c56788c89486"
    }
  ]
}
