{
  "0x02c72Fc6C231eE0f0e313c966e2da5cb7a52B503": [
    {
      "admin": "0x20c7ec810e723c8c486b9345b1A6D23e615c946c",
      "maintainer": "0x685723B9dC89BDF28BA5F98F9A8c0aC899bD6E77"
    }
  ],
  "0x0374a0dc2F47ea75C900A63A244c3E6555b7e830": [
    "0x02c72Fc6C231eE0f0e313c966e2da5cb7a52B503",
    {
      "admin": "0x20c7ec810e723c8c486b9345b1A6D23e615c946c",
      "maintainer": "0x685723B9dC89BDF28BA5F98F9A8c0aC899bD6E77"
    }
  ],
  "0x8FEceC5629EED60D18Fd3438aae4a8E69723D190": [
    "0x02c72Fc6C231eE0f0e313c966e2da5cb7a52B503"
  ],
  "0x83a840079Bf772683eB5b7409B5fbC4459d24e53": [
    {
      "admin": "0x20c7ec810e723c8c486b9345b1A6D23e615c946c",
      "maintainer": "0x685723B9dC89BDF28BA5F98F9A8c0aC899bD6E77"
    }
  ],
  "0x1418830Ad554bECAF76a4058eEc6BEe9AC002e19": [
    "0x02c72Fc6C231eE0f0e313c966e2da5cb7a52B503",
    {
      "admin": "0x20c7ec810e723c8c486b9345b1A6D23e615c946c",
      "maintainer": "0x685723B9dC89BDF28BA5F98F9A8c0aC899bD6E77"
    }
  ],
  "0x348E4B25077c5133450eDad060EA4d8dB667913d": [
    {
      "admin": "0x20c7ec810e723c8c486b9345b1A6D23e615c946c",
      "maintainer": "0x685723B9dC89BDF28BA5F98F9A8c0aC899bD6E77"
    }
  ],
  "0x2aA25770E92DE3D61544E1c5245e8C968DdC34C5": [
    {
      "admin": "0x20c7ec810e723c8c486b9345b1A6D23e615c946c",
      "maintainer": "0x685723B9dC89BDF28BA5F98F9A8c0aC899bD6E77"
    }
  ],
  "0x697240b2124bEd2B19FB003Ec4e4cFb5b125B0D1": [
    "0x02c72Fc6C231eE0f0e313c966e2da5cb7a52B503"
  ],
  "0xd0B5376b91E06Fb1296F803AE8879B49740cE89f": [],
  "0x03BC653285f8527e1C877b18dF285E66898864b3": [
    "0x02c72Fc6C231eE0f0e313c966e2da5cb7a52B503"
  ],
  "0xa513A13Db767d4609eCe1c705dBeeFB0f5822224": [
    "0x02c72Fc6C231eE0f0e313c966e2da5cb7a52B503",
    {
      "admin": "0x20c7ec810e723c8c486b9345b1A6D23e615c946c",
      "maintainer": "0x685723B9dC89BDF28BA5F98F9A8c0aC899bD6E77"
    }
  ]
}
