{
  "42": {
    "EURUSD": {
      "type": 0,
      "aggregator": "0x0c15Ab9A0DB086e062194c273CC79f41597Bbf13",
      "intermediatePairs": [],
      "convertionMetricUnit": 0
    },
    "CHFUSD": {
      "type": 0,
      "aggregator": "0xed0616BeF04D374969f302a34AE4A63882490A8C",
      "intermediatePairs": [],
      "convertionMetricUnit": 0
    },
    "GBPUSD": {
      "type": 0,
      "aggregator": "0x28b0061f44E6A9780224AA61BEc8C3Fcb0d37de9",
      "intermediatePairs": [],
      "convertionMetricUnit": 0
    },
    "XAUUSD": {
      "type": 0,
      "aggregator": "0xc8fb5684f2707C82f28595dEaC017Bfdf44EE9c5",
      "intermediatePairs": []
    }
  },
  "4": {
    "EURUSD": {
      "type": 0,
      "aggregator": "0x78F9e60608bF48a1155b4B2A5e31F32318a1d85F",
      "intermediatePairs": [],
      "convertionMetricUnit": 0
    },
    "CHFUSD": {
      "type": 0,
      "aggregator": "0x5e601CF5EF284Bcd12decBDa189479413284E1d2",
      "intermediatePairs": [],
      "convertionMetricUnit": 0
    },
    "GBPUSD": {
      "type": 0,
      "aggregator": "0x7B17A813eEC55515Fb8F49F2ef51502bC54DD40F",
      "intermediatePairs": [],
      "convertionMetricUnit": 0
    },
    "XAUUSD": {
      "type": 0,
      "aggregator": "0x81570059A0cb83888f1459Ec66Aad1Ac16730243",
      "intermediatePairs": [],
      "convertionMetricUnit": 0
    }
  },
  "1": {
    "EURUSD": {
      "type": 0,
      "aggregator": "0xb49f677943BC038e9857d61E7d053CaA2C1734C1",
      "intermediatePairs": [],
      "convertionMetricUnit": 0
    },
    "CHFUSD": {
      "type": 0,
      "aggregator": "0x449d117117838fFA61263B61dA6301AA2a88B13A",
      "intermediatePairs": [],
      "convertionMetricUnit": 0
    },
    "GBPUSD": {
      "type": 0,
      "aggregator": "0x5c0Ab2d9b5a7ed9f470386e82BB36A3613cDd4b5",
      "intermediatePairs": [],
      "convertionMetricUnit": 0
    }
  },
  "80001": {
    "EURUSD": {
      "type": 1,
      "aggregator": "0x7d7356bF6Ee5CDeC22B216581E48eCC700D0497A",
      "intermediatePairs": [],
      "convertionMetricUnit": 0
    },
    "CHFUSD": {
      "type": 1,
      "aggregator": "0xddDf19b692eDfCcD84052D74b2F53a6222F6E74F",
      "intermediatePairs": [],
      "convertionMetricUnit": 0
    },
    "USDCHF": {
      "type": 2,
      "aggregator": "0xddDf19b692eDfCcD84052D74b2F53a6222F6E74F",
      "intermediatePairs": [],
      "convertionMetricUnit": 0
    }
  },
  "3": {
    "EURUSD": {
      "type": 0,
      "aggregator": "",
      "intermediatePairs": [],
      "convertionMetricUnit": 0
    },
    "CHFUSD": {
      "type": 0,
      "aggregator": "",
      "intermediatePairs": [],
      "convertionMetricUnit": 0
    },
    "GBPUSD": {
      "type": 0,
      "aggregator": "",
      "intermediatePairs": [],
      "convertionMetricUnit": 0
    }
  },
  "137": {
    "EURUSD": {
      "type": 1,
      "aggregator": "0x73366Fe0AA0Ded304479862808e02506FE556a98",
      "convertionMetricUnit": 0,
      "maxSpread": "1000000000000000"
    },
    "USDMAI": {
      "type": 2,
      "aggregator": "0xd8d483d813547CfB624b8Dc33a00F2fcbCd2D428",
      "convertionMetricUnit": 0,
      "maxSpread": "10000000000000000"
    },
    "USDETH": {
      "type": 2,
      "aggregator": "0xF9680D99D6C9589e2a93a78A04A279e509205945",
      "convertionMetricUnit": 0,
      "maxSpread": "1000000000000000"
    },
    "CHFUSD": {
      "type": 1,
      "aggregator": "0xc76f762CedF0F78a439727861628E0fdfE1e70c2",
      "convertionMetricUnit": 0,
      "maxSpread": "1000000000000000"
    },
    "GBPUSD": {
      "type": 1,
      "aggregator": "0x099a2540848573e94fb1Ca0Fa420b00acbBc845a",
      "convertionMetricUnit": 0,
      "maxSpread": "1000000000000000"
    },
    "PHPUSD": {
      "type": 1,
      "aggregator": "0x218231089Bebb2A31970c3b77E96eCfb3BA006D1",
      "convertionMetricUnit": 0,
      "maxSpread": "2000000000000000"
    },
    "SGDUSD": {
      "type": 1,
      "aggregator": "0x8CE3cAc0E6635ce04783709ca3CC4F5fc5304299",
      "convertionMetricUnit": 0,
      "maxSpread": "1000000000000000"
    },
    "CADUSD": {
      "type": 1,
      "aggregator": "0xACA44ABb8B04D07D883202F99FA5E3c53ed57Fb5",
      "convertionMetricUnit": 0,
      "maxSpread": "1000000000000000"
    },
    "JPYUSD": {
      "type": 1,
      "aggregator": "0xD647a6fC9BC6402301583C91decC5989d8Bc382D",
      "convertionMetricUnit": 0,
      "maxSpread": "3000000000000000"
    },
    "SEKUSD": {
      "type": 1,
      "aggregator": "0xbd92B4919ae82be8473859295dEF0e778A626302",
      "convertionMetricUnit": 0,
      "maxSpread": "2000000000000000"
    },
    "AUDUSD": {
      "type": 1,
      "aggregator": "0x062Df9C4efd2030e243ffCc398b652e8b8F95C6f",
      "convertionMetricUnit": 0,
      "maxSpread": "1000000000000000"
    },
    "COPUSD": {
      "type": 1,
      "aggregator": "0xDe6302Dfa0ac45B2B1b1a23304469DA630b2F59B",
      "convertionMetricUnit": 0,
      "maxSpread": "2000000000000000"
    },
    "CNYUSD": {
      "type": 1,
      "aggregator": "0x04bB437Aa63E098236FA47365f0268547f6EAB32",
      "convertionMetricUnit": 0,
      "maxSpread": "3000000000000000"
    },
    "NZDUSD": {
      "type": 1,
      "aggregator": "0xa302a0B8a499fD0f00449df0a490DedE21105955",
      "convertionMetricUnit": 0,
      "maxSpread": "3000000000000000"
    },
    "PLNUSD": {
      "type": 1,
      "aggregator": "0xB34BCE11040702f71c11529D00179B2959BcE6C0",
      "convertionMetricUnit": 0,
      "maxSpread": "3000000000000000"
    },
    "MXNUSD": {
      "type": 1,
      "aggregator": "0x171b16562EA3476F5C61d1b8dad031DbA0768545",
      "convertionMetricUnit": 0,
      "maxSpread": "3000000000000000"
    },
    "KRWUSD": {
      "type": 1,
      "aggregator": "0x24B820870F726dA9B0D83B0B28a93885061dbF50",
      "convertionMetricUnit": 0,
      "maxSpread": "3000000000000000"
    },
    "XAUUSD": {
      "type": 1,
      "aggregator": "0x0C466540B2ee1a31b441671eac0ca886e051E410",
      "convertionMetricUnit": 0,
      "maxSpread": "3000000000000000"
    },
    "TRYUSD": {
      "type": 1,
      "aggregator": "0xd78325DcA0F90F0FFe53cCeA1B02Bb12E1bf8FdB",
      "convertionMetricUnit": 0,
      "maxSpread": "1000000000000000"
    },
    "BRLUSD": {
      "type": 1,
      "aggregator": "0xB90DA3ff54C3ED09115abf6FbA0Ff4645586af2c",
      "convertionMetricUnit": 0,
      "maxSpread": "3000000000000000"
    },
    "USDMATIC": {
      "type": 2,
      "aggregator": "0xAB594600376Ec9fD91F8e885dADF0CE036862dE0",
      "convertionMetricUnit": 0,
      "maxSpread": "3000000000000000"
    },
    "USDBTC": {
      "type": 2,
      "aggregator": "0xc907E116054Ad103354f2D350FD2514433D57F6f",
      "convertionMetricUnit": 0,
      "maxSpread": "3000000000000000"
    },
    "USDXAU": {
      "type": 2,
      "aggregator": "0x0C466540B2ee1a31b441671eac0ca886e051E410",
      "convertionMetricUnit": 0,
      "maxSpread": "3000000000000000"
    },
    "USDMXN": {
      "type": 2,
      "aggregator": "0x171b16562EA3476F5C61d1b8dad031DbA0768545",
      "convertionMetricUnit": 0,
      "maxSpread": "3000000000000000"
    },
    "USDBRL": {
      "type": 2,
      "aggregator": "0xB90DA3ff54C3ED09115abf6FbA0Ff4645586af2c",
      "convertionMetricUnit": 0,
      "maxSpread": "3000000000000000"
    },
    "USDCAD": {
      "type": 2,
      "aggregator": "0xACA44ABb8B04D07D883202F99FA5E3c53ed57Fb5",
      "convertionMetricUnit": 0,
      "maxSpread": "1000000000000000"
    },
    "USDCHF": {
      "type": 2,
      "aggregator": "0xc76f762CedF0F78a439727861628E0fdfE1e70c2",
      "convertionMetricUnit": 0,
      "maxSpread": "1000000000000000"
    },
    "USDGBP": {
      "type": 2,
      "aggregator": "0x099a2540848573e94fb1Ca0Fa420b00acbBc845a",
      "convertionMetricUnit": 0,
      "maxSpread": "1000000000000000"
    },
    "USDSGD": {
      "type": 2,
      "aggregator": "0x8CE3cAc0E6635ce04783709ca3CC4F5fc5304299",
      "convertionMetricUnit": 0,
      "maxSpread": "1000000000000000"
    },
    "ETHWSTETH": {
      "type": 2,
      "aggregator": "0x10f964234cae09cB6a9854B56FF7D4F38Cda5E6a",
      "convertionMetricUnit": 0,
      "maxSpread": "3000000000000000"
    },
    "USDEUR": {
      "type": 2,
      "aggregator": "0x73366Fe0AA0Ded304479862808e02506FE556a98",
      "convertionMetricUnit": 0,
      "maxSpread": "1000000000000000"
    },
    "ETHUSD": {
      "type": 1,
      "aggregator": "0xF9680D99D6C9589e2a93a78A04A279e509205945",
      "convertionMetricUnit": 0,
      "maxSpread": "1000000000000000"
    },
    "USDCUSD": {
      "type": 1,
      "aggregator": "0xfE4A8cc5b5B2366C1B58Bea3858e81843581b2F7",
      "convertionMetricUnit": 0,
      "maxSpread": "1000000000000000"
    },
    "BTCUSD": {
      "type": 1,
      "aggregator": "0xc907E116054Ad103354f2D350FD2514433D57F6f",
      "convertionMetricUnit": 0,
      "maxSpread": "3000000000000000"
    },
    "MATICUSD": {
      "type": 1,
      "aggregator": "0xAB594600376Ec9fD91F8e885dADF0CE036862dE0",
      "convertionMetricUnit": 0,
      "maxSpread": "3000000000000000"
    },
    "WSTETHETH": {
      "type": 1,
      "aggregator": "0x10f964234cae09cB6a9854B56FF7D4F38Cda5E6a",
      "convertionMetricUnit": 0,
      "maxSpread": "3000000000000000"
    },
    "USDSTMATIC": {
      "type": 2,
      "aggregator": "0x97371dF4492605486e23Da797fA68e55Fc38a13f",
      "convertionMetricUnit": 0,
      "maxSpread": "5000000000000000"
    },
    "STMATICUSD": {
      "type": 1,
      "aggregator": "0x97371dF4492605486e23Da797fA68e55Fc38a13f",
      "convertionMetricUnit": 0,
      "maxSpread": "5000000000000000"
    }
  },
  "56": {
    "USDBNB": {
      "type": 1,
      "aggregator": "0x0567F2323251f0Aab15c8dFb1967E4e8A7D42aeE",
      "intermediatePairs": [],
      "convertionMetricUnit": 0
    },
    "EURBNB": {
      "type": 2,
      "aggregator": "0x0000000000000000000000000000000000000000",
      "intermediatePairs": ["EURUSD", "USDBNB"],
      "convertionMetricUnit": 0
    },
    "USDETH": {
      "type": 1,
      "aggregator": "0x9ef1B8c0E4F7dc8bF5719Ea496883DC6401d5b2e",
      "intermediatePairs": [],
      "convertionMetricUnit": 0
    },
    "EURETH": {
      "type": 2,
      "aggregator": "0x0000000000000000000000000000000000000000",
      "intermediatePairs": ["EURUSD", "USDETH"],
      "convertionMetricUnit": 0
    },
    "USDBTC": {
      "type": 1,
      "aggregator": "0x264990fbd0A4796A3E3d8E37C4d5F87a3aCa5Ebf",
      "intermediatePairs": [],
      "convertionMetricUnit": 0
    },
    "EURBTC": {
      "type": 2,
      "aggregator": "0x0000000000000000000000000000000000000000",
      "intermediatePairs": ["EURUSD", "USDBTC"],
      "convertionMetricUnit": 0
    },
    "USDBRL": {
      "type": 1,
      "aggregator": "0x5cb1Cb3eA5FB46de1CE1D0F3BaDB3212e8d8eF48",
      "intermediatePairs": [],
      "convertionMetricUnit": 0
    },
    "EURBRL": {
      "type": 2,
      "aggregator": "0x0000000000000000000000000000000000000000",
      "intermediatePairs": ["EURUSD", "USDBRL"],
      "convertionMetricUnit": 0
    },
    "USDCHF": {
      "type": 1,
      "aggregator": "0x964261740356cB4aaD0C3D2003Ce808A4176a46d",
      "intermediatePairs": [],
      "convertionMetricUnit": 0
    },
    "EURCHF": {
      "type": 2,
      "aggregator": "0x0000000000000000000000000000000000000000",
      "intermediatePairs": ["EURUSD", "USDCHF"],
      "convertionMetricUnit": 0
    },
    "USDGBP": {
      "type": 1,
      "aggregator": "0x8FAf16F710003E538189334541F5D4a391Da46a0",
      "intermediatePairs": [],
      "convertionMetricUnit": 0
    },
    "EURGBP": {
      "type": 2,
      "aggregator": "0x0000000000000000000000000000000000000000",
      "intermediatePairs": ["EURUSD", "USDGBP"],
      "convertionMetricUnit": 0
    },
    "CHFBNB": {
      "type": 2,
      "aggregator": "0x0000000000000000000000000000000000000000",
      "intermediatePairs": ["CHFUSD", "USDBNB"],
      "convertionMetricUnit": 0
    },
    "CHFETH": {
      "type": 2,
      "aggregator": "0x0000000000000000000000000000000000000000",
      "intermediatePairs": ["CHFUSD", "USDETH"],
      "convertionMetricUnit": 0
    },
    "CHFBTC": {
      "type": 2,
      "aggregator": "0x0000000000000000000000000000000000000000",
      "intermediatePairs": ["CHFUSD", "USDBTC"],
      "convertionMetricUnit": 0
    },
    "CHFBRL": {
      "type": 2,
      "aggregator": "0x0000000000000000000000000000000000000000",
      "intermediatePairs": ["CHFUSD", "USDBRL"],
      "convertionMetricUnit": 0
    },
    "USDEUR": {
      "type": 1,
      "aggregator": "0x0bf79F617988C472DcA68ff41eFe1338955b9A80",
      "intermediatePairs": [],
      "convertionMetricUnit": 0
    },
    "CHFEUR": {
      "type": 2,
      "aggregator": "0x0000000000000000000000000000000000000000",
      "intermediatePairs": ["CHFUSD", "USDEUR"],
      "convertionMetricUnit": 0
    },
    "CHFGBP": {
      "type": 2,
      "aggregator": "0x0000000000000000000000000000000000000000",
      "intermediatePairs": ["CHFUSD", "USDGBP"],
      "convertionMetricUnit": 0
    },
    "BRLCHF": {
      "type": 2,
      "aggregator": "0x0000000000000000000000000000000000000000",
      "intermediatePairs": ["BRLUSD", "USDCHF"],
      "convertionMetricUnit": 0
    },
    "BRLGBP": {
      "type": 2,
      "aggregator": "0x0000000000000000000000000000000000000000",
      "intermediatePairs": ["BRLUSD", "USDGBP"],
      "convertionMetricUnit": 0
    },
    "BRLBNB": {
      "type": 2,
      "aggregator": "0x0000000000000000000000000000000000000000",
      "intermediatePairs": ["BRLUSD", "USDBNB"],
      "convertionMetricUnit": 0
    },
    "BRLETH": {
      "type": 2,
      "aggregator": "0x0000000000000000000000000000000000000000",
      "intermediatePairs": ["BRLUSD", "USDETH"],
      "convertionMetricUnit": 0
    },
    "BRLBTC": {
      "type": 2,
      "aggregator": "0x0000000000000000000000000000000000000000",
      "intermediatePairs": ["BRLUSD", "USDBTC"],
      "convertionMetricUnit": 0
    },
    "BRLEUR": {
      "type": 2,
      "aggregator": "0x0000000000000000000000000000000000000000",
      "intermediatePairs": ["BRLUSD", "USDEUR"],
      "convertionMetricUnit": 0
    }
  },
  "97": {},
  "100": {
    "CHFUSD": {
      "type": 0,
      "aggregator": "0xFb00261Af80ADb1629D3869E377ae1EEC7bE659F",
      "intermediatePairs": [],
      "convertionMetricUnit": 0
    }
  },
  "250": {
    "EURUSD": {
      "type": 0,
      "aggregator": "0x3E68e68ea2c3698400465e3104843597690ae0f7",
      "intermediatePairs": [],
      "convertionMetricUnit": 0
    }
  },
  "43114": {
    "CHFUSD": {
      "type": 0,
      "aggregator": "0x3B37950485b450edF90cBB85d0cD27308Af4AB9A",
      "intermediatePairs": [],
      "convertionMetricUnit": 0
    }
  },
  "420": {
    "EURUSD": {
      "type": 1,
      "aggregator": "0x619AeaaF08dF3645e138C611bddCaE465312Ef6B",
      "convertionMetricUnit": 0,
      "maxSpread": "1000000000000000"
    }
  },
  "10": {
    "EURUSD": {
      "type": 0,
      "aggregator": "0x3626369857A10CcC6cc3A6e4f5C2f5984a519F20",
      "intermediatePairs": []
    },
    "WSTETHUSD": {
      "type": 0,
      "aggregator": "0x698B585CbC4407e2D54aa898B2600B53C68958f7",
      "intermediatePairs": [],
      "convertionMetricUnit": 0
    },
    "USDWSTETH": {
      "type": 1,
      "aggregator": "0x698B585CbC4407e2D54aa898B2600B53C68958f7",
      "intermediatePairs": [],
      "convertionMetricUnit": 0
    },
    "EURWSTETH": {
      "type": 2,
      "aggregator": "0x0000000000000000000000000000000000000000",
      "intermediatePairs": ["EURUSD", "USDWSTETH"],
      "convertionMetricUnit": 0
    }
  },
  "421613": {},
  "42161": {
    "EURUSD": {
      "type": 0,
      "aggregator": "0xA14d53bC1F1c0F31B4aA3BD109344E5009051a84",
      "intermediatePairs": [],
      "convertionMetricUnit": 0
    },
    "USDETH": {
      "type": 1,
      "aggregator": "0x639Fe6ab55C921f74e7fac1ee960C0B6293ba612",
      "intermediatePairs": [],
      "convertionMetricUnit": 0
    },
    "EURETH": {
      "type": 2,
      "aggregator": "0x0000000000000000000000000000000000000000",
      "intermediatePairs": ["EURUSD", "USDETH"],
      "convertionMetricUnit": 0
    },
    "USDBTC": {
      "type": 1,
      "aggregator": "0x6ce185860a4963106506C203335A2910413708e9",
      "intermediatePairs": [],
      "convertionMetricUnit": 0
    },
    "EURBTC": {
      "type": 2,
      "aggregator": "0x0000000000000000000000000000000000000000",
      "intermediatePairs": ["EURUSD", "USDBTC"],
      "convertionMetricUnit": 0
    },
    "EURWSTETH": {
      "type": 2,
      "aggregator": "0x0000000000000000000000000000000000000000",
      "intermediatePairs": ["EURUSD", "USDSTETH", "STETHWSTETH"],
      "convertionMetricUnit": 0
    },
    "USDSTETH": {
      "type": 1,
      "aggregator": "0x07C5b924399cc23c24a95c8743DE4006a32b7f2a",
      "intermediatePairs": [],
      "convertionMetricUnit": 0
    },
    "STETHWSTETH": {
      "type": 1,
      "aggregator": "0xB1552C5e96B312d0Bf8b554186F846C40614a540",
      "intermediatePairs": [],
      "convertionMetricUnit": 0
    }
  },
  "43113": {
    "EURUSD": {
      "type": 1,
      "aggregator": "0xf4E03DBc0D0Bfc7C2D50c965107a74139Ab48ABD",
      "convertionMetricUnit": 0,
      "maxSpread": "10000000000000000"
    }
  }
}
