{
  "42": {
    "isEnabled": true,
    "SelfMintingDerivative": 1,
    "SynthToken": {
      "jCHF": "0x7AF02727268E1914eF39241B9Aa3220c9B9CF0a3",
      "jGBP": "0x08654C14d7807cEc6042e86F19B79Bab64c3D648"
    }
  },
  "1": {
    "isEnabled": true,
    "SelfMintingDerivative": 1,
    "SynthToken": {
      "jEUR": "0x0f17BC9a994b87b5225cFb6a2Cd4D667ADb4F20B",
      "jCHF": "0x53dfEa0A8CC2A2A2e425E1C174Bc162999723ea0",
      "jGBP": "0x7409856CAE628f5d578B285B45669b36E7005283"
    }
  },
  "97": {
    "isEnabled": true,
    "SelfMintingDerivative": 2,
    "SynthToken": {
      "jEUR": "0xAe40B3E4AD42fFCc26F7112cAFD657E208287024"
    }
  },
  "80001": {
    "isEnabled": true,
    "SelfMintingDerivative": 2,
    "SynthToken": {
      "jEUR": "0x02CBE6055F8aad745321f70d6aDD4711455c7F45"
    }
  },
  "137": {
    "isEnabled": true,
    "SelfMintingDerivative": 2,
    "SynthToken": {
      "jMXN": "0xBD1fe73e1f12bD2bc237De9b626F056f21f86427",
      "jEUR": "0x4e3Decbb3645551B8A19f0eA1678079FCB33fB4c",
      "jBRL": "0xf2f77FE7b8e66571E0fca7104c4d670BF1C8d722",
      "jCHF": "0xbD1463F02f61676d53fd183C2B19282BFF93D099"
    }
  },
  "10": {
    "isEnabled": true,
    "SelfMintingDerivative": 2,
    "SynthToken": {
      "jEUR": "0x79AF5dd14e855823FA3E9ECAcdF001D99647d043"
    }
  },
  "56": {
    "isEnabled": true,
    "SelfMintingDerivative": 2,
    "SynthToken": {
      "jEUR": "0x23b8683ff98f9e4781552dfe6f12aa32814924e8",
      "jCHF": "0x7c869b5a294b1314e985283d01c702b62224a05f",
      "jBRL": "0x316622977073bbc3df32e7d2a9b3c77596a0a603"
    }
  },
  "42161": {
    "isEnabled": true,
    "SelfMintingDerivative": 2,
    "SynthToken": {
      "jEUR": "0xAD435674417520aeeED6b504bBe654d4f556182F"
    }
  }
}
