<?xml version="1.0" encoding="UTF-8" standalone="no"?>
<!DOCTYPE svg PUBLIC "-//W3C//DTD SVG 1.1//EN" "http://www.w3.org/Graphics/SVG/1.1/DTD/svg11.dtd">
<svg width="100%" height="100%" viewBox="0 0 427 640" version="1.1" xmlns="http://www.w3.org/2000/svg" xmlns:xlink="http://www.w3.org/1999/xlink" xml:space="preserve" xmlns:serif="http://www.serif.com/" style="fill-rule:evenodd;clip-rule:evenodd;stroke-linecap:round;stroke-linejoin:round;stroke-miterlimit:1.5;">
    <g transform="matrix(1.37632,0,0,1.37632,-98.7799,-77.2365)">
        <path d="M218.146,389.327C218.146,389.327 212.746,391.099 208.451,392.558C204.156,394.017 193.673,392.768 188.083,393.34C182.493,393.912 171.726,392.195 167.841,394.226C163.956,396.257 162.219,397.663 159.062,399.748C155.904,401.833 154.199,398.656 156.378,394.955C158.557,391.255 161.044,385.241 163.665,383.521C166.286,381.801 173.903,381.408 177.062,381.668C180.22,381.929 177.662,378.803 171.283,379.897C164.904,380.991 163.88,380.54 159.113,384.921C155.111,388.6 150.289,388.89 152.815,383.262C154.355,379.829 155.38,377.074 158.191,373.062C161.001,369.05 165.568,369.372 169.799,368.017C174.03,366.661 172.532,366.654 169.017,367.291L177.156,359.002C177.156,359.002 192.978,346.444 203.399,346.444C213.819,346.444 215.651,345.716 221.24,348.842C226.83,351.968 226.672,352.384 234.251,351.29C241.83,350.197 229.483,347.695 222.883,363.275C216.283,378.855 217.197,376.979 218.146,389.327Z" style="fill:rgb(235,235,235);"/>
    </g>
    <g transform="matrix(1.37632,0,0,1.37632,-98.7799,-77.2365)">
        <path d="M159.062,399.748C159.062,399.748 155.482,399.163 158.539,394.285C161.596,389.408 161.243,387.532 163.92,385.531C166.597,383.531 163.212,381.738 160.66,386.699C158.109,391.659 155.254,395.244 155.608,398.912C155.796,400.86 156.636,400.291 157.103,400.199C157.514,400.119 157.448,400.688 159.062,399.748Z" style="fill:rgb(243,243,243);"/>
    </g>
    <g transform="matrix(1.37632,0,0,1.37632,-98.7799,-77.2365)">
        <path d="M171.903,382.53C171.903,382.53 179.28,383.988 180.063,380.904C180.846,377.82 174.835,375.952 171.626,376.827C168.418,377.702 171.575,373.734 173.848,371.275C176.121,368.816 181.273,370.375 181.273,370.375C181.273,370.375 182.923,371.225 184.566,369.334C187.133,366.381 184.838,362.188 187.162,360.145C189.486,358.103 190.496,355.644 194.412,353.643C198.328,351.642 202.9,349.182 207.776,346.931C212.652,344.681 181.528,347.766 181.528,347.766L164.237,366.871C164.237,366.871 159.72,371.641 156.562,376.559C153.404,381.478 150.361,386.59 152.392,388.651C153.711,389.989 156.424,389.381 159.464,385.852C163.368,381.322 169.099,382.488 171.903,382.53Z" style="fill:rgb(223,223,223);"/>
    </g>
    <path d="M159.973,413.206C159.973,413.206 161.11,415.551 155.994,417.322C150.878,419.094 150.088,418.833 145.73,421.282C141.373,423.731 138.815,427.431 138.815,427.431C138.815,427.431 146.646,428.212 148.51,429.15C150.373,430.089 152.553,430.609 146.489,430.766C140.426,430.922 140.047,430.297 136.005,430.766C131.963,431.234 127.446,431.86 124.067,434.518C120.688,437.175 121.1,438.27 116.899,446.502C112.699,454.734 115.258,454.108 118.952,452.441C122.646,450.774 124.067,450.357 124.067,450.357C124.067,450.357 117.152,455.933 114.247,456.975C111.342,458.017 108.372,455.358 112.352,448.429C116.331,441.499 120.531,432.173 120.531,432.173L159.973,413.206Z" style="fill:rgb(205,205,205);"/>
    <g transform="matrix(1.37632,0,0,1.37632,-98.7799,-77.2365)">
        <path d="M221.24,348.842C221.24,348.842 210.025,346.599 204.315,350.141C198.606,353.684 187.161,362.313 186.909,367.065C186.657,371.817 188.197,371.859 186.025,374.61C183.852,377.361 180.922,377.862 184.105,379.654C187.288,381.446 188.879,380.529 186.378,381.821C183.878,383.113 181.25,382.947 183.7,385.906C186.151,388.866 187.187,388.241 191.608,384.364C196.029,380.488 201.056,382.113 202.143,378.153C203.229,374.193 205.149,373.067 208.964,376.777C212.778,380.488 217.048,379.238 218.842,375.069C220.635,370.9 224.55,358.687 228.921,354.852C233.293,351.016 232.105,353.434 226.496,352.309C220.888,351.184 221.24,348.842 221.24,348.842Z" style="fill:rgb(243,243,243);fill-opacity:0.6;"/>
    </g>
    <g transform="matrix(1.37632,0,0,1.37632,-98.7799,-77.2365)">
        <path d="M232.709,115.162C232.709,115.162 227.44,118.08 223.795,117.485C220.15,116.89 200.625,113.018 193.119,120.641C185.612,128.264 185.25,135.826 179.332,139.34C173.413,142.853 167.567,151.963 170.166,161.968C172.764,171.972 173.34,177.749 168.757,182.155C164.175,186.562 166.016,188.229 162.984,191.266C159.951,194.303 155.694,201.032 158.184,210.202C160.673,219.373 162.334,223.601 163.128,230.926C163.921,238.25 168.576,248.671 164.246,251.351C159.916,254.03 153.731,251.513 153.298,264.197C152.865,276.881 156.187,266.816 153.877,272.831C151.566,278.845 148.897,282.061 148.175,285.395C147.452,288.73 143.453,294.124 146.55,301.95C152.041,315.825 144.591,306.551 144.005,318.766C143.697,325.203 154.089,323.545 146.943,330.951C142.748,335.298 149.364,331.388 153.03,326.99C159.639,319.062 153.634,319.52 158.654,312.254C164.021,304.487 175.854,311.995 178.73,298.765C180.201,291.997 180.918,291.411 185.898,288.91C190.878,286.409 191.446,290.635 192.926,280.513C194.406,270.39 199.314,236.684 199.314,236.684L209.636,140.875L231.037,127.238L252.794,258.173L262.616,265.283C262.616,265.283 258.496,270.561 264.09,276.277C269.684,281.994 275.64,278.003 279.898,274.251C284.156,270.5 275.638,279.73 275.891,287.234C276.144,294.737 277.659,281.397 286.502,284.97C295.344,288.544 303.176,280.505 301.588,274.133C299.999,267.761 299.314,267.344 299.314,267.344C299.314,267.344 308.157,270.201 313.353,267.225C318.55,264.248 318.441,265.081 323.675,270.202C328.908,275.324 338.508,270.144 343.344,276.634C348.18,283.124 338.869,269.249 332.445,266.689C326.021,264.129 328.33,259.008 320.246,255.197C312.162,251.385 316.565,248.17 310.971,244.657C305.378,241.143 304.872,240.726 304.872,240.726C304.872,240.726 292.384,227.09 292.168,223.278C291.951,219.467 294.732,213.035 291.88,205.949C289.028,198.863 288.018,199.459 288.018,199.459C288.018,199.459 291.194,182.249 288.09,171.53C284.986,160.812 283.615,157.178 282.063,151.402C280.511,145.626 277.361,141.97 270.865,133.871C264.37,125.772 256.411,111.222 232.709,115.162Z" style="fill:rgb(235,235,235);"/>
    </g>
    <g transform="matrix(1.37632,0,0,1.37632,-98.7799,-77.2365)">
        <path d="M282.735,265.8C282.735,265.8 287.036,267.8 285.193,270.388C283.35,272.976 280.407,275.911 279.146,278.525C277.885,281.139 281.91,275.11 284.772,271.882C287.634,268.654 286.777,266.6 282.735,265.8Z" style="fill:rgb(240,240,240);"/>
    </g>
    <g transform="matrix(1.37632,0,0,1.37632,-98.7799,-77.2365)">
        <path d="M169.477,247.491C169.477,247.491 170.253,254.587 166.146,258.856C162.039,263.124 152.532,263.204 154.844,257.255C157.156,251.306 159.743,253.787 161.958,254.427C164.173,255.067 155.2,257.335 158.757,258.856C162.314,260.376 165.273,258.696 167.068,254.054C168.862,249.412 169.17,252.986 169.477,247.491Z" style="fill:rgb(240,240,240);"/>
    </g>
    <g transform="matrix(1.37632,0,0,1.37632,-98.7799,-77.2365)">
        <path d="M156.934,281.24C156.934,281.24 154.59,287.109 158.777,288.71C162.965,290.31 164.484,291.965 163.983,295.166C163.482,298.367 164.291,290.684 159.828,290.657C155.366,290.63 151.89,287.963 154.687,283.534C157.484,279.105 156.934,281.24 156.934,281.24Z" style="fill:rgb(240,240,240);"/>
    </g>
    <g transform="matrix(1.37632,0,0,1.37632,-98.7799,-77.2365)">
        <path d="M170.029,211.208C170.029,211.208 165.033,214.356 165.227,221.719C165.421,229.082 170.919,228.575 172.519,231.43C174.12,234.284 172.099,230.203 168.364,229.616C164.629,229.029 168.8,234.952 170.708,235.725C172.616,236.499 163.853,234.471 163.093,227.962C162.333,221.452 164.257,215.29 170.029,211.208Z" style="fill:rgb(240,240,240);"/>
    </g>
    <g transform="matrix(1.37632,0,0,1.37632,-98.7799,-77.2365)">
        <path d="M172.427,186.214C172.427,186.214 167.059,192.003 163.599,194.804C160.139,197.605 159.671,198.246 159.671,198.246C159.671,198.246 164.149,194.75 161.902,198.379C159.654,202.007 158.49,200.38 158.878,205.075C159.266,209.77 160.576,213.319 160.802,216.467C161.029,219.615 157.457,207.594 157.439,203.821C157.42,199.695 157.795,197.792 160.463,194.777C163.131,191.763 167.609,191.069 172.427,186.214Z" style="fill:rgb(240,240,240);"/>
    </g>
    <g transform="matrix(1.37632,0,0,1.37632,-98.7799,-77.2365)">
        <path d="M164.199,189.28C164.199,189.28 171.443,183.092 174.515,179.623C177.587,176.155 180.302,167.377 176.568,161.989C172.833,156.6 182.518,168.712 173.819,178.396C165.121,188.08 165.315,187.466 164.199,189.28Z" style="fill:rgb(240,240,240);"/>
    </g>
    <g transform="matrix(1.37632,0,0,1.37632,-98.7799,-77.2365)">
        <path d="M171.672,163.897C171.672,163.897 168.373,159.709 170.41,152.532C172.448,145.356 174.614,143.035 178.656,139.967C182.698,136.899 186.368,134.098 187.84,129.589C187.84,129.589 186.385,135.139 182.149,138.927C177.913,142.715 173.37,146.37 172.82,149.758C172.27,153.146 173.547,149.784 177.153,146.53C180.758,143.275 173.191,150.185 172.237,154.293C171.284,158.401 170.152,156.374 171.672,163.897Z" style="fill:rgb(240,240,240);"/>
    </g>
    <g transform="matrix(1.37632,0,0,1.37632,-98.7799,-77.2365)">
        <path d="M294.17,239.91C294.17,239.91 292.569,236.442 287.897,233.587C283.224,230.733 278.811,230.359 275.771,231.8C272.731,233.241 270.662,230.306 276.062,228.572C281.462,226.838 290.516,230.893 294.17,239.91Z" style="fill:rgb(240,240,240);"/>
    </g>
    <g transform="matrix(1.37632,0,0,1.37632,-98.7799,-77.2365)">
        <path d="M260.006,225.096C260.006,225.096 257.048,226.75 257.953,229.551C258.858,232.353 257.953,230.645 259.602,228.724C261.251,226.804 257.613,230.112 260.96,231.899C264.307,233.687 264.582,233.019 267.25,231.659C269.918,230.298 263.773,235.207 259.57,234.86C255.366,234.514 253.297,229.098 256.708,226.35C260.12,223.602 260.006,225.096 260.006,225.096Z" style="fill:rgb(240,240,240);"/>
    </g>
    <g transform="matrix(1.37632,0,0,1.37632,-98.7799,-77.2365)">
        <path d="M270.435,231.526C270.435,231.526 265.326,237.048 262.852,239.316C260.378,241.583 267.347,236.568 270.435,231.526Z" style="fill:rgb(240,240,240);"/>
    </g>
    <g transform="matrix(1.37632,0,0,1.37632,-98.7799,-77.2365)">
        <path d="M290.84,240.623C290.84,240.623 288.366,236.328 284.485,234.46C280.605,232.593 276.434,234.567 275.205,236.461C273.976,238.355 280.282,229.391 290.84,240.623Z" style="fill:rgb(240,240,240);"/>
    </g>
    <g transform="matrix(1.37632,0,0,1.37632,-98.7799,-77.2365)">
        <path d="M281.812,199.291C281.812,199.291 280.762,193.849 277.625,191.448C274.488,189.047 271.626,187.952 267.552,187.526C263.477,187.099 262.491,187.979 262.103,184.671C261.715,181.363 260.841,188.94 268.198,188.78C275.555,188.62 279.678,193.582 281.812,199.291Z" style="fill:rgb(240,240,240);"/>
    </g>
    <g transform="matrix(1.37632,0,0,1.37632,-98.7799,-77.2365)">
        <path d="M263.202,189.127C263.202,189.127 270.882,189.66 273.13,192.141C275.377,194.622 271.529,189.847 267.034,191.154C262.539,192.461 259.095,190.247 263.202,189.127Z" style="fill:rgb(240,240,240);"/>
    </g>
    <g transform="matrix(1.37632,0,0,1.37632,-98.7799,-77.2365)">
        <path d="M280.191,165.774C280.191,165.774 279.447,160.171 274.063,156.33C268.679,152.488 263.554,151.848 262.487,146.672C261.42,141.497 261.436,148.94 263.117,150.727C264.799,152.515 262.924,153.876 261.016,151.288C259.108,148.7 260.659,153.262 267.968,155.209C275.276,157.157 278.655,159.398 280.191,165.774Z" style="fill:rgb(240,240,240);"/>
    </g>
    <g transform="matrix(1.37632,0,0,1.37632,-98.7799,-77.2365)">
        <path d="M301.19,265.525C301.19,265.525 308.741,265.738 311.053,262.377C313.365,259.015 318.425,254.8 323.971,260.963C329.517,267.125 329.468,270.407 334.772,272.007C340.075,273.608 330.843,273.795 324.602,263.444C318.361,253.093 317.148,261.016 314.61,263.737C312.071,266.458 308.03,267.819 301.19,265.525Z" style="fill:rgb(240,240,240);"/>
    </g>
    <g transform="matrix(1.37632,0,0,1.37632,-98.7799,-77.2365)">
        <path d="M317.645,253.426C317.645,253.426 312.283,247.615 306.635,248.65C303.579,249.21 301.211,250.481 300.022,249.451C299.777,249.239 299.714,249.931 306.942,247.05C314.169,244.169 312.972,249.184 317.645,253.426Z" style="fill:rgb(240,240,240);"/>
    </g>
    <g transform="matrix(1.37632,0,0,1.37632,-98.7799,-77.2365)">
        <path d="M155.642,320.313C155.642,320.313 153.647,315.185 157.335,311.059C161.024,306.932 168.299,302.723 168.83,298.346C169.36,293.968 167.591,290.8 165.646,293.635C164.013,296.016 167.542,296.76 164.535,300.679C161.529,304.598 150.261,311.059 155.642,320.313Z" style="fill:rgb(235,235,235);"/>
    </g>
    <g transform="matrix(1.37632,0,0,1.37632,-98.7799,-77.2365)">
        <path d="M149.655,302.764C149.655,302.764 146.952,300.138 149.024,295.803C151.095,291.467 152.51,294.26 151.802,298.637C151.095,303.014 149.2,306.057 149.731,312.185C150.261,318.312 149.933,308.349 149.655,302.764Z" style="fill:rgb(235,235,235);"/>
    </g>
    <g transform="matrix(1.37632,0,0,1.37632,-98.7799,-77.2365)">
        <path d="M155.084,263.625C155.084,263.625 155.16,270.044 161.754,270.085C168.348,270.127 171.707,268.668 173.274,265.375C174.84,262.082 170.95,272.462 164.811,272.045C158.672,271.628 156.019,273.671 153.821,277.089C151.624,280.507 157.409,271.461 157.409,271.461C157.409,271.461 153.72,272.712 155.084,263.625Z" style="fill:rgb(195,195,195);fill-opacity:0.14;"/>
    </g>
    <g transform="matrix(1.37632,0,0,1.37632,-98.7799,-77.2365)">
        <path d="M158.217,257.246C158.217,257.246 161.679,261.749 164.963,257.789C168.246,253.828 167.64,250.619 167.64,250.619C167.64,250.619 166.63,259.872 158.217,257.246Z" style="fill:rgb(235,235,235);"/>
    </g>
    <g transform="matrix(1.37632,0,0,1.37632,-98.7799,-77.2365)">
        <path d="M164.364,230.632C164.364,230.632 164.087,237.677 168.078,239.428C172.07,241.178 175.404,242.512 175.606,249.265C175.809,256.018 178.461,242.262 171.842,237.552C165.224,232.842 164.566,236.343 164.364,230.632Z" style="fill:rgb(195,195,195);fill-opacity:0.14;"/>
    </g>
    <g transform="matrix(1.37632,0,0,1.37632,-98.7799,-77.2365)">
        <path d="M260.774,247.19C260.774,247.19 262.373,249.413 265.714,243.809C269.056,238.205 270.374,238.344 272.929,236.259C275.483,234.175 267.005,240.196 267.062,245.661C267.118,251.127 269.617,244.643 272.48,242.466C275.343,240.289 271.049,245.153 272.171,246.773C273.293,248.394 272.929,244.273 279.161,242.744C285.392,241.215 288.733,243.345 285.589,251.127C282.444,258.908 282.22,259.51 285.589,260.992C288.957,262.474 282.389,262.845 280.312,254.971C278.234,247.097 279.75,250.848 274.108,250.756C268.465,250.664 268.55,246.172 264.087,248.07C259.623,249.969 260.774,247.19 260.774,247.19Z" style="fill:rgb(113,113,113);fill-opacity:0.14;"/>
    </g>
    <g transform="matrix(1.37632,0,0,1.37632,-98.7799,-77.2365)">
        <path d="M292.381,244.55C292.381,244.55 282.444,257.426 285.589,260.992C288.733,264.558 288.845,262.15 296.171,265.67C303.497,269.19 303.02,269.561 307.259,266.596C311.497,263.632 302.796,271.552 296.171,265.67C289.546,259.788 289.518,263.586 291.259,256.685C292.999,249.784 294.402,254.694 292.381,244.55Z" style="fill:rgb(113,113,113);fill-opacity:0.14;"/>
    </g>
    <g transform="matrix(1.37632,0,0,1.37632,-98.7799,-77.2365)">
        <path d="M177.534,197.022C177.534,197.022 169.457,203.565 170.439,217.699C171.279,229.789 178.404,234.194 179.556,242.576C180.707,250.959 180.622,264.345 176.215,268.328C171.808,272.311 169.114,274.071 169.114,274.071C169.114,274.071 173.492,274.257 178.068,268.514C182.643,262.771 175.794,274.904 171.191,276.85C166.588,278.795 164.312,279.721 160.327,279.582C156.342,279.444 155.134,283.613 157.745,286.808C160.356,290.003 163.247,288.243 166.138,288.429C169.029,288.615 165.914,286.021 169.535,283.056C173.155,280.092 177.338,278.055 182.475,268.56C187.612,259.065 190.952,261.427 189.437,267.17C187.921,272.913 185.647,279.351 181.212,280.509C176.777,281.667 172.566,284.167 172.566,284.167C172.566,284.167 179.388,283.983 179.332,288.105C179.275,292.227 178.91,293.94 178.91,293.94C178.91,293.94 182.643,286.901 186.629,287.457C190.615,288.012 192.243,291.069 193.956,280.324C195.668,269.578 197.324,235.212 197.324,235.212L177.534,197.022Z" style="fill:rgb(113,113,113);fill-opacity:0.14;"/>
    </g>
    <g transform="matrix(1.37632,0,0,1.37632,-98.7799,-77.2365)">
        <path d="M175.935,198.899C175.935,198.899 171.191,200.614 167.43,208.58C163.668,216.546 160.972,223.632 162.657,229.097C164.342,234.562 159.458,223.865 161.675,215.62C163.892,207.375 163.977,203.995 168.749,200.15C173.521,196.305 175.402,195.194 174.672,191.859C173.942,188.525 172.259,188.849 168.665,191.443C165.071,194.036 170.152,189.358 172.819,185.607C175.485,181.855 169.62,187.598 166.335,189.636C163.05,191.674 161.535,193.249 161.535,193.249C161.535,193.249 163.865,188.618 168.131,185.422C172.398,182.226 176.694,178.938 177.844,174.075C178.994,169.211 178.602,163.931 175.766,160.55C172.931,157.169 178.798,170.138 174.784,175.417C170.77,180.697 170.349,180.837 170.349,180.837C170.349,180.837 177.254,171.203 173.942,164.487C170.629,157.771 171.874,156.311 174.905,152.512C177.937,148.713 181.53,145.982 184.365,143.295C187.201,140.608 181.108,140.979 177.909,144.128C174.709,147.278 172.492,150.011 172.548,152.79C172.603,155.569 170.582,147.556 177.937,142.415C185.291,137.274 186.976,138.246 188.239,134.773C189.502,131.299 191.6,122.89 202.182,119.416C212.765,115.942 212.654,118.303 220.625,120.805C228.596,123.306 224.694,123.075 229.438,120.898C234.182,118.72 242.379,119.092 244.148,126.039C245.916,132.986 247.768,133.634 249.172,138.729C250.576,143.824 249.874,149.567 251.867,153.457C253.86,157.348 257.51,160.128 262.786,161.702C268.063,163.277 276.12,170.687 272.723,177.45C269.326,184.212 271.095,187.267 271.6,187.731C274.802,190.669 267.782,187.686 269.017,178.885C270.253,170.085 268.99,173.095 264.302,167.862C259.615,162.628 254.534,161.193 251.558,155.634C248.582,150.076 238.758,142.249 238.758,142.249L175.935,198.899Z" style="fill:rgb(113,113,113);fill-opacity:0.14;"/>
    </g>
    <g transform="matrix(1.37632,0,0,1.37632,-98.7799,-77.2365)">
        <path d="M281.306,177.327C281.306,177.327 277.39,181.522 276.834,185.497C276.531,187.665 275.798,189.79 280.27,193.375C284.742,196.96 287.242,200.253 287.242,200.253C287.242,200.253 280.07,193.729 278.677,187.914C277.819,184.33 279.032,181.953 281.306,177.327Z" style="fill:rgb(195,195,195);fill-opacity:0.14;"/>
    </g>
    <g transform="matrix(1.37632,0,0,1.37632,-98.7799,-77.2365)">
        <path d="M269.609,159.778C269.609,159.778 278.045,165.489 276.177,173.284C274.308,181.078 284.564,166.782 269.609,159.778Z" style="fill:rgb(195,195,195);fill-opacity:0.14;"/>
    </g>
    <g transform="matrix(1.37632,0,0,1.37632,-98.7799,-77.2365)">
        <path d="M253.011,145.022C253.011,145.022 250.131,153.692 255.916,155.61C261.701,157.527 270.948,157.902 272.767,158.194C277.725,158.991 272.135,158.36 264.834,155.86C257.533,153.359 251.646,151.691 254.021,145.189C256.396,138.686 255.437,140.271 253.011,145.022Z" style="fill:rgb(195,195,195);fill-opacity:0.14;"/>
    </g>
    <g transform="matrix(1.37632,0,0,1.37632,-98.7799,-77.2365)">
        <path d="M262.358,140.27C262.358,140.27 261.094,147.274 266.274,150.65C271.453,154.025 278.401,156.61 280.245,162.279C282.088,167.948 281.684,160.154 275.04,153.692C268.396,147.231 260.604,145.352 265.163,134.976C267.159,130.432 262.787,138.019 262.358,140.27Z" style="fill:rgb(195,195,195);fill-opacity:0.14;"/>
    </g>
    <g transform="matrix(1.37632,0,0,1.37632,-98.7799,-77.2365)">
        <path d="M259.009,184.302C259.009,184.302 257.577,192.314 262.349,195.927C267.121,199.54 272.144,201.764 267.99,207.692C263.837,213.62 271.556,204.912 265.38,200.744C259.205,196.575 256.089,189.952 259.009,184.302Z" style="fill:rgb(113,113,113);fill-opacity:0.14;"/>
    </g>
    <g transform="matrix(1.37632,0,0,1.37632,-98.7799,-77.2365)">
        <path d="M268.777,197.687C268.777,197.687 275.29,200.282 274.588,207.692C273.924,214.692 269.843,218.206 264.566,217.974C259.289,217.742 256.089,217.371 254.573,221.911C253.057,226.45 253.338,218.901 262.629,218.993C271.921,219.085 276.861,214.917 276.131,207.506C275.401,200.095 272.959,200.466 268.777,197.687Z" style="fill:rgb(113,113,113);fill-opacity:0.14;"/>
    </g>
    <g transform="matrix(1.37632,0,0,1.37632,-98.7799,-77.2365)">
        <path d="M282.419,202.967C282.419,202.967 283.458,213.019 282.335,216.26C280.206,222.404 274.194,225.893 268.075,226.773C261.956,227.654 257.183,230.617 261.731,232.239C266.279,233.86 268.636,229.09 274.784,227.978C280.931,226.866 286.264,227.746 289.97,233.119C293.675,238.491 288.229,224.088 274.363,227.19C260.497,230.292 277.17,227.653 282.868,220.15C288.566,212.648 289.269,210.053 282.419,202.967Z" style="fill:rgb(113,113,113);fill-opacity:0.14;"/>
    </g>
    <g transform="matrix(1.37632,0,0,1.37632,-98.7799,-77.2365)">
        <path d="M221.574,121.499C221.574,121.499 209.742,120.07 203.555,123.218C195.498,127.319 190.888,132.873 188.002,139.024C185.116,145.175 183.825,149.382 182.382,152.292C180.939,155.203 180.532,156.567 180.223,162.078C179.914,167.59 180.532,170.555 179.016,175.557C177.5,180.558 175.187,189.653 177.445,206.727C178.567,215.213 182.731,224.658 186.997,230.262C191.264,235.866 191.438,234.746 192.323,237.032C192.544,237.604 192.487,239.281 192.235,249.517C191.982,259.753 192.15,264.523 192.881,270.59C193.611,276.658 191.993,285.926 188.036,289.769C184.078,293.613 182.085,293.057 182.085,293.057C182.085,293.057 190.299,297.571 197.257,293.255C211.306,284.541 212.029,290.342 219.832,285.525C227.635,280.709 245.153,273.588 253.889,268.695C259.155,265.747 263.433,264.341 263.433,264.341L263.405,260.636C263.405,260.636 257.959,258.552 259.615,251.235C261.271,243.917 260.036,247.483 260.036,247.483C260.036,247.483 252.71,242.759 251.728,236.136C250.745,229.512 248.651,224.755 254.967,217.622C261.283,210.489 265.157,211.832 265.83,206.83C266.504,201.828 263.604,202.781 259.169,200.326C254.733,197.871 251.927,190.784 255.576,183.93C259.224,177.076 263.197,171.019 258.172,164.118C253.147,157.217 247.871,154.809 248.741,147.954C249.611,141.099 249.512,138.888 245.386,132.866C241.26,126.845 242.748,128.882 239.744,126.057C236.741,123.233 227.797,120.136 221.574,121.499Z" style="fill:rgb(235,235,235);"/>
    </g>
    <g transform="matrix(1.37632,0,0,1.37632,-98.7799,-77.2365)">
        <path d="M184.678,163.449C184.678,163.449 185.239,160.152 188.58,158.484C191.92,156.817 198.92,163.443 198.92,163.443C198.92,163.443 201.532,159.801 196.58,156.864C193.441,155.002 197.927,156.446 199.892,158.391C201.857,160.337 198.825,154.316 196.299,153.112C193.773,151.908 197.713,152.797 197.713,152.797C197.713,152.797 202.863,154.896 201.852,160.314C200.842,165.733 199.808,166.22 197.057,168.72C194.306,171.221 190.036,170.573 187.577,170.555C184.612,170.534 183.021,167.98 186.839,167.146C190.657,166.312 194.76,166.676 196.608,164.042C197.483,162.797 194.148,163.5 190.919,164.148C187.691,164.797 184.678,163.449 184.678,163.449Z" style="fill:rgb(225,225,225);"/>
    </g>
    <g transform="matrix(1.37632,0,0,1.37632,-98.7799,-77.2365)">
        <path d="M182.629,169.6C182.629,169.6 181.488,164.072 182.966,159.92C183.818,157.527 186.616,154.115 188.832,153.713C193.488,152.87 185.187,156.925 183.656,161.246C181.75,166.629 182.82,166.564 182.629,169.6Z" style="fill:rgb(225,225,225);"/>
    </g>
    <g transform="matrix(1.37632,0,0,1.37632,-98.7799,-77.2365)">
        <path d="M177.445,206.727C177.445,206.727 181.413,220.657 189.33,226.948C196.885,232.951 205.69,235.766 217.196,233.576C222.197,232.624 229.424,229.449 231.722,225.072C234.021,220.696 227.816,236.555 207.747,237.244C194.487,237.699 189.117,232.347 186.485,229.458C183.533,226.217 179.787,217.669 177.445,206.727Z" style="fill:rgb(240,240,240);"/>
    </g>
    <g transform="matrix(1.37632,0,0,1.37632,-98.7799,-77.2365)">
        <path d="M207.608,212.571C207.608,212.571 206.091,211.042 202.948,208.448C199.805,205.855 196.523,204.328 191.833,205.717C189.643,206.365 185.347,208.912 184.73,212.848C183.704,219.394 187.313,217.11 189.615,215.164C194.608,210.945 202.247,209.977 207.608,212.571Z" style="fill:rgb(240,240,240);"/>
    </g>
    <g transform="matrix(1.37632,0,0,1.37632,-98.7799,-77.2365)">
        <path d="M209.804,183.334C209.804,183.334 206.618,184.188 204.258,183.441C201.897,182.694 201.93,181.493 200.394,182C198.858,182.507 197.855,180.666 197.855,180.666L196.449,181.574C196.449,181.574 194.751,181.921 194.104,178.212C193.457,174.504 194.46,174.29 194.46,174.29C194.46,174.29 197.532,171.276 200.216,171.356C202.9,171.436 205.066,174.958 206.877,176.852C208.688,178.746 207.928,180.453 209.707,178.852C211.485,177.252 212.828,178.613 211.987,181.627" style="fill:rgb(228,228,228);"/>
    </g>
    <g transform="matrix(1.37632,0,0,1.37632,-98.7799,-77.2365)">
        <path d="M212.078,181.168C212.078,181.168 210.57,183.891 207.649,182.641C204.729,181.391 206.27,178.987 205.369,178.806C203.662,178.462 202.982,180.383 204.441,182.422C205.9,184.46 210.537,183.33 212.078,181.168Z" style="fill:rgb(210,210,210);"/>
    </g>
    <g transform="matrix(1.37632,0,0,1.37632,-98.7799,-77.2365)">
        <path d="M198.212,180.103C198.212,180.103 193.078,177.763 195.011,180.565C196.438,182.634 196.523,182.449 198.212,180.103Z" style="fill:rgb(210,210,210);"/>
    </g>
    <g transform="matrix(1.37632,0,0,1.37632,-98.7799,-77.2365)">
        <path d="M252.076,181.487C252.076,181.487 248.395,188.217 245.977,195.423C243.558,202.628 245.578,208.879 241.32,215.788C237.063,222.696 234.333,227.433 225.405,233.058C218.222,237.583 209.165,239.012 197.652,237.107C181.124,234.372 207.613,240.262 207.107,245.741C206.602,251.22 223.311,245.98 229.7,242.288C236.088,238.596 238.759,238.655 240.058,246.813C241.357,254.972 243.485,256.639 237.892,261.403C232.298,266.166 226.778,267.357 232.551,271.525C238.325,275.694 240.78,264.26 244.136,268.846C247.492,273.432 251.282,273.194 253.231,262.177C255.18,251.16 247.094,242.168 248.827,230.914C250.56,219.659 254.204,217.693 255.901,207.57C257.597,197.447 255.217,187.323 256.876,178.093C258.536,168.864 253.593,163.504 251.318,157.966C249.044,152.428 256.227,166.361 252.076,181.487Z" style="fill:rgb(160,160,160);fill-opacity:0.17;"/>
    </g>
    <g transform="matrix(1.37632,0,0,1.37632,-98.7799,-77.2365)">
        <path d="M215.432,168.048C215.432,168.048 221.748,172.077 226.015,171.984C230.281,171.891 236.147,174.299 235.221,179.348C234.295,184.397 230.196,181.525 225.986,183.702C221.776,185.879 218.8,187.455 221.046,191.067C223.291,194.679 216.975,191.899 216.245,187.129C215.516,182.359 217.621,181.479 215.628,176.801C213.635,172.123 210.633,168.14 215.432,168.048Z" style="fill:rgb(247,247,247);fill-opacity:0.45;"/>
    </g>
    <g transform="matrix(1.37632,0,0,1.37632,-98.7799,-77.2365)">
        <path d="M247.224,152.047C247.224,152.047 237.736,145.146 231.982,143.71C226.227,142.274 227.658,143.154 224.346,142.505C221.034,141.857 226.956,139.68 232.43,140.746C237.904,141.811 244.64,146.627 245.006,143.478C245.371,140.329 245.876,149.453 247.224,152.047Z" style="fill:rgb(247,247,247);fill-opacity:0.73;"/>
    </g>
    <g transform="matrix(1.37632,0,0,1.37632,-98.7799,-77.2365)">
        <path d="M243.265,135.836C243.265,135.836 239.449,135.094 234.873,131.667C230.298,128.24 220.922,129.443 217.16,131.436C213.399,133.428 205.737,138.06 207.28,142.923C208.824,147.785 211.18,151.074 209.357,154.964C207.533,158.855 205.624,160.8 202.452,165.895C199.28,170.989 198.27,168.304 196.557,171.314C194.844,174.325 193.3,174.601 194.676,176.362C196.052,178.122 190.916,176.966 195.715,170.157C200.515,163.348 201.61,164.644 202.227,159.04C202.844,153.436 203.603,149.315 202.059,144.358C200.515,139.402 200.993,141.673 197.371,142.552C193.75,143.431 186.985,147.23 184.571,151.305C182.157,155.381 181.343,154.825 181.511,161.078C181.679,167.331 178.677,158.022 183.533,150.055C188.389,142.089 185.778,147.369 187.968,141.811C190.157,136.252 191.757,128.101 205.848,123.562C219.939,119.023 232.262,119.302 238.83,124.72C245.399,130.139 245.174,132.038 243.265,135.836Z" style="fill:rgb(247,247,247);fill-opacity:0.64;"/>
    </g>
    <g transform="matrix(1.37632,0,0,1.37632,-98.7799,-77.2365)">
        <path d="M247.566,156.12C247.566,156.12 244.02,149.228 232.417,144.969C220.813,140.711 214.074,145.551 211.716,150.115C209.358,154.68 205.644,163.656 204.679,166.413C203.714,169.17 206.22,172.233 208.745,174.255C211.27,176.276 214.148,177.043 212.978,180.167C211.809,183.292 218.492,178.145 215.261,173.611C212.031,169.078 211.437,171.406 212.774,167.607C214.11,163.809 213.832,168.894 216.691,170.548C219.55,172.202 214.983,167.669 216.802,165.188C218.622,162.706 220.571,165.432 223.857,165.402C227.144,165.371 225.51,164.207 223.226,163.257C220.942,162.308 222.242,161.021 225.046,158.693C227.849,156.365 222.335,161.604 223.263,158.571C224.192,155.537 225.936,154.312 228.443,153.546C230.95,152.78 228.313,150.239 225.324,152.965C222.335,155.691 221.332,146.225 231.525,148.523C241.717,150.82 242.794,151.861 247.566,156.12Z" style="fill:rgb(200,200,200);fill-opacity:0.12;"/>
    </g>
    <g transform="matrix(1.37632,0,0,1.37632,-98.7799,-77.2365)">
        <path d="M232.955,157.253C232.955,157.253 238.005,159.582 238.951,161.94C239.898,164.299 237.986,157.039 234.124,154.772C230.262,152.505 236.743,153.271 239.694,156.059C242.646,158.846 245.951,163.932 247.157,168.465C248.364,172.999 249.738,176.307 249.738,176.307C249.738,176.307 246.471,173.611 242.628,174.04C238.784,174.469 235.552,171.613 231.542,169.622C227.532,167.631 218.733,169.322 217.638,165.432C216.542,161.542 217.211,162.001 222.409,163.962C227.608,165.922 228.105,164.73 233.767,164.883C239.43,165.036 240.901,167.546 238.376,164.085C235.851,160.623 237.188,160.653 232.955,157.253Z" style="fill:rgb(212,212,212);fill-opacity:0.42;"/>
    </g>
    <g transform="matrix(1.37632,0,0,1.37632,-98.7799,-77.2365)">
        <path d="M208.036,191.311C208.036,191.311 210.253,194.832 213.173,194.785C216.092,194.738 219.151,196.128 215.53,197.934C211.91,199.741 211.714,198.026 208.654,199.787C205.594,201.547 204.92,201.686 204.92,201.686C204.92,201.686 204.471,201.547 206.801,204.974C209.131,208.401 202.393,202.75 196.022,203.585C189.65,204.419 190.652,204.16 190.652,204.16C190.652,204.16 193.776,199.881 191.924,197.379C190.071,194.877 191.034,197.687 188.592,197.779C186.15,197.871 184.685,196.576 187.18,194.137C189.785,191.59 190.818,196.033 195.534,193.532C200.25,191.031 208.036,191.311 208.036,191.311Z" style="fill:rgb(160,160,160);fill-opacity:0.09;"/>
    </g>
    <g transform="matrix(1.37632,0,0,1.37632,-98.7799,-77.2365)">
        <path d="M222.094,162.706C222.094,162.706 226.234,155.568 231.748,157.56C237.262,159.551 239.063,165.31 239.063,165.31C239.063,165.31 235.943,164.114 233.01,163.839C230.077,163.563 225.732,164.299 222.094,162.706Z" style="fill:rgb(235,235,235);stroke:rgb(213,213,213);stroke-width:0.07px;"/>
    </g>
    <g transform="matrix(1.37632,0,0,1.37632,-98.7799,-77.2365)">
        <path d="M231.748,157.56C231.748,157.56 230.016,156.463 227.399,157.539C224.782,158.614 223.102,161.236 222.445,162.181C221.788,163.125 222.237,162.919 223.033,163.23C224.31,163.728 226.127,164.122 229.544,164.008C232.962,163.894 231.431,163.903 232.49,163.903C233.55,163.903 228.204,163.614 226.382,163.518C224.559,163.422 223.621,162.189 224.522,161.35C225.423,160.511 233.099,157.784 235.028,159.453C236.957,161.123 234.539,158.507 231.748,157.56Z" style="fill:rgb(223,223,223);stroke:rgb(213,213,213);stroke-width:0.07px;"/>
    </g>
    <g transform="matrix(1.37632,0,0,1.37632,-98.7799,-77.2365)">
        <path d="M239.063,165.31C239.063,165.31 235.898,159.867 232.625,159.568C229.353,159.269 226.862,161.186 227.858,162.594C228.854,164.003 229.612,161.692 230.749,162.69C232.113,163.886 228.747,163.602 226.665,163.517C224.582,163.431 222.65,162.612 222.65,162.612C222.65,162.612 223.312,159.888 226.546,158.501C229.78,157.114 234.726,156.752 239.063,165.31Z" style="fill:rgb(240,240,240);"/>
    </g>
    <g transform="matrix(1.37632,0,0,1.37632,-98.7799,-77.2365)">
        <path d="M228.51,158.059C228.51,158.059 224.059,159.261 223.523,162.004C223.331,162.987 225.53,163.217 226.835,163.293C228.139,163.37 227.556,162.07 226.245,161.927C224.934,161.785 223.98,160.234 228.51,158.059Z" style="fill:rgb(250,250,250);"/>
    </g>
    <g transform="matrix(1.37632,0,0,1.37632,-98.7799,-77.2365)">
        <path d="M198.998,163.472C198.998,163.472 195.341,155.905 191.219,156.886C187.097,157.866 185.334,162.338 185.334,162.338C185.334,162.338 186.615,163.471 190.198,163.288C193.781,163.104 197.253,162.216 198.998,163.472Z" style="fill:rgb(235,235,235);stroke:rgb(213,213,213);stroke-width:0.07px;"/>
    </g>
    <g transform="matrix(1.37632,0,0,1.37632,-98.7799,-77.2365)">
        <path d="M191.219,156.886C191.219,156.886 190.266,157.115 190.059,157.344C189.853,157.574 192.975,157.104 193.799,157.669C194.623,158.234 197.695,161.468 197.885,162.027C198.075,162.587 198.533,162.631 197.729,162.754C196.926,162.877 196.18,162.715 196.773,162.782C197.367,162.85 198.855,163.14 198.95,163.347C199.045,163.554 198.858,162.95 198.143,161.848C197.428,160.746 195.763,158.005 193.708,157.255C191.653,156.505 191.219,156.886 191.219,156.886Z" style="fill:rgb(223,223,223);stroke:rgb(213,213,213);stroke-width:0.07px;"/>
    </g>
    <g transform="matrix(1.37632,0,0,1.37632,-98.7799,-77.2365)">
        <path d="M198.998,163.472C198.998,163.472 196.38,159.689 194.041,159.091C190.377,158.154 188.596,161.334 190.337,161.997C192.421,162.79 192.08,161.367 192.946,161.494C193.415,161.563 193.672,162.586 193.667,162.649C193.639,163.01 190.089,163.202 188.824,163.089C186.436,162.875 185.118,162.578 186.267,160.942C187.167,159.662 189.022,156.53 192.437,157.234C195.852,157.938 196.673,160.405 198.998,163.472Z" style="fill:rgb(240,240,240);"/>
    </g>
    <g transform="matrix(1.37632,0,0,1.37632,-98.7799,-77.2365)">
        <path d="M189.592,157.9C189.592,157.9 186.01,160.369 186.288,162.064C186.42,162.872 188.261,162.916 189.381,162.796C190.5,162.676 189.301,161.768 188.122,161.67C186.943,161.572 186.672,161.222 188.288,159.561C189.904,157.9 191.705,156.876 191.023,157.201C189.924,157.726 189.592,157.9 189.592,157.9Z" style="fill:rgb(250,250,250);"/>
    </g>
    <g transform="matrix(1.37632,0,0,1.37632,-98.7799,-77.2365)">
        <path d="M248.741,147.954C248.741,147.954 247.877,153.774 252.37,160.024C256.863,166.273 255.601,170.561 255.526,175.371C255.451,180.18 252.909,188.238 253.15,192.434C253.391,196.63 254.356,201.133 252.648,206.096C250.94,211.059 252.547,212.785 250.858,215.12C247.625,219.59 238.718,229.699 236.119,233.069C233.52,236.438 240.132,233.51 246.07,226.801C250.452,221.851 247.893,228.857 247.912,234.309C247.93,239.762 248.224,247.968 250.061,251.002C251.899,254.035 248.799,254.866 248.279,260.809C247.759,266.752 249.207,269.295 245.735,271.745C242.264,274.195 239.387,275.758 233.687,273.185C227.987,270.612 224.997,273.154 227.541,267.946C230.085,262.739 225.035,270.948 223.104,274.961C221.173,278.974 220.505,278.699 220.171,281.211C219.837,283.723 218.073,285.408 214.731,286.48C211.389,287.551 225.322,282.957 233.139,279.251C240.955,275.544 249.238,272.192 254.734,269.404C260.229,266.616 262.519,265.455 262.519,265.455L263.8,261.268C263.8,261.268 259.292,261.61 257.89,255.959C256.691,251.13 260.272,247.82 260.272,247.82C260.272,247.82 254.218,246.715 251.472,242.239C248.314,237.091 248.988,224.478 253.589,218.014C257.917,211.934 265.118,211.06 265.657,207.047C266.195,203.034 266.075,202.927 261.396,198.669C256.717,194.41 254.961,192.359 256.502,184.762C258.043,177.165 264.11,173.126 260.063,165.805C256.016,158.483 250.767,159.393 248.741,147.954Z" style="fill:rgb(212,212,212);"/>
    </g>
    <g transform="matrix(1.37632,0,0,1.37632,-98.7799,-77.2365)">
        <path d="M261.396,198.669C261.396,198.669 265.933,202.615 264.981,205.824C264.029,209.034 262.238,210.98 259.341,212.568C256.444,214.156 252.718,218.493 251.849,221.344C250.98,224.195 252.078,217.793 261.225,212.005C270.372,206.217 264.227,200.05 261.396,198.669Z" style="fill:rgb(182,182,182);"/>
    </g>
    <g transform="matrix(1.37632,0,0,1.37632,-98.7799,-77.2365)">
        <path d="M211.776,197.058C211.776,197.058 210.472,195.791 208.114,192.145C205.756,188.499 203.323,186.661 200.762,187.182C198.2,187.703 198.738,187.09 196.807,186.967C194.876,186.845 192.741,189.235 191.182,192.42C189.622,195.606 191.009,194.915 189.635,195.191C188.261,195.466 191.996,199.178 192.802,199.803C194.528,201.14 201.577,203.32 206.239,200.753C210.783,198.251 211.776,197.058 211.776,197.058Z" style="fill:rgb(235,235,235);stroke:rgb(220,220,220);stroke-width:0.07px;"/>
    </g>
    <g transform="matrix(1.37632,0,0,1.37632,-98.7799,-77.2365)">
        <path d="M208.114,192.145C208.114,192.145 205.691,188.731 204.482,187.638C203.274,186.545 200.997,186.327 199.681,186.887C198.365,187.447 198.086,186.555 196.428,186.887C195.608,187.051 194.474,187.461 193.853,188.444C193.232,189.427 194.888,186.518 197.206,187.119C199.524,187.72 200.38,187.37 201.535,187.146C203.721,186.723 205.314,188.347 208.114,192.145Z" style="fill:rgb(223,223,223);stroke:rgb(220,220,220);stroke-width:0.07px;"/>
    </g>
    <g transform="matrix(1.37632,0,0,1.37632,-98.7799,-77.2365)">
        <path d="M211.675,197.119C211.675,197.119 208.493,197.166 206.684,195.331C204.321,192.931 202.358,191.715 200.205,192.88C198.051,194.044 198.21,193.526 196.194,193.003C193.511,192.306 192.313,193.085 190.333,195.064C188.865,196.531 192.529,191.772 196.375,193.79C199.886,195.631 200.378,192.271 203.45,193.408C205.582,194.197 206.922,197.333 211.675,197.119Z" style="fill:rgb(206,206,206);"/>
    </g>
    <g transform="matrix(1.37632,0,0,1.37632,-98.7799,-77.2365)">
        <path d="M144.466,386.593C144.466,386.593 148.836,377.882 150.478,374.88C152.12,371.878 158.385,373.254 163.716,371.17C169.046,369.085 175.843,364.126 181.653,360.457C187.463,356.789 195.042,352.371 199.388,349.453C203.733,346.535 211.393,345.334 216.236,346.071C223.94,347.243 228.761,347.18 229.627,344.075C230.071,342.485 229.585,341.993 225.12,340.68C223.85,340.307 218.816,338.355 215.938,337.803C211.985,337.043 210.688,336.63 210.688,336.63C210.688,336.63 215.218,335.83 219.88,335.373C225.591,334.814 228.146,334.455 230.998,333.719C238.442,331.797 240.809,330.204 241.598,328.632C243.247,325.344 239.076,325.025 239.076,325.025C239.076,325.025 242.852,323.345 241.779,320.232C241.099,318.258 237.095,318.023 234.24,317.981C231.385,317.938 222.251,316.538 218.815,316.121C215.379,315.705 209.737,315.08 211.389,314.955C213.741,314.776 222.889,313.807 225.338,313.237C227.761,312.674 231.577,310.841 231.118,308.477C230.446,305.014 221.824,306.087 216.783,305.784C207.576,305.229 200.019,304.642 195.421,306.935C190.824,309.227 178.774,317.689 176.196,319.148C173.619,320.607 172.18,319.565 168.845,321.107C165.509,322.65 160.077,326.86 155.909,328.944C151.742,331.028 142.419,337.572 137.164,341.782C131.909,345.992 123.269,354.664 121.198,358.457C119.127,362.25 128.146,388.385 144.466,386.593Z" style="fill:rgb(235,235,235);"/>
    </g>
    <g transform="matrix(1.37632,0,0,1.37632,-98.7799,-77.2365)">
        <path d="M185.125,319.59C185.125,319.59 182.838,320.988 183.965,321.671C185.056,322.332 186.508,321.424 190.288,319.09C194.067,316.755 198.63,314.655 203.46,314.255C208.291,313.855 214.964,314.675 219.968,314.101C222.724,313.785 212.944,315.222 212.944,315.222C212.944,315.222 216.54,315.563 218.198,316.063C219.855,316.563 213.352,316.036 208.582,315.902C203.812,315.768 200.275,316.97 196.071,318.437C191.868,319.903 187.947,322.672 185.542,323.972C183.137,325.273 176.372,325.664 179.535,321.891C181.65,319.37 186.859,317.623 190.675,315.135C193.245,313.46 188.978,316.522 185.125,319.59Z" style="fill:rgb(210,210,210);fill-opacity:0.5;"/>
    </g>
    <g transform="matrix(1.37632,0,0,1.37632,-98.7799,-77.2365)">
        <path d="M188.833,332.409C188.833,332.409 186.439,333.189 187.995,330.755C189.551,328.321 192.033,328.795 197.186,325.927C202.34,323.058 209.278,321.905 214.128,322.438C218.978,322.971 234.686,323.878 236.848,324.345C239.011,324.812 238.938,325.36 236.169,324.959C233.4,324.559 223.63,324.626 216.726,324.472C211.418,324.354 208.926,323.905 204.257,325.506C199.588,327.107 191.399,331.208 188.833,332.409Z" style="fill:rgb(210,210,210);fill-opacity:0.5;"/>
    </g>
    <g transform="matrix(1.37632,0,0,1.37632,-98.7799,-77.2365)">
        <path d="M178.044,339.078C178.044,339.078 172.85,338.612 176.912,335.81C180.975,333.009 182.976,333.676 180.429,335.643C177.882,337.611 180.712,339.012 178.044,339.078Z" style="fill:rgb(210,210,210);fill-opacity:0.5;"/>
    </g>
    <g transform="matrix(1.37632,0,0,1.37632,-98.7799,-77.2365)">
        <path d="M177.215,347.982C177.215,347.982 176.628,350.483 174.486,349.616C172.345,348.749 174.991,345.147 177.296,345.381C179.6,345.615 178.913,345.615 177.215,347.982Z" style="fill:rgb(210,210,210);fill-opacity:0.5;"/>
    </g>
    <g transform="matrix(1.37632,0,0,1.37632,-98.7799,-77.2365)">
        <path d="M180.166,326.607C180.166,326.607 177.255,330.042 174.466,330.508C171.678,330.975 177.014,328.541 180.166,326.607Z" style="fill:rgb(210,210,210);fill-opacity:0.5;"/>
    </g>
    <g transform="matrix(1.37632,0,0,1.37632,-98.7799,-77.2365)">
        <path d="M210.376,336.527C210.376,336.527 206.565,336.71 202.927,337.711C199.289,338.712 194.095,340.978 189.361,344.26C186.092,346.527 183.569,346.748 184.721,344.247C185.874,341.746 189.05,340.43 193.889,337.745C199.152,334.824 204.547,335.386 208.998,335.324C211.37,335.291 224.249,334.336 229.499,333.316C231.874,332.854 240.074,329.746 239.766,330.165C239.142,331.013 230.928,334.779 210.376,336.527Z" style="fill:rgb(210,210,210);fill-opacity:0.5;"/>
    </g>
    <g transform="matrix(1.37632,0,0,1.37632,-98.7799,-77.2365)">
        <path d="M211.485,336.849C211.485,336.849 203.401,337.036 201.072,338.183C198.744,339.33 190.741,343.145 189.075,344.052C187.41,344.959 186.246,345.492 186.246,345.492C186.246,345.492 185.324,345.279 189.673,343.118C194.022,340.957 199.374,337.996 203.61,337.196C207.846,336.396 207.879,336.582 211.485,336.849Z" style="fill:rgb(210,210,210);fill-opacity:0.65;"/>
    </g>
    <g transform="matrix(1.37632,0,0,1.37632,-98.7799,-77.2365)">
        <path d="M237.354,324.764C237.354,324.764 233.004,325.003 231.307,324.95C229.609,324.897 213.926,324.604 210.628,325.004C207.329,325.404 203.077,325.458 200.603,326.765C198.129,328.072 190.74,330.66 189.447,331.14C188.153,331.62 197.143,327.405 200.7,325.938C204.257,324.47 207.022,323.99 212.778,324.07C218.534,324.15 232.147,325.377 237.354,324.764Z" style="fill:rgb(210,210,210);fill-opacity:0.65;"/>
    </g>
    <g transform="matrix(1.37632,0,0,1.37632,-98.7799,-77.2365)">
        <path d="M199.292,187.884C199.292,187.884 197.709,186.945 196.26,187.321C194.811,187.697 194.087,188.107 192.959,190.292C191.831,192.477 190.827,194.304 190.827,194.304C190.827,194.304 192.225,192.012 193.911,190.087C196.229,187.441 197.419,188.809 199.126,188.721C201.113,188.619 200.73,187.099 203.917,188.243C205.045,188.648 202.944,185.972 199.292,187.884Z" style="fill:rgb(250,250,250);"/>
    </g>
    <g transform="matrix(1.37632,0,0,1.37632,-98.7799,-77.2365)">
        <path d="M212.002,314.866C212.002,314.866 205.648,314.546 203.255,314.866C200.862,315.186 200.927,314.84 196.755,316.921C194.267,318.162 184.953,322.043 182.543,322.976C180.134,323.91 177.434,322.416 180.005,322.043C182.575,321.669 182.026,322.122 187.394,320.148C192.761,318.174 196.124,316.013 199.859,314.733C203.594,313.452 206.989,314.466 212.002,314.866Z" style="fill:rgb(210,210,210);fill-opacity:0.65;"/>
    </g>
    <g transform="matrix(1.37632,0,0,1.37632,-98.7799,-77.2365)">
        <path d="M214.847,345.717C214.847,345.717 210.071,344.55 206.964,343.967C203.857,343.383 204.059,342.967 200.952,343.842C197.845,344.717 191.706,348.426 188.548,350.344C185.389,352.262 186.173,350.928 183.167,350.928C180.16,350.928 177.431,354.596 174.122,357.139C170.813,359.682 159.899,361.807 155.352,362.35C150.804,362.892 153.205,361.515 150.906,359.682C148.606,357.848 145.928,360.39 141.558,362.725C137.188,365.059 129.659,372.937 129.659,372.937C129.659,372.937 134.914,383.775 139.436,385.817C143.958,387.86 145.146,385.942 145.146,385.942C145.146,385.942 145.727,382.9 148.455,377.272C151.183,371.645 153.28,371.311 157.398,371.728C161.516,372.146 171.784,366.931 176.648,363.475C185.566,357.139 191.529,354.554 197.062,350.595C202.595,346.635 208.961,345.551 214.847,345.717Z" style="fill:rgb(210,210,210);fill-opacity:0.5;"/>
    </g>
    <g transform="matrix(1.37632,0,0,1.37632,-98.7799,-77.2365)">
        <path d="M262.37,265.693L263.922,261.288C263.922,261.288 263.353,261.339 261.718,260.691C260.083,260.042 257.051,257.019 257.641,253.844C258.23,250.668 255.273,258.58 261.739,261.612C263.369,262.377 262.618,263.986 262.37,265.693Z" style="fill:rgb(182,182,182);"/>
    </g>
    <g transform="matrix(1.37632,0,0,1.37632,-98.7799,-77.2365)">
        <path d="M257.73,252.315C257.73,252.315 258.223,249.772 258.961,248.338C259.137,247.996 256.426,247.996 253.663,245.332C250.9,242.669 248.282,236.932 249.4,230.768C249.4,230.768 248.696,242.635 254.874,245.503C261.051,248.371 260.482,247.637 260.482,247.637C260.482,247.637 258.558,249.549 257.73,252.315Z" style="fill:rgb(182,182,182);"/>
    </g>
    <g transform="matrix(1.37632,0,0,1.37632,-98.7799,-77.2365)">
        <path d="M200.88,207.43C200.88,207.43 196.959,204.495 193.24,205.763C189.521,207.03 191.179,209.864 194.615,209.197C198.05,208.53 196.311,204.663 200.88,207.43Z" style="fill:rgb(250,250,250);"/>
    </g>
</svg>
