species	group	sol_color
Corynebacterium_sp_29_x	0	#e45a79
Kocuria_palustris_39_a	0	#e45a79
Micrococcus_luteus_149_a	0	#e45a79
Citricoccus_sp_26_a	0	#e45a79
Staphylococcus_shinii_154_a	1	#f9d46d
Staphylococcus_arlettae_99_b	1	#f9d46d
Bacillus_wiedmannii_140_a	1	#1f96ca
Bacillus_mobilis_160_c	1	#1f96ca
Bacillus_mobilis_157_b	1	#1f96ca
Bacillus_cereus_164_b	1	#1f96ca
Bacillus_thuringiensis_452_b	1	#1f96ca
Bacillus_thuringiensis_93_x	1	#1f96ca
Bacillus_thuringiensis_111_x	1	#1f96ca
Bacillus_thuringiensis_159_b	1	#1f96ca
Bacillus_thuringiensis_449_b	1	#1f96ca
Bacillus_thuringiensis_33_x	1	#1f96ca
Bacillus_thuringiensis_452_a	1	#1f96ca
Bacillus_thuringiensis_26_b	1	#1f96ca
Priestia_megaterium_447_x	1	#882255
Priestia_endophyticus_148_x	1	#882255
Fictibacillus_nanhaiensis_41_b	1	#bb5a8f
Sutcliffiella_halmapalus_445_x	2	#9ccea0
Sutcliffiella_horikoshii_449_a2	2	#9ccea0
Sutcliffiella_horikoshii_448_a	2	#9ccea0
Sutcliffiella_horikoshii_448_b	2	#9ccea0
Sutcliffiella_horikoshii_135_a	2	#9ccea0
Sutcliffiella_horikoshii_98_b	2	#9ccea0
Sutcliffiella_horikoshii_91_b	2	#9ccea0
Sutcliffiella_horikoshii_20_a	2	#9ccea0
Sutcliffiella_horikoshii_45_x	2	#9ccea0
Sutcliffiella_horikoshii_44_x	2	#9ccea0
Sutcliffiella_horikoshii_88_x	2	#9ccea0
Sutcliffiella_horikoshii_158_b	2	#9ccea0
Sutcliffiella_horikoshii_28_x	2	#9ccea0
Bacillus_swezeyi_43_x	3	#f18666
Bacillus_swezeyi_21_x	3	#f18666
Bacillus_inaquosorum_109_a	3	#f18666
Bacillus_atrophaeus_90_x	3	#f18666
Bacillus_altitudinis_38_c	3	#f18666
Bacillus_altitudinis_156_x	3	#f18666
Bacillus_altitudinis_23_x	3	#f18666
Bacillus_altitudinis_24_x	3	#f18666
Bacillus_altitudinis_22_x	3	#f18666
Bacillus_pumilus_150_a	3	#f18666
Bacillus_pumilus_95_a	3	#f18666
Bacillus_pumilus_112_a	3	#f18666
Bacillus_pumilus_144_b	3	#f18666
Bacillus_pumilus_145_x	3	#f18666
Bacillus_pumilus_144_a	3	#f18666
Bacillus_pumilus_145_b	3	#f18666
Metabacillus_indicus_450_x	3	#c4a8d0
Metabacillus_flavus_84_x	3	#c4a8d0
Metabacillus_flavus_113_a	3	#c4a8d0
Cytobacillus_gottheilii_449_a1	4	#999999
Bacillus_infantis_142_x	4	#f089ad
Bacillus_infantis_37_x	4	#f089ad
Bacillus_infantis_153_a	4	#f089ad
Bacillus_infantis_163_b	4	#f089ad
Bacillus_infantis_155_a	4	#f089ad
Bacillus_infantis_446_x	4	#f089ad
Bacillus_infantis_162_x	4	#f089ad
Bacillus_infantis_161_d	4	#f089ad
Jeotgalibacillus_sp_81_a	5	#332288
Rossellomorea_vietnamensis_138_x	5	#4caab6
Rossellomorea_vietnamensis_34_x	5	#4caab6
Rossellomorea_vietnamensis_25_x	5	#4caab6
Rossellomorea_vietnamensis_40_x	5	#4caab6
Rossellomorea_vietnamensis_36_x	5	#4caab6
Rossellomorea_vietnamensis_451_a	5	#4caab6
Rossellomorea_vietnamensis_451_b	5	#4caab6
Rossellomorea_marisflavi_112_b	5	#4caab6
Rossellomorea_aquimaris_160_a	5	#4caab6
Rossellomorea_aquimaris_87_b	5	#4caab6
Rossellomorea_aquimaris_159_a	5	#4caab6
Rossellomorea_aquimaris_30_x	5	#4caab6
Rossellomorea_aquimaris_19_b	5	#4caab6
Rossellomorea_aquimaris_19_a	5	#4caab6
Rossellomorea_aquimaris_20_b	5	#4caab6
