-------------------------------------------------------------------------------
Test set: com.baeldung.SpringContextTest
-------------------------------------------------------------------------------
Tests run: 1, Failures: 0, Errors: 0, Skipped: 0, Time elapsed: 3.926 s - in com.baeldung.SpringContextTest
