{
  "/services": {
    "target": "http://localhost:12000",
    "secure": false,
    "logLevel": "debug",
    "changeOrigin": true,
    "pathRewrite": {
      "^/api": ""
    }
  },
  "/viva": {
    "target": "ws://localhost:12000",
    "secure": false,
    "logLevel": "debug",
    "changeOrigin": true,
    "ws": true
  },
  "/new-bundele-context-path/*": {
    "target": "http://localhost:12000",
    "secure": false,
    "logLevel": "debug",
    "changeOrigin": true
  }
}
