module gitlab.com/jkozhemiaka/web-layout

go 1.18

require (
	github.com/gorilla/mux v1.8.0
	github.com/joho/godotenv v1.4.0
	github.com/kelseyhightower/envconfig v1.4.0
	go.uber.org/zap v1.13.0
	gorm.io/driver/postgres v1.4.4
	gorm.io/gorm v1.24.0
)

require (
	github.com/jackc/chunkreader/v2 v2.0.1 // indirect
	github.com/jackc/pgconn v1.13.0 // indirect
	github.com/jackc/pgio v1.0.0 // indirect
	github.com/jackc/pgpassfile v1.0.0 // indirect
	github.com/jackc/pgproto3/v2 v2.3.1 // indirect
	github.com/jackc/pgservicefile v0.0.0-20200714003250-2b9c44734f2b // indirect
	github.com/jackc/pgtype v1.12.0 // indirect
	github.com/jackc/pgx/v4 v4.17.2 // indirect
	github.com/jinzhu/inflection v1.0.0 // indirect
	github.com/jinzhu/now v1.1.5 // indirect
	go.uber.org/atomic v1.6.0 // indirect
	go.uber.org/multierr v1.5.0 // indirect
	golang.org/x/crypto v0.0.0-20220722155217-630584e8d5aa // indirect
	golang.org/x/lint v0.0.0-20190930215403-16217165b5de // indirect
	golang.org/x/text v0.3.7 // indirect
	golang.org/x/tools v0.0.0-20200103221440-774c71fcf114 // indirect
)
