%!PS-Adobe-3.0 EPSF-3.0
%%Creator: cairo 1.8.10 (http://cairographics.org)
%%CreationDate: Sun Dec  2 15:58:04 2012
%%Pages: 1
%%BoundingBox: 0 50 381 277
%%DocumentData: Clean7Bit
%%LanguageLevel: 2
%%EndComments
%%BeginProlog
/cairo_eps_state save def
/dict_count countdictstack def
/op_count count 1 sub def
userdict begin
/q { gsave } bind def
/Q { grestore } bind def
/cm { 6 array astore concat } bind def
/w { setlinewidth } bind def
/J { setlinecap } bind def
/j { setlinejoin } bind def
/M { setmiterlimit } bind def
/d { setdash } bind def
/m { moveto } bind def
/l { lineto } bind def
/c { curveto } bind def
/h { closepath } bind def
/re { exch dup neg 3 1 roll 5 3 roll moveto 0 rlineto
      0 exch rlineto 0 rlineto closepath } bind def
/S { stroke } bind def
/f { fill } bind def
/f* { eofill } bind def
/B { fill stroke } bind def
/B* { eofill stroke } bind def
/n { newpath } bind def
/W { clip } bind def
/W* { eoclip } bind def
/BT { } bind def
/ET { } bind def
/pdfmark where { pop globaldict /?pdfmark /exec load put }
    { globaldict begin /?pdfmark /pop load def /pdfmark
    /cleartomark load def end } ifelse
/BDC { mark 3 1 roll /BDC pdfmark } bind def
/EMC { mark /EMC pdfmark } bind def
/cairo_store_point { /cairo_point_y exch def /cairo_point_x exch def } def
/Tj { show currentpoint cairo_store_point } bind def
/TJ {
  {
    dup
    type /stringtype eq
    { show } { -0.001 mul 0 cairo_font_matrix dtransform rmoveto } ifelse
  } forall
  currentpoint cairo_store_point
} bind def
/cairo_selectfont { cairo_font_matrix aload pop pop pop 0 0 6 array astore
    cairo_font exch selectfont cairo_point_x cairo_point_y moveto } bind def
/Tf { pop /cairo_font exch def /cairo_font_matrix where
      { pop cairo_selectfont } if } bind def
/Td { matrix translate cairo_font_matrix matrix concatmatrix dup
      /cairo_font_matrix exch def dup 4 get exch 5 get cairo_store_point
      /cairo_font where { pop cairo_selectfont } if } bind def
/Tm { 2 copy 8 2 roll 6 array astore /cairo_font_matrix exch def
      cairo_store_point /cairo_font where { pop cairo_selectfont } if } bind def
/g { setgray } bind def
/rg { setrgbcolor } bind def
/d1 { setcachedevice } bind def
%%EndProlog
%%Page: 1 1
%%BeginPageSetup
%%PageBoundingBox: 0 50 381 277
%%EndPageSetup
q
Q q
111.633 275.486 m 111.633 52.119 l 380.434 52.119 l 380.434 275.486 l 
111.633 275.486 l h
111.633 275.486 m W n
q 0 0 596 843 rectclip
[ 1 0 0 1 -0.000000000000005169 -0.599976 ] concat
  q
  0 0 596 843 rectclip
Q q
0.0509804 0.403922 0.643137 rg
112.922 92.441 m 114.121 92.441 l 114.121 99.254 l 119.254 99.254 l 
119.254 100.379 l 114.121 100.379 l 114.121 104.516 l 119.457 104.516 l 
119.457 105.641 l 112.922 105.641 l 112.922 92.441 l h
118.457 92.441 m 119.68 92.441 l 121.438 96.91 l 126.82 96.91 l 128.5 
92.441 l 129.812 92.441 l 124.258 106.156 l 118.457 92.441 l h
121.844 97.941 m 124.184 103.68 l 126.434 97.941 l 121.844 97.941 l h
130.758 92.441 m 131.957 92.441 l 131.957 99.141 l 138.047 92.441 l 
139.781 92.441 l 133.23 99.328 l 139.488 105.641 l 137.918 105.641 l 
131.957 99.457 l 131.957 105.641 l 130.758 105.641 l 130.758 92.441 l h
140.41 105.641 m 140.41 97.406 l 140.41 93.848 141.98 92.09 145.211 
92.09 c 148.441 92.09 150.008 93.848 150.008 97.406 c 150.008 105.641 l 
148.809 105.641 l 148.809 97.02 l 148.809 94.438 147.648 93.16 145.211 
93.16 c 142.754 93.16 141.609 94.438 141.609 97.02 c 141.609 105.641 l 
140.41 105.641 l h
152.703 92.441 m 158.426 92.441 l 158.426 93.57 l 153.906 93.57 l 
153.906 105.641 l 152.703 105.641 l 152.703 92.441 l h
161.105 92.441 m 162.305 92.441 l 162.305 104.516 l 165.938 104.516 l 
165.938 105.641 l 157.469 105.641 l 157.469 104.516 l 161.105 104.516 l 
161.105 92.441 l h
164.227 92.441 m 165.441 92.441 l 167.199 96.91 l 172.586 96.91 l 
174.27 92.441 l 175.574 92.441 l 170.02 106.156 l 164.227 92.441 l h
167.605 97.941 m 169.949 103.68 l 172.203 97.941 l 167.605 97.941 l h
112.922 72.773 m 114.121 72.773 l 114.121 85.973 l 112.922 85.973 l 
112.922 72.773 l h
116.875 72.773 m 118.074 72.773 l 118.074 83.441 l 127.34 72.387 l 
127.34 85.973 l 126.141 85.973 l 126.141 75.484 l 116.875 86.523 l 
116.875 72.773 l h
130.094 72.773 m 131.293 72.773 l 131.293 79.582 l 136.422 79.582 l 
136.422 80.711 l 131.293 80.711 l 131.293 84.84 l 136.625 84.84 l 
136.625 85.973 l 130.094 85.973 l 130.094 72.773 l h
151.559 79.344 m 151.559 81.207 150.836 82.957 149.488 84.27 c 148.16 
85.582 146.426 86.266 144.488 86.266 c 142.551 86.266 140.836 85.582 
139.508 84.27 c 138.164 82.957 137.441 81.227 137.441 79.344 c 137.441 
77.496 138.18 75.762 139.508 74.453 c 140.836 73.148 142.574 72.422 
144.488 72.422 c 146.391 72.422 148.145 73.148 149.488 74.453 c 150.82 
75.742 151.559 77.48 151.559 79.344 c h
144.488 73.492 m 141.262 73.492 138.715 76.098 138.715 79.344 c 138.715 
82.629 141.297 85.211 144.488 85.211 c 147.699 85.211 150.285 82.609 
150.285 79.344 c 150.285 76.098 147.723 73.492 144.488 73.492 c h
161.141 72.773 m 156.395 79.066 l 158.516 79.066 159.828 80.305 159.828 
82.371 c 159.828 84.789 158.41 85.973 155.547 85.973 c 153.133 85.973 l 
153.133 72.773 l 154.328 72.773 l 154.328 79.066 l 155.047 79.066 l 
159.684 72.773 l 161.141 72.773 l h
154.328 84.918 m 155.531 84.918 l 157.633 84.918 158.535 84.305 158.535 
82.406 c 158.535 80.523 157.578 80.043 155.531 80.043 c 154.328 80.043 
l 154.328 84.918 l h
169.094 72.258 m 173.801 82.852 l 174.781 72.773 l 176.016 72.773 l 
174.316 86.523 l 169.078 74.785 l 164.02 86.523 l 162.234 72.773 l 
163.469 72.773 l 164.465 82.852 l 169.094 72.258 l h
176.719 72.773 m 177.941 72.773 l 179.691 77.242 l 185.082 77.242 l 
186.762 72.773 l 188.066 72.773 l 182.516 86.484 l 176.719 72.773 l h
180.098 78.273 m 182.441 84.012 l 184.695 78.273 l 180.098 78.273 l h
199.219 83.551 m 199.254 84.879 l 198.074 85.805 196.633 86.266 194.953 
86.266 c 191.043 86.266 188.016 83.422 188.016 79.359 c 188.016 75.207 
190.988 72.422 194.953 72.422 c 196.324 72.422 197.871 72.848 199.145 
73.66 c 199.164 75.062 l 197.891 74.047 196.414 73.535 194.898 73.535 c 
191.727 73.535 189.312 75.84 189.312 79.359 c 189.312 82.777 191.617 
85.211 195.066 85.211 c 196.617 85.211 197.93 84.66 199.219 83.551 c h
197.445 90.414 m 196.617 90.414 l 194.883 88.164 l 193.129 90.414 l 
192.297 90.414 l 194.219 87.258 l 195.527 87.258 l 197.445 90.414 l h
201.309 72.773 m 202.508 72.773 l 202.508 83.441 l 211.773 72.387 l 
211.773 85.973 l 210.574 85.973 l 210.574 75.484 l 201.309 86.523 l 
201.309 72.773 l h
214.527 72.773 m 215.723 72.773 l 215.723 85.973 l 214.527 85.973 l 
214.527 72.773 l h
214.859 87.258 m 215.707 87.258 l 218.254 90.414 l 216.773 90.414 l 
214.859 87.258 l h
229.051 83.551 m 229.086 84.879 l 227.906 85.805 226.469 86.266 224.785 
86.266 c 220.875 86.266 217.848 83.422 217.848 79.359 c 217.848 75.207 
220.82 72.422 224.785 72.422 c 226.156 72.422 227.703 72.848 228.977 
73.66 c 228.996 75.062 l 227.719 74.047 226.246 73.535 224.734 73.535 c 
221.559 73.535 219.141 75.84 219.141 79.359 c 219.141 82.777 221.449 
85.211 224.898 85.211 c 226.449 85.211 227.758 84.66 229.051 83.551 c h
231.141 72.773 m 232.34 72.773 l 232.34 79.582 l 239.52 79.582 l 239.52 
72.773 l 240.719 72.773 l 240.719 85.973 l 239.52 85.973 l 239.52 
80.621 l 232.34 80.621 l 232.34 85.973 l 231.141 85.973 l 231.141 
72.773 l h
115.266 53.105 m 116.465 53.105 l 116.465 65.172 l 120.102 65.172 l 
120.102 66.301 l 111.633 66.301 l 111.633 65.172 l 115.266 65.172 l 
115.266 53.105 l h
121.566 53.105 m 128.094 53.105 l 128.094 54.23 l 122.762 54.23 l 
122.762 59.914 l 128.094 59.914 l 128.094 61.043 l 122.762 61.043 l 
122.762 65.172 l 128.094 65.172 l 128.094 66.301 l 121.566 66.301 l 
121.566 53.105 l h
140.332 63.879 m 140.371 65.211 l 139.188 66.133 137.754 66.598 136.07 
66.598 c 132.16 66.598 129.133 63.75 129.133 59.691 c 129.133 55.539 
132.102 52.75 136.07 52.75 c 137.438 52.75 138.988 53.18 140.258 53.992 
c 140.277 55.395 l 139.008 54.379 137.527 53.859 136.02 53.859 c 132.84 
53.859 130.426 56.168 130.426 59.691 c 130.426 63.109 132.734 65.543 
136.184 65.543 c 137.73 65.543 139.043 64.988 140.332 63.879 c h
142.055 53.105 m 143.254 53.105 l 143.254 59.914 l 150.43 59.914 l 
150.43 53.105 l 151.629 53.105 l 151.629 66.301 l 150.43 66.301 l 
150.43 60.945 l 143.254 60.945 l 143.254 66.301 l 142.055 66.301 l 
142.055 53.105 l h
154.383 53.105 m 155.582 53.105 l 155.582 63.773 l 164.848 52.719 l 
164.848 66.301 l 163.648 66.301 l 163.648 55.816 l 154.383 66.855 l 
154.383 53.105 l h
180.719 59.672 m 180.719 61.539 180.004 63.289 178.652 64.602 c 177.328 
65.914 175.594 66.598 173.656 66.598 c 171.719 66.598 170 65.914 
168.672 64.602 c 167.324 63.289 166.605 61.555 166.605 59.672 c 166.605 
57.828 167.344 56.094 168.672 54.785 c 170 53.473 171.734 52.75 173.656 
52.75 c 175.555 52.75 177.305 53.473 178.652 54.785 c 179.98 56.074 
180.719 57.809 180.719 59.672 c h
173.656 53.824 m 170.422 53.824 167.879 56.43 167.879 59.672 c 167.879 
62.961 170.461 65.543 173.656 65.543 c 176.863 65.543 179.445 62.941 
179.445 59.672 c 179.445 56.43 176.883 53.824 173.656 53.824 c h
182.293 53.105 m 188.016 53.105 l 188.016 54.23 l 183.496 54.23 l 
183.496 66.301 l 182.293 66.301 l 182.293 53.105 l h
201.82 59.672 m 201.82 61.539 201.098 63.289 199.754 64.602 c 198.426 
65.914 196.691 66.598 194.754 66.598 c 192.816 66.598 191.102 65.914 
189.773 64.602 c 188.422 63.289 187.703 61.555 187.703 59.672 c 187.703 
57.828 188.445 56.094 189.773 54.785 c 191.102 53.473 192.832 52.75 
194.754 52.75 c 196.656 52.75 198.406 53.473 199.754 54.785 c 201.082 
56.074 201.82 57.809 201.82 59.672 c h
194.754 53.824 m 191.523 53.824 188.977 56.43 188.977 59.672 c 188.977 
62.961 191.559 65.543 194.754 65.543 c 197.961 65.543 200.547 62.941 
200.547 59.672 c 200.547 56.43 197.98 53.824 194.754 53.824 c h
214.758 62.98 m 215.629 63.734 l 214.578 65.656 212.602 66.598 209.98 
66.598 c 206.066 66.598 203.32 63.66 203.32 59.672 c 203.32 55.559 
206.031 52.75 210.035 52.75 c 214.043 52.75 216.492 55.281 216.492 
59.434 c 216.492 59.617 l 210.625 59.617 l 210.625 58.586 l 215.184 
58.586 l 215.145 55.797 213.078 53.859 210.145 53.859 c 206.934 53.859 
204.609 56.332 204.609 59.543 c 204.609 63.031 206.844 65.508 210.145 
65.508 c 212.105 65.508 213.691 64.637 214.758 62.98 c h
218.492 53.105 m 219.691 53.105 l 219.691 66.301 l 218.492 66.301 l 
218.492 53.105 l h
222.996 53.105 m 224.199 53.105 l 224.199 66.301 l 222.996 66.301 l 
222.996 53.105 l h
223.328 67.59 m 224.176 67.59 l 226.723 70.746 l 225.25 70.746 l f*
146.598 116.23 m 154.879 116.23 l 154.879 191.625 l 146.598 191.625 l 
146.598 116.23 l h
146.598 116.23 m f*
127.887 191.625 m 142.172 191.625 l 142.172 183.344 l 136.168 183.344 l 
136.168 169.34 l 142.172 169.34 l 142.172 161.059 l 136.168 161.059 l 
136.168 116.238 l 127.887 116.238 l f*
158.758 183.34 m 158.758 191.625 l 177.16 191.625 l 177.16 183.34 l 
172.098 183.34 l 172.098 116.23 l 163.816 116.23 l 163.816 183.34 l f*
0.580392 0.596078 0.603922 rg
113.086 235.961 m 113.086 273.039 l 124.523 273.039 l 124.523 235.961 l 
113.086 235.961 l h
150.164 209.586 m 150.164 198.148 l 113.086 198.148 l 113.086 235.23 l 
124.523 235.23 l 124.523 209.586 l 150.164 209.586 l h
125.25 235.961 m 125.25 273.039 l 137.344 273.039 l 137.344 235.961 l 
125.25 235.961 l h
150.164 222.41 m 150.164 210.316 l 125.25 210.316 l 125.25 235.23 l 
137.344 235.23 l 137.344 222.41 l 150.164 222.41 l h
138.074 223.145 m 138.074 235.23 l 150.164 235.23 l 150.164 223.145 l 
138.074 223.145 l h
163.719 235.961 m 163.719 273.039 l 175.809 273.039 l 175.809 235.961 l 
163.719 235.961 l h
150.895 223.148 m 150.895 235.23 l 162.98 235.23 l 162.789 228.688 
157.441 223.34 150.895 223.148 c h
150.895 210.32 m 150.895 222.414 l 157.84 222.605 163.516 228.281 
163.715 235.23 c 175.801 235.23 l 175.609 221.617 164.512 210.52 
150.895 210.32 c h
150.895 209.59 m 164.914 209.785 176.34 221.211 176.535 235.23 c 
187.973 235.23 l 187.777 214.91 171.219 198.355 150.895 198.152 c 
150.895 209.59 l h
151.164 235.961 m 151.164 273.039 l 162.984 273.039 l 162.984 235.961 l 
151.164 235.961 l h
138.074 235.961 m 138.074 273.039 l 149.895 273.039 l 149.895 235.961 l 
138.074 235.961 l h
176.539 235.961 m 176.539 273.039 l 187.973 273.039 l 187.973 235.961 l 
176.539 235.961 l h
111.812 196.879 m 150.531 196.879 l 171.812 196.879 189.18 214.195 
189.246 235.48 c 189.246 235.598 l 188.996 235.598 l 188.996 235.711 l 
189.246 235.711 l 189.246 274.312 l 111.812 274.312 l 111.812 196.879 l f
269.648 191.367 m 269.648 179.93 l 232.574 179.93 l 232.574 191.367 l 
269.648 191.367 l h
269.648 179.199 m 269.648 167.109 l 232.574 167.109 l 232.574 179.199 l 
269.648 179.199 l h
269.648 166.383 m 269.648 154.559 l 232.574 154.559 l 232.574 166.383 l 
269.648 166.383 l h
269.648 153.289 m 269.648 141.465 l 232.574 141.465 l 232.574 153.289 l 
269.648 153.289 l h
269.648 140.734 m 269.648 128.648 l 232.574 128.648 l 232.574 140.734 l 
269.648 140.734 l h
269.648 127.914 m 269.648 116.48 l 232.574 116.48 l 232.574 127.914 l 
269.648 127.914 l h
231.84 191.367 m 231.84 179.93 l 194.762 179.93 l 194.762 191.367 l 
231.84 191.367 l h
231.84 179.199 m 231.84 167.109 l 194.762 167.109 l 194.762 179.199 l 
231.84 179.199 l h
231.84 166.383 m 231.84 154.289 l 194.762 154.289 l 194.762 166.383 l 
231.84 166.383 l h
231.84 127.918 m 231.84 116.48 l 211.516 116.68 194.957 133.234 194.762 
153.559 c 206.199 153.559 l 206.395 139.539 217.82 128.109 231.84 
127.918 c h
231.84 140.742 m 231.84 128.648 l 218.223 128.844 207.125 139.941 
206.934 153.559 c 219.023 153.559 l 219.215 146.609 224.891 140.938 
231.84 140.742 c h
231.84 153.559 m 231.84 141.473 l 225.293 141.664 219.945 147.012 
219.758 153.559 c 231.84 153.559 l h
193.488 192.637 m 193.488 153.922 l 193.488 132.641 210.805 115.273 
232.09 115.211 c 232.203 115.211 l 232.203 115.461 l 232.324 115.461 l 
232.324 115.211 l 270.922 115.211 l 270.922 192.637 l 193.488 192.637 l f
194.762 235.961 m 194.762 273.039 l 206.195 273.039 l 206.195 235.961 l 
194.762 235.961 l h
231.84 209.59 m 231.84 198.152 l 211.516 198.355 194.957 214.91 194.762 
235.23 c 206.199 235.23 l 206.395 221.211 217.82 209.785 231.84 209.59 
c h
219.023 235.23 m 219.215 228.281 224.891 222.605 231.84 222.414 c 
231.84 210.32 l 218.223 210.52 207.125 221.617 206.934 235.23 c 219.023 
235.23 l h
206.926 235.961 m 206.926 273.039 l 219.02 273.039 l 219.02 235.961 l 
206.926 235.961 l h
219.746 235.961 m 219.746 273.039 l 221.723 273.039 230.02 273.035 
231.57 273.035 c 231.57 235.961 l 219.746 235.961 l h
231.84 235.23 m 231.84 223.148 l 225.293 223.34 219.945 228.688 219.758 
235.23 c 231.84 235.23 l h
269.648 273.039 m 269.648 235.961 l 258.211 235.961 l 258.211 273.039 l 
269.648 273.039 l h
232.566 223.148 m 232.566 235.23 l 244.652 235.23 l 244.465 228.688 
239.117 223.34 232.566 223.148 c h
232.84 235.961 m 232.84 273.035 l 234.391 273.035 242.684 273.039 
244.656 273.039 c 244.656 235.961 l 232.84 235.961 l h
232.566 210.32 m 232.566 222.414 l 239.516 222.605 245.195 228.281 
245.383 235.23 c 257.477 235.23 l 257.281 221.617 246.184 210.52 
232.566 210.32 c h
245.156 235.961 m 245.156 273.039 l 257.484 273.039 l 257.484 235.961 l 
245.156 235.961 l h
269.645 235.23 m 269.449 214.91 252.887 198.355 232.566 198.152 c 
232.566 209.59 l 246.582 209.785 258.012 221.211 258.211 235.23 c 
269.645 235.23 l h
232.203 196.879 m 253.488 196.879 270.855 214.195 270.918 235.48 c 
270.918 274.312 l 193.488 274.312 l 193.488 235.48 l 193.555 214.195 
210.922 196.879 232.203 196.879 c f
342.566 274.961 m 346.77 276.086 l 347.008 275.188 l 342.809 274.062 l f*
333.629 254.961 m 337.828 256.086 l 338.07 255.188 l 333.871 254.059 l f*
373.371 234.934 m 377.574 236.059 l 377.816 235.156 l 373.613 234.035 l f*
299.59 255.359 m 302.777 256.215 l 302.777 255.254 l 299.59 254.398 l 
296.402 255.254 l 296.402 256.215 l f*
339.168 214.941 m 342.355 215.793 l 342.355 214.828 l 339.172 213.98 l 
335.98 214.828 l 335.98 215.789 l f*
281.969 256.445 m 288.746 273.66 l 287.082 273.66 l 281.988 260.012 l 
277.16 273.66 l 275.395 273.66 l 281.969 256.445 l h
293.883 256.895 m 295.406 256.895 l 295.406 264.609 l 300.918 273.66 l 
299.18 273.66 l 294.656 265.969 l 290.152 273.66 l 288.32 273.66 l 
293.883 264.609 l 293.883 256.895 l h
300.07 259.707 m 300.961 257.547 302.535 256.445 304.738 256.445 c 
307.766 256.445 309.641 258.348 309.641 261.352 c 309.641 263.879 
308.516 264.957 306.051 266.293 c 303.871 267.496 302.344 267.961 
302.344 270.004 c 302.344 271.648 303.379 272.699 305.039 272.699 c 
306.262 272.699 307.199 272.184 307.668 271.227 c 308.844 271.926 l 
308.066 273.332 306.824 274.062 305.137 274.062 c 302.555 274.062 
300.797 272.398 300.797 270.023 c 300.797 267.684 302.344 266.602 
304.996 265.215 c 306.965 264.188 308.188 263.414 308.188 261.352 c 
308.188 259.098 306.918 257.809 304.809 257.809 c 303.168 257.809 
301.852 258.742 301.383 260.41 c 300.07 259.707 l h
327.977 265.242 m 327.977 267.613 327.07 269.84 325.352 271.504 c 
323.66 273.164 321.457 274.035 318.996 274.035 c 316.531 274.035 
314.352 273.164 312.66 271.504 c 310.949 269.84 310.039 267.633 310.039 
265.242 c 310.039 262.895 310.973 260.695 312.66 259.027 c 314.352 
257.363 316.555 256.445 318.996 256.445 c 321.41 256.445 323.641 
257.363 325.352 259.027 c 327.039 260.668 327.977 262.875 327.977 
265.242 c h
318.996 257.809 m 314.895 257.809 311.656 261.113 311.656 265.242 c 
311.656 269.418 314.938 272.699 318.996 272.699 c 323.074 272.699 
326.359 269.395 326.359 265.242 c 326.359 261.113 323.102 257.809 
318.996 257.809 c h
329.383 256.895 m 330.906 256.895 l 330.906 265.406 l 338.648 256.895 l 
340.852 256.895 l 332.527 265.641 l 340.477 273.66 l 338.484 273.66 l 
330.906 265.805 l 330.906 273.66 l 329.383 273.66 l 329.383 256.895 l h
341.344 256.895 m 349.645 256.895 l 349.645 258.32 l 342.867 258.32 l 
342.867 265.543 l 349.645 265.543 l 349.645 266.977 l 342.867 266.977 l 
342.867 272.234 l 349.645 272.234 l 349.645 273.66 l 341.344 273.66 l 
341.344 256.895 l h
277.629 253.633 m 277.629 243.176 l 277.629 238.648 279.625 236.418 
283.723 236.418 c 287.832 236.418 289.824 238.648 289.824 243.176 c 
289.824 253.633 l 288.301 253.633 l 288.301 242.684 l 288.301 239.398 
286.824 237.781 283.723 237.781 c 280.609 237.781 279.156 239.398 
279.156 242.684 c 279.156 253.633 l 277.629 253.633 l h
305.395 250.562 m 305.445 252.254 l 303.941 253.422 302.113 254.008 
299.98 254.008 c 295.004 254.008 291.16 250.398 291.16 245.238 c 291.16 
239.961 294.934 236.418 299.98 236.418 c 301.715 236.418 303.68 236.961 
305.301 237.988 c 305.324 239.773 l 303.707 238.48 301.832 237.824 
299.906 237.824 c 295.871 237.824 292.805 240.758 292.805 245.238 c 
292.805 249.578 295.734 252.672 300.117 252.672 c 302.09 252.672 
303.754 251.969 305.395 250.562 c h
307.223 236.867 m 315.527 236.867 l 315.527 238.297 l 308.746 238.297 l 
308.746 245.523 l 315.527 245.523 l 315.527 246.949 l 308.746 246.949 l 
308.746 252.203 l 315.527 252.203 l 315.527 253.633 l 307.223 253.633 l 
307.223 236.867 l h
317.285 236.867 m 318.809 236.867 l 318.809 250.418 l 330.582 236.363 l 
330.582 253.633 l 329.055 253.633 l 329.055 240.312 l 317.285 254.34 l 
317.285 236.867 l h
333.488 236.867 m 335.016 236.867 l 335.016 253.633 l 333.488 253.633 l 
333.488 236.867 l h
280.68 216.836 m 282.199 216.836 l 282.199 232.176 l 286.824 232.176 l 
286.824 233.605 l 276.055 233.605 l 276.055 232.176 l 280.68 232.176 l 
280.68 216.836 l h
287.855 216.836 m 296.156 216.836 l 296.156 218.27 l 289.375 218.27 l 
289.375 225.492 l 296.156 225.492 l 296.156 226.922 l 289.375 226.922 l 
289.375 232.176 l 296.156 232.176 l 296.156 233.605 l 287.855 233.605 l 
287.855 216.836 l h
310.883 230.531 m 310.93 232.223 l 309.426 233.398 307.602 233.984 
305.465 233.984 c 300.492 233.984 296.648 230.367 296.648 225.211 c 
296.648 219.934 300.418 216.387 305.465 216.387 c 307.199 216.387 
309.172 216.93 310.789 217.965 c 310.809 219.742 l 309.195 218.457 
307.316 217.801 305.395 217.801 c 301.363 217.801 298.285 220.727 
298.285 225.211 c 298.285 229.547 301.219 232.645 305.609 232.645 c 
307.574 232.645 309.238 231.938 310.883 230.531 c h
312.238 216.836 m 313.766 216.836 l 313.766 225.492 l 322.887 225.492 l 
322.887 216.836 l 324.41 216.836 l 324.41 233.605 l 322.887 233.605 l 
322.887 226.801 l 313.766 226.801 l 313.766 233.605 l 312.238 233.605 l 
312.238 216.836 l h
326.617 216.836 m 328.141 216.836 l 328.141 230.395 l 339.914 216.344 l 
339.914 233.605 l 338.391 233.605 l 338.391 220.285 l 326.617 234.312 l 
326.617 216.836 l h
342.117 216.836 m 343.641 216.836 l 343.641 233.605 l 342.117 233.605 l 
342.117 216.836 l h
359.285 230.531 m 359.332 232.223 l 357.828 233.398 356 233.984 353.863 
233.984 c 348.895 233.984 345.047 230.367 345.047 225.211 c 345.047 
219.934 348.824 216.387 353.863 216.387 c 355.602 216.387 357.574 
216.93 359.191 217.965 c 359.215 219.742 l 357.59 218.457 355.719 
217.801 353.793 217.801 c 349.762 217.801 346.688 220.727 346.688 
225.211 c 346.688 229.547 349.621 232.645 354.004 232.645 c 355.973 
232.645 357.641 231.938 359.285 230.531 c h
360.645 216.836 m 362.164 216.836 l 362.164 225.355 l 369.906 216.836 l 
372.109 216.836 l 363.785 225.586 l 371.738 233.605 l 369.738 233.605 l 
362.164 225.75 l 362.164 233.605 l 360.645 233.605 l 360.645 216.836 l 
h
372.137 216.836 m 380.434 216.836 l 380.434 218.27 l 373.656 218.27 l 
373.656 225.492 l 380.434 225.492 l 380.434 226.922 l 373.656 226.922 l 
373.656 232.176 l 380.434 232.176 l 380.434 233.605 l 372.137 233.605 l 
372.137 216.836 l h
281.969 196.359 m 288.746 213.578 l 287.082 213.578 l 281.988 199.926 l 
277.16 213.578 l 275.395 213.578 l 281.969 196.359 l h
296.672 196.812 m 299.602 196.812 l 301.738 196.812 303.312 196.828 
304.574 197.816 c 305.727 198.711 306.316 199.996 306.316 201.734 c 
306.316 203.887 304.996 205.391 302.867 205.695 c 304.484 206.098 
305.496 207.438 305.496 209.215 c 305.496 210.695 304.883 211.938 
303.781 212.758 c 302.723 213.527 301.41 213.578 299.582 213.578 c 
296.672 213.578 l 296.672 196.812 l h
298.199 198.125 m 298.199 204.805 l 300.73 204.805 l 301.738 204.805 
302.609 204.785 303.332 204.336 c 304.152 203.844 304.672 202.812 
304.672 201.43 c 304.672 200.324 304.203 199.273 303.496 198.73 c 
302.723 198.145 301.738 198.125 300.449 198.125 c 298.199 198.125 l h
298.199 206.121 m 298.199 212.242 l 300.094 212.242 l 302.746 212.242 
303.918 211.605 303.918 209.098 c 303.918 206.73 302.609 206.121 
300.094 206.121 c 298.199 206.121 l h
318.32 196.812 m 312.289 204.805 l 314.988 204.805 316.656 206.379 
316.656 209.008 c 316.656 212.078 314.848 213.578 311.211 213.578 c 
308.141 213.578 l 308.141 196.812 l 309.664 196.812 l 309.664 204.805 l 
310.578 204.805 l 316.469 196.812 l 318.32 196.812 l h
309.664 212.242 m 311.191 212.242 l 313.863 212.242 315.016 211.465 
315.016 209.051 c 315.016 206.66 313.793 206.051 311.191 206.051 c 
309.664 206.051 l 309.664 212.242 l h
319.023 196.812 m 320.547 196.812 l 320.547 210.359 l 332.32 196.312 l 
332.32 213.578 l 330.793 213.578 l 330.793 200.254 l 319.023 214.281 l 
319.023 196.812 l h
334.988 196.812 m 343.289 196.812 l 343.289 198.238 l 336.516 198.238 l 
336.516 205.465 l 343.289 205.465 l 343.289 206.895 l 336.516 206.895 l 
336.516 212.148 l 343.289 212.148 l 343.289 213.578 l 334.988 213.578 l f*
113.086 116.48 m 113.086 191.367 l 188.09 191.367 l 188.09 116.48 l 
113.086 116.48 l h
111.812 192.637 m 111.812 115.211 l 189.246 115.211 l 189.246 192.637 l 
111.812 192.637 l f*
Q q
111.633 276.086 m 111.633 52.719 l 380.434 52.719 l 380.434 276.086 l 
111.633 276.086 l h
111.633 276.086 m W n
  Q
Q
Q q
1 g
0.8 w
0 J
0 j
[] 0.0 d
4 M q 1 0 0 -1 0 842.400024 cm
0 575.844 m 0 791.543 l S Q
Q
showpage
%%Trailer
count op_count sub {pop} repeat
countdictstack dict_count sub {end} repeat
cairo_eps_state restore
%%EOF
