Fix support for UNC paths in Powershell executor

29 jobs for master in 26 minutes (queued for 1 second)
Status Job ID Name Coverage
  Prebuild
passed #119492960
clone test repo

00:01:16

passed #119492963
dep check

00:01:26

passed #119492959
docker
helper images

00:04:03

manual #119492961
allowed to fail manual
review-docs-deploy
passed #119492962
gitlab-org
tests definitions

00:02:27

 
  Test
passed #119492964
code_quality

00:01:19

passed #119492979
docs check links

00:00:45

passed #119492981
git 1.7.1

00:01:51

passed #119492965
docker
unit tests 0 5

00:05:51

passed #119492966
docker
unit tests 1 5

00:12:19

passed #119492967
docker
unit tests 2 5

00:09:27

passed #119492968
docker
unit tests 3 5

00:02:58

passed #119492969
docker
unit tests 4 5

00:04:34

passed #119492970
docker
unit tests with race 0 5

00:06:44

failed #119492972
docker allowed to fail
unit tests with race 1 5

00:12:40

failed #119492973
docker allowed to fail
unit tests with race 2 5

00:11:09

passed #119492975
docker
unit tests with race 3 5

00:03:53

failed #119492977
docker allowed to fail
unit tests with race 4 5

00:05:02

 
  Coverage
passed #119492984
race conditions detector

00:00:49

passed #119492983
test coverage report

00:00:54

55.4%
passed #119492985
test junit report

00:01:26

 
  Build
passed #119492986
gitlab-org
binaries darwin/386 darwin/amd64

00:03:44

passed #119492987
gitlab-org
binaries freebsd/386 freebsd/amd64 freebsd/arm

00:05:05

passed #119492988
gitlab-org
binaries linux/386 linux/amd64 linux/arm

00:04:44

passed #119492989
gitlab-org
binaries windows/386 windows/amd64

00:03:44

 
  Package
passed #119492990
gitlab-org
package-deb

00:02:08

passed #119492991
gitlab-org
package-rpm

00:01:30

 
  Release
passed #119492992
static QA

00:00:33

 
  Cleanup
manual #119492993
allowed to fail manual
review-docs-cleanup
 
Name Stage Failure
failed
unit tests with race 1 5 Test
coverage: 49.7% of statements
ok gitlab.com/gitlab-org/gitlab-runner/executors/docker/machine 1.053s
Makefile:134: recipe for target 'parallel_test_execute' failed
make: *** [parallel_test_execute] Error 1
Uploading artifacts...
.cover/*: found 11 matching files
.testoutput/*: found 11 matching files

Uploading artifacts to coordinator... ok
id=119492972 responseStatus=201 Created token=aMTWKeh5
ERROR: Job failed: exit code 1
failed
unit tests with race 4 5 Test
coverage: 14.3% of statements
ok gitlab.com/gitlab-org/gitlab-runner/shells 1.056s
Makefile:134: recipe for target 'parallel_test_execute' failed
make: *** [parallel_test_execute] Error 1
Uploading artifacts...
.cover/*: found 8 matching files
.testoutput/*: found 8 matching files

Uploading artifacts to coordinator... ok
id=119492977 responseStatus=201 Created token=RbgQx2UM
ERROR: Job failed: exit code 1
failed
unit tests with race 2 5 Test
coverage: 3.7% of statements
ok gitlab.com/gitlab-org/gitlab-runner/executors/virtualbox 1.047s
Makefile:134: recipe for target 'parallel_test_execute' failed
make: *** [parallel_test_execute] Error 1
Uploading artifacts...
.cover/*: found 11 matching files
.testoutput/*: found 11 matching files

Uploading artifacts to coordinator... ok
id=119492973 responseStatus=201 Created token=5cwRwXiB
ERROR: Job failed: exit code 1