// Jest Snapshot v1, https://goo.gl/fbAQLP

exports[`AnalysisSampleFormPageView should display correctly 1`] = `
<div
  className="container"
>
  <form
    className="form-horizontal"
  >
    <div
      className="page-header"
    >
      <button
        className="btn btn-default pull-right"
        onClick={[Function]}
      >
        Endre prøve
      </button>
      <h1>
        Prøve
      </h1>
    </div>
    <div
      className="pull-right"
    >
      <button
        className="btn btn-default"
        onClick={[Function]}
      >
        Opprett analyse
      </button>
      <button
        className="btn btn-default"
        onClick={[Function]}
      >
         Opprett prøve
      </button>
    </div>
    <div>
      <MetaInformation
        registeredBy="Per Hansen"
        registeredDate="1992-01-05"
        updatedBy="Ole Hansen"
        updatedDate="1992-01-01"
      />
      <hr />
    </div>
    <h4>
      Avledet fra objekt
    </h4>
    <ObjectAndSampleDetails
      appSession={
        Object {
          "actor": Object {
            "dataportenId": "12345",
            "fn": "Jarl",
          },
          "museumId": 99,
          "token": "1234",
        }
      }
      objectData={
        Object {
          "derivedFrom": Object {},
        }
      }
    />
    <hr />
    <h4>
      Personer tilknyttet prøveuttaket
    </h4>
    <Component
      getDisplayNameForRole={[Function]}
    />
    <hr />
    <div
      className="form-group"
    >
      <label
        className="control-label col-md-2"
      >
        Prøvenr.
      </label>
      <div
        className="col-md-2"
      >
        <p
          className="form-control-static"
        >
          12
        </p>
      </div>
    </div>
    <div
      className="form-group"
    >
      <label
        className="control-label col-md-2"
      >
        PrøveID
      </label>
      <div
        className="col-md-2"
      >
        <p
          className="form-control-static"
        >
          1233
        </p>
      </div>
    </div>
    <div
      className="form-group"
    >
      <label
        className="control-label col-md-2"
      >
        Ekstern ID
      </label>
      <div
        className="col-md-3"
      >
        <p
          className="form-control-static"
        >
          1234
        </p>
      </div>
      <label
        className="control-label col-md-2"
      >
        Kilde for ekstern ID
      </label>
      <div
        className="col-md-2"
      >
        <p
          className="form-control-static"
        >
          Museum
        </p>
      </div>
    </div>
    <ReadOnlySampleType />
    <div
      className="form-group"
    >
      <label
        className="control-label col-md-2"
      >
        Beskrivelse av prøve
      </label>
      <div
        className="col-md-8"
      >
        <p
          className="form-control-static"
        >
          description
        </p>
      </div>
    </div>
    <div
      className="form-group"
    >
      <label
        className="control-label col-md-2"
      >
        Status
      </label>
      <div
        className="col-md-2"
      >
        <p
          className="form-control-static"
        />
      </div>
    </div>
    <div
      className="form-group"
    >
      <label
        className="control-label col-md-2"
      >
        Prøvevolum/-vekt
      </label>
      <div
        className="col-md-2"
      >
        <p
          className="form-control-static"
        >
          1,23 tonn
        </p>
      </div>
    </div>
    <div
      className="form-group"
    >
      <label
        className="control-label col-md-2"
      >
        Lagringskontainer
      </label>
      <div
        className="col-md-2"
      >
        <p
          className="form-control-static"
        >
          Reagensrør
        </p>
      </div>
    </div>
    <div
      className="form-group"
    >
      <label
        className="control-label col-md-2"
      >
        Lagringsmedium
      </label>
      <div
        className="col-md-2"
      >
        <p
          className="form-control-static"
        >
          Etanol
        </p>
      </div>
    </div>
    <div
      className="form-group"
    >
      <label
        className="control-label col-md-2"
      >
        Behandling
      </label>
      <div
        className="col-md-2"
      >
        <p
          className="form-control-static"
        >
          1233
        </p>
      </div>
    </div>
    <div
      className="form-group"
    >
      <label
        className="control-label col-md-2"
      >
        Har restmateriale
      </label>
      <div
        className="col-md-2"
      >
        <p
          className="form-control-static"
        >
          Nei
        </p>
      </div>
    </div>
    <div
      className="form-group"
    >
      <label
        className="control-label col-md-2"
      >
        Kommentar
      </label>
      <div
        className="col-md-8"
      >
        <p
          className="form-control-static"
        >
          23444455555
        </p>
      </div>
    </div>
    <hr />
    <button
      className="btn-link"
      onClick={[Function]}
      style={
        Object {
          "marginLeft": 20,
        }
      }
    >
      Avbryt
    </button>
  </form>
</div>
`;
