{
  "museumCollections": [
    {
      "uuid": "925748d6-bf49-4733-afd1-0e127d639f18",
      "name": "AllCollections",
      "oldSchemaNames": [1,2,3,4,5,6,7,8,9,10]
    },
    {
      "uuid": "2e4f2455-1b3b-4a04-80a1-ba92715ff613",
      "name": "Arkeologi",
      "oldSchemaNames": [1]
    },
    {
      "uuid": "88b35138-24b5-4e62-bae4-de80fae7df82",
      "name": "Etnografi",
      "oldSchemaNames": [2]
    },
    {
      "uuid": "8bbdf9b3-56d1-479a-9509-2ea82842e8f8",
      "name": "Numismatikk",
      "oldSchemaNames": [3]
    },
    {
      "uuid": "fcb4c598-8b05-4095-ac00-ce66247be38a",
      "name": "Lav",
      "oldSchemaNames": [4]
    },
    {
      "uuid": "d0dd5ad3-c22f-4ea0-8b52-dc5b0e17aa24",
      "name": "Mose",
      "oldSchemaNames": [5]
    },
    {
      "uuid": "23ca0166-5f9e-44c2-ab0d-b4cdd704af07",
      "name": "Sopp",
      "oldSchemaNames": [6]
    },
    {
      "uuid": "1d8dd4e6-1527-439c-ac86-fc315e0ce852",
      "name": "Alger",
      "oldSchemaNames": [7]
    },
    {
      "uuid": "7352794d-4973-447b-b84e-2635cafe910a",
      "name": "Karplanter",
      "oldSchemaNames": [8]
    },
    {
      "uuid": "ba3d4d30-810b-4c07-81b3-37751f2196f0",
      "name": "Entomologi",
      "oldSchemaNames": [9]
    },
    {
      "uuid": "ef4dc066-b6f8-4155-89f8-7aa9aeeb2dc4",
      "name": "Marine invertebrater",
      "oldSchemaNames": [10]
    }
  ],
  "groups": [
    {
      "id": "c0f20097-e803-4d1f-9d86-7b36bcfaec19",
      "name": "GodAccess",
      "module": 1,
      "permission": 10000,
      "museumId": 10000,
      "description": "Application administrator with access to all functionality",
      "collections": [
        "925748d6-bf49-4733-afd1-0e127d639f18"
      ]
    },
    {
      "id": "869cc344-5515-49c0-a7a5-79e371f4e64b",
      "name": "TestAppAdmin",
      "module": 1,
      "permission": 40,
      "museumId": 10000,
      "description": "Application administrator with access to all functionality",
      "collections": [
        "925748d6-bf49-4733-afd1-0e127d639f18"
      ]
    },
    {
      "id": "2d503a2e-2211-45dd-a99f-fe1a38b5f2a2",
      "name": "TestSfRead",
      "module": 1,
      "permission": 10,
      "museumId": 99,
      "description": "Read access to storage facility for TEST",
      "collections": [
        "2e4f2455-1b3b-4a04-80a1-ba92715ff613",
        "8bbdf9b3-56d1-479a-9509-2ea82842e8f8"
      ]
    },
    {
      "id": "c81c314c-0675-4cd1-8956-c96a7163825b",
      "name": "TestSfWrite",
      "module": 1,
      "permission": 20,
      "museumId": 99,
      "description": "Write access to storage facility for TEST",
      "collections": [
        "2e4f2455-1b3b-4a04-80a1-ba92715ff613"
      ]
    },
    {
      "id": "bc4b4d44-9470-4622-8e29-03f0bfaf5149",
      "name": "TestSfAdmin",
      "module": 1,
      "permission": 30,
      "museumId": 99,
      "description": "Admin access to storage facility for TEST",
      "collections": [
        "2e4f2455-1b3b-4a04-80a1-ba92715ff613",
        "8bbdf9b3-56d1-479a-9509-2ea82842e8f8",
        "88b35138-24b5-4e62-bae4-de80fae7df82"
      ]
    },
    {
      "id": "3ce7692d-2101-45a4-955b-0ca861540cd9",
      "name": "KhmSfRead",
      "module": 1,
      "permission": 10,
      "museumId": 3,
      "description": "Read access to storage facility for KHM",
      "collections": [
        "2e4f2455-1b3b-4a04-80a1-ba92715ff613",
        "8bbdf9b3-56d1-479a-9509-2ea82842e8f8",
        "88b35138-24b5-4e62-bae4-de80fae7df82"
      ]
    },
    {
      "id": "fd34b019-81e1-47a2-987b-64389d6fce04",
      "name": "KhmSfWrite",
      "module": 1,
      "permission": 20,
      "museumId": 3,
      "description": "Write access to storage facility for KHM",
      "collections": [
        "2e4f2455-1b3b-4a04-80a1-ba92715ff613",
        "8bbdf9b3-56d1-479a-9509-2ea82842e8f8",
        "88b35138-24b5-4e62-bae4-de80fae7df82"
      ]
    },
    {
      "id": "de48b2dd-f25c-4b06-a5d4-7de45780ef2e",
      "name": "KhmSfAdmin",
      "module": 1,
      "permission": 30,
      "museumId": 3,
      "description": "Admin access to storage facility for KHM",
      "collections": [
        "2e4f2455-1b3b-4a04-80a1-ba92715ff613",
        "8bbdf9b3-56d1-479a-9509-2ea82842e8f8",
        "88b35138-24b5-4e62-bae4-de80fae7df82"
      ]
    },
    {
      "id": "92e3b487-c962-43d9-a2ea-b8a7bed1b67a",
      "name": "NhmSfRead",
      "module": 1,
      "permission": 10,
      "museumId": 4,
      "description": "Read access to storage facility for NHM",
      "collections": [
        "ba3d4d30-810b-4c07-81b3-37751f2196f0"
      ]
    },
    {
      "id": "f311dd04-89b8-48a4-b4cd-68092f76ebab",
      "name": "NhmSfWrite",
      "module": 1,
      "permission": 20,
      "museumId": 4,
      "description": "Write access to storage facility for NHM",
      "collections": [
        "ba3d4d30-810b-4c07-81b3-37751f2196f0"
      ]
    },
    {
      "id": "5aa16994-92b3-45df-adfa-7f9fdf54ce34",
      "name": "NhmSfAdmin",
      "module": 1,
      "permission": 30,
      "museumId": 4,
      "description": "Admin access to storage facility for NHM",
      "collections": [
        "ba3d4d30-810b-4c07-81b3-37751f2196f0"
      ]
    },
    {
      "id": "b923b5df-54d3-4724-9386-c1273561f1a1",
      "name": "UmSfRead",
      "module": 1,
      "permission": 10,
      "museumId": 2,
      "description": "Read access to storage facility for UM",
      "collections": [
        "2e4f2455-1b3b-4a04-80a1-ba92715ff613",
        "8bbdf9b3-56d1-479a-9509-2ea82842e8f8",
        "88b35138-24b5-4e62-bae4-de80fae7df82"
      ]
    },
    {
      "id": "6ae158a1-398c-4f05-9992-1e19759e3221",
      "name": "UmSfWrite",
      "module": 1,
      "permission": 20,
      "museumId": 2,
      "description": "Write access to storage facility for UM",
      "collections": [
        "2e4f2455-1b3b-4a04-80a1-ba92715ff613",
        "8bbdf9b3-56d1-479a-9509-2ea82842e8f8",
        "88b35138-24b5-4e62-bae4-de80fae7df82"
      ]
    },
    {
      "id": "0ccefaff-aee3-4447-98e5-ec29bb9b80b7",
      "name": "UmSfAdmin",
      "module": 1,
      "permission": 30,
      "museumId": 2,
      "description": "Admin access to storage facility for UM",
      "collections": [
        "2e4f2455-1b3b-4a04-80a1-ba92715ff613",
        "8bbdf9b3-56d1-479a-9509-2ea82842e8f8",
        "88b35138-24b5-4e62-bae4-de80fae7df82"
      ]
    },
    {
      "id": "428f6108-f376-47e5-80c2-0e166e75ae42",
      "name": "AmSfRead",
      "module": 1,
      "permission": 10,
      "museumId": 1,
      "description": "Read access to storage facility for AM",
      "collections": [
        "2e4f2455-1b3b-4a04-80a1-ba92715ff613",
        "8bbdf9b3-56d1-479a-9509-2ea82842e8f8",
        "88b35138-24b5-4e62-bae4-de80fae7df82"
      ]
    },
    {
      "id": "f6a43a29-c0ee-419f-b315-d343629fb9b8",
      "name": "AmSfWrite",
      "module": 1,
      "permission": 20,
      "museumId": 1,
      "description": "Write access to storage facility for AM",
      "collections": [
        "2e4f2455-1b3b-4a04-80a1-ba92715ff613",
        "8bbdf9b3-56d1-479a-9509-2ea82842e8f8",
        "88b35138-24b5-4e62-bae4-de80fae7df82"
      ]
    },
    {
      "id": "3a3a173e-cf99-4301-9988-78fcd5d3d153",
      "name": "AmSfAdmin",
      "module": 1,
      "permission": 30,
      "museumId": 1,
      "description": "Admin access to storage facility for AM",
      "collections": [
        "2e4f2455-1b3b-4a04-80a1-ba92715ff613",
        "8bbdf9b3-56d1-479a-9509-2ea82842e8f8",
        "88b35138-24b5-4e62-bae4-de80fae7df82"
      ]
    },
    {
      "id": "3eb0b341-6c16-46f7-bd75-b0e12ba6cb8b",
      "name": "VmSfRead",
      "module": 1,
      "permission": 10,
      "museumId": 5,
      "description": "Read access to storage facility for VM",
      "collections": [
        "2e4f2455-1b3b-4a04-80a1-ba92715ff613",
        "8bbdf9b3-56d1-479a-9509-2ea82842e8f8",
        "88b35138-24b5-4e62-bae4-de80fae7df82"
      ]
    },
    {
      "id": "b4beaefb-d124-4f10-874d-ef59ffa1bb3b",
      "name": "VmSfWrite",
      "module": 1,
      "permission": 20,
      "museumId": 5,
      "description": "Write access to storage facility for VM",
      "collections": [
        "2e4f2455-1b3b-4a04-80a1-ba92715ff613",
        "8bbdf9b3-56d1-479a-9509-2ea82842e8f8",
        "88b35138-24b5-4e62-bae4-de80fae7df82"
      ]
    },
    {
      "id": "cd9ea5bf-7972-45c2-a0fd-b7e75fc2e5db",
      "name": "VmSfAdmin",
      "module": 1,
      "permission": 30,
      "museumId": 5,
      "description": "Admin access to storage facility for VM",
      "collections": [
        "2e4f2455-1b3b-4a04-80a1-ba92715ff613",
        "8bbdf9b3-56d1-479a-9509-2ea82842e8f8",
        "88b35138-24b5-4e62-bae4-de80fae7df82"
      ]
    },
    {
      "id": "b08efccf-a4a7-41b0-b208-acc8fc9c9bb4",
      "name": "TmuSfRead",
      "module": 1,
      "permission": 10,
      "museumId": 6,
      "description": "Read access to storage facility for TMU",
      "collections": []
    },
    {
      "id": "4f8204c3-d48f-4a7c-9c79-1136edc337fb",
      "name": "TmuSfWrite",
      "module": 1,
      "permission": 20,
      "museumId": 6,
      "description": "Write access to storage facility for TMU",
      "collections": []
    },
    {
      "id": "611202c5-8c69-444d-9b82-6aac5be150e4",
      "name": "TmuSfAdmin",
      "module": 1,
      "permission": 30,
      "museumId": 6,
      "description": "Admin access to storage facility for TMU",
      "collections": []
    },
    {
      "id": "b1bd705b-a6b4-48ee-b517-f1c7be1bb015",
      "name": "KmnSfRead",
      "module": 1,
      "permission": 10,
      "museumId": 7,
      "description": "Read access to storage facility for KMN",
      "collections": []
    },
    {
      "id": "c875ae85-7a01-4594-8e3e-7e4fbc792489",
      "name": "KmnSfWrite",
      "module": 1,
      "permission": 20,
      "museumId": 7,
      "description": "Write access to storage facility for KMN",
      "collections": []
    },
    {
      "id": "53a87b63-4628-482a-b28c-40689129b962",
      "name": "KmnSfAdmin",
      "module": 1,
      "permission": 30,
      "museumId": 7,
      "description": "Admin access to storage facility for KMN",
      "collections": []
    }
  ],

  "users": [
    {
      "userid": "1a17c60c-755d-4d88-9449-12bbd5abe5e2",
      "name": "Gjestebruker",
      "email": "foo@bar.bas" ,
      "groups": ["3ce7692d-2101-45a4-955b-0ca861540cd9"],
      "accessToken": "3136d121-3ec3-4ae1-893c-ed5755243e27"
    },
    {
      "userid": "3655615b-e385-4833-b414-9957ea225e58",
      "name": "Normalbruker",
      "email": "foo@bar.bas" ,
      "groups": ["c81c314c-0675-4cd1-8956-c96a7163825b"],
      "accessToken": "5447f41c-b30b-44c4-8b3f-fda7e1dde949"
    },
    {
      "userid": "896125d3-0563-46b6-a7c5-51f3f899ff0a",
      "name": "Super Duper User",
      "email": "foo@bar.bas",
      "groups": [
        "c0f20097-e803-4d1f-9d86-7b36bcfaec19",
        "2d503a2e-2211-45dd-a99f-fe1a38b5f2a2"
      ],
      "accessToken": "94890490-f3b9-4233-a39d-c2613303f2d2"
    },
    {
      "userid": "5aa63499-6491-4917-b577-3b161c75d489",
      "name": "Fake Test Database Coordinator",
      "email": "foo@bar.bas",
      "groups": ["869cc344-5515-49c0-a7a5-79e371f4e64b"],
      "accessToken": "d8fb33c3-f2b4-4d2a-a24a-90fbfb9ecc5e"
    },
    {
      "userid": "8efd41bb-bc58-4bbf-ac95-eea21ba9db81",
      "name": "Fake Musit Test User",
      "email": "foo@bar.bas",
      "groups": [
        "2d503a2e-2211-45dd-a99f-fe1a38b5f2a2",
        "428f6108-f376-47e5-80c2-0e166e75ae42",
        "f311dd04-89b8-48a4-b4cd-68092f76ebab",
        "b923b5df-54d3-4724-9386-c1273561f1a1"
      ],
      "accessToken": "b1b1ae9a-b4cc-403f-924b-ca2b867f8732"
    },
    {
      "userid": "caef058a-16d7-400f-9f73-3736477c6b44",
      "name": "Fake Musit Test User TEST Read",
      "email": "foo@bar.bas",
      "groups": ["2d503a2e-2211-45dd-a99f-fe1a38b5f2a2"],
      "accessToken": "710c30ed-8777-4778-b3a3-873f7a8c5d81"
    },
    {
      "userid": "a5d2a21b-ea1a-4123-bc37-6d31b81d1b2a",
      "name": "Fake Musit Test User TEST Write",
      "email": "foo@bar.bas",
      "groups": ["c81c314c-0675-4cd1-8956-c96a7163825b"],
      "accessToken": "239d84b2-07f7-4594-b42c-f2fc23cf55d3"
    },
    {
      "userid": "d63ab290-2fab-42d2-9b57-2475dfbd0b3c",
      "name": "Fake Musit Test User TEST Admin",
      "email": "foo@bar.bas",
      "groups": ["bc4b4d44-9470-4622-8e29-03f0bfaf5149"],
      "accessToken": "5fb13ef2-4e81-4600-892b-6579cb17508c"
    },
    {
      "userid": "ddb4dc62-8c14-4bac-aafd-0401f619b0ac",
      "name": "Fake Musit Test User NHM Read",
      "email": "foo@bar.bas",
      "groups": ["92e3b487-c962-43d9-a2ea-b8a7bed1b67a"],
      "accessToken": "54aa85c8-6212-4381-8d22-1d342cd8a26e"
    },
    {
      "userid": "d2bad684-d41e-4b9f-b813-70a75ea1728a",
      "name": "Fake Musit Test User NHM Write",
      "email": "foo@bar.bas",
      "groups": ["f311dd04-89b8-48a4-b4cd-68092f76ebab"],
      "accessToken": "4f925018-2213-4319-b05a-518c1ef3d09b"
    },
    {
      "userid": "84e47cd0-a9de-4513-9318-1dec4bac5433",
      "name": "Fake Musit Test User NHM Admin",
      "email": "foo@bar.bas",
      "groups": ["5aa16994-92b3-45df-adfa-7f9fdf54ce34"],
      "accessToken": "e36ead79-1d28-4adf-9e9c-23d003c1e6d4"
    },
    {
      "userid": "690674c7-57ac-45d3-8f63-a764520ebe3f",
      "name": "Fake Musit Test User VM Read",
      "email": "foo@bar.bas",
      "groups": ["690674c7-57ac-45d3-8f63-a764520ebe3f"],
      "accessToken": "0652095b-58e4-4a01-b006-d71c0081365d"
    },
    {
      "userid": "da673d83-342d-4f2c-b3bf-6136304e7131",
      "name": "Fake Musit Test User VM Write",
      "email": "foo@bar.bas",
      "groups": ["b4beaefb-d124-4f10-874d-ef59ffa1bb3b"],
      "accessToken": "c66d676f-9762-455a-8182-a8ff2ada0e98"
    },
    {
      "userid": "0967e7d7-a003-4fa5-88b2-55a0df0d8ed8",
      "name": "Fake Musit Test User VM Admin",
      "email": "foo@bar.bas",
      "groups": ["cd9ea5bf-7972-45c2-a0fd-b7e75fc2e5db"],
      "accessToken": "c1127f6d-58e4-475f-a5e7-a200717c3016"
    }
  ]
}
