%YAML 1.1
%TAG !u! tag:unity3d.com,2011:
--- !u!114 &11400000
MonoBehaviour:
  m_ObjectHideFlags: 0
  m_CorrespondingSourceObject: {fileID: 0}
  m_PrefabInstance: {fileID: 0}
  m_PrefabAsset: {fileID: 0}
  m_GameObject: {fileID: 0}
  m_Enabled: 1
  m_EditorHideFlags: 0
  m_Script: {fileID: 11500000, guid: 29de3f4ba7a7286439b5819db6c2d5af, type: 3}
  m_Name: 0Slash
  m_EditorClassIdentifier: 
  actionName: Slash
  actionDescription: Deals slashing damage to one enemy
  actionType: Attack
  damageSubtype: Slashing
  isPlayerAction: 1
  user: {fileID: 0}
  id: 0
  baseStaminaCost: 2
  staminaModifier: 0
  baseValue: 5
  valueModifier: 0
  chiTypeUsed: {fileID: 11400000, guid: e6d747e804c22d84a9e9cd1bab834c40, type: 2}
  usesFuel: 0
  isTargetingLeft: 0
  targetsSelf: 0
  actionIcon: {fileID: 2011002000472878060, guid: 72ea9691c71ba214c9ac9b2aa36fcb27, type: 3}
  actionButton: {fileID: 0}
  actionIconSprite: {fileID: 21300000, guid: d746d9814d9544e2fb24bb63bc7f27b8, type: 3}
  animation: {fileID: 7400000, guid: 802ba5380889bc0438dc3ae57f79b760, type: 2}
