%YAML 1.1
%TAG !u! tag:unity3d.com,2011:
--- !u!114 &11400000
MonoBehaviour:
  m_ObjectHideFlags: 0
  m_CorrespondingSourceObject: {fileID: 0}
  m_PrefabInstance: {fileID: 0}
  m_PrefabAsset: {fileID: 0}
  m_GameObject: {fileID: 0}
  m_Enabled: 1
  m_EditorHideFlags: 0
  m_Script: {fileID: 11500000, guid: 7db6d07098e7eda4989d88c4d789dfdb, type: 3}
  m_Name: GenericRestIncident
  m_EditorClassIdentifier: 
  incidentName: Rest
  incidentCanvasPrefab: {fileID: 1572180649785804399, guid: 8e6918e6dc07bcf4b8b864fd5b841c6c, type: 3}
  numberOfChoices: 2
  descriptionText: You come across a Voronol Core. You could either break it open
    and feast on the delicious juices within, or you could integrate it within your
    own systems. What will you do?
  background: {fileID: 21300000, guid: d61624f48676ffc4cb89d4d33afbc69d, type: 3}
  incidentImage: {fileID: 21300000, guid: 5be9a64ec10c41647aced962ded89d5d, type: 3}
  choiceTextList:
  - Break the core. Heal 50HP
  - Integrate the core. Increase Max HP by 10
  proceedText: Proceed
  choiceValueList: 320000000a000000
  consequenceTexts:
  - The juices nourish and renew your flesh. You gained 50 Hp.
  - You can feel your skin grow harder and your metal sings with joy. Gained 10 Max
    Hp.
  playerHpChange: {fileID: 11400000, guid: ce138a74086f0454dad08fe39e83790d, type: 2}
  playerMaxHpChange: {fileID: 11400000, guid: b51411717fcf65f4dba5c6c6a417d745, type: 2}
