%YAML 1.1
%TAG !u! tag:unity3d.com,2011:
--- !u!114 &11400000
MonoBehaviour:
  m_ObjectHideFlags: 0
  m_CorrespondingSourceObject: {fileID: 0}
  m_PrefabInstance: {fileID: 0}
  m_PrefabAsset: {fileID: 0}
  m_GameObject: {fileID: 0}
  m_Enabled: 1
  m_EditorHideFlags: 0
  m_Script: {fileID: 11500000, guid: 05ee11da66aafeb428ab2571b042eea2, type: 3}
  m_Name: FleshHandMoveset
  m_EditorClassIdentifier: 
  list:
  - {fileID: 11400000, guid: 5f99cd30bf87a425f80a3f86009dc71f, type: 2}
  - {fileID: 11400000, guid: 922b87f05a7d54062be3043f5f200a8f, type: 2}
  - {fileID: 11400000, guid: 869cc2a86dfb9104087a162edac0b9ec, type: 2}
