%YAML 1.1
%TAG !u! tag:unity3d.com,2011:
--- !u!114 &11400000
MonoBehaviour:
  m_ObjectHideFlags: 0
  m_CorrespondingSourceObject: {fileID: 0}
  m_PrefabInstance: {fileID: 0}
  m_PrefabAsset: {fileID: 0}
  m_GameObject: {fileID: 0}
  m_Enabled: 1
  m_EditorHideFlags: 0
  m_Script: {fileID: 11500000, guid: 29de3f4ba7a7286439b5819db6c2d5af, type: 3}
  m_Name: 0Pinch
  m_EditorClassIdentifier: 
  actionName: Pinch
  actionDescription: Deals 5 piercing damage
  actionType: Attack
  damageSubtype: Piercing
  isPlayerAction: 0
  user: {fileID: 11400000, guid: 44ef8727999e9fd47ad302ea55ba7bd1, type: 2}
  id: 0
  baseStaminaCost: 0
  staminaModifier: 0
  baseValue: 5
  valueModifier: 0
  chiTypeUsed: {fileID: 0}
  usesFuel: 0
  isTargetingLeft: 1
  targetsSelf: 0
  actionIcon: {fileID: 7585633207456017016, guid: d20a39d643ac8274ab7a143821707eb3, type: 3}
  actionButton: {fileID: 9171982905203148625, guid: fa0badb9c88443046a795fa9bab1ecea, type: 3}
  actionIconSprite: {fileID: 21300000, guid: a96366d1906202242b0b3762cab66937, type: 3}
  animation: {fileID: 7400000, guid: 802ba5380889bc0438dc3ae57f79b760, type: 2}
