%YAML 1.1
%TAG !u! tag:unity3d.com,2011:
--- !u!114 &11400000
MonoBehaviour:
  m_ObjectHideFlags: 0
  m_CorrespondingSourceObject: {fileID: 0}
  m_PrefabInstance: {fileID: 0}
  m_PrefabAsset: {fileID: 0}
  m_GameObject: {fileID: 0}
  m_Enabled: 1
  m_EditorHideFlags: 0
  m_Script: {fileID: 11500000, guid: 05ee11da66aafeb428ab2571b042eea2, type: 3}
  m_Name: OpulenceAttackList
  m_EditorClassIdentifier: 
  list:
  - {fileID: 11400000, guid: 05a7faa4840c2964a87aaf2b376cdee3, type: 2}
  - {fileID: 11400000, guid: 1ab823440f32c4e0aa3b97122dd8b704, type: 2}
  - {fileID: 11400000, guid: 9f829970053204d3dab09565e1c6f1c7, type: 2}
