"Gene","Overall V2G","Distance (Canonical TSS)","pQTL","sQTL","eQTL","Enhancer-TSS corr (FANTOM5)","PCHi-C (Javierre, 2016)","DHS-promoter corr (Thurman, 2012)","PCHi-C (Jung, 2019)","VEP (Ensembl)"
"LECT2",0.01991951710261569,342831,,,,,,,,
"TGFBI",0.05331991951710261,268826,,0.1,,,,,,
"TRPC7",0.07987927565392354,67731,,,,,,,,"intron_variant"
"MACROH2A1",0,,,,0,,,,,
"SMIM32",0.053118712273641844,104652,,,,,,,,
"IL9",0.013279678068410461,401973,,,,,,,,
"SMAD5",0.09959758551307846,164969,,,0.4,,,,,