"Gene","Overall V2G","Distance (Canonical TSS)","pQTL","sQTL","eQTL","Enhancer-TSS corr (FANTOM5)","PCHi-C (Javierre, 2016)","DHS-promoter corr (Thurman, 2012)","PCHi-C (Jung, 2019)","VEP (Ensembl)"
"POU3F1",0.013279678068410461,434929,,,,,0.1,,0,
"RRAGC",0.013279678068410461,378050,,,,,,,,
"RHBDL2",0.0066398390342052305,460108,,,,,,,,
"FHL3",0,476116,,,,,,,0,
"MYCBP",0.013279678068410461,391646,,,,,,,,
"GJA9",0.013279678068410461,399865,,,,,,,,
"UTP11",0.0066398390342052305,472464,,,,,,,0,
"SF3A3",0,491647,,,,,,,,