"Gene","Overall V2G","Distance (Canonical TSS)","pQTL","sQTL","eQTL","Enhancer-TSS corr (FANTOM5)","PCHi-C (Javierre, 2016)","DHS-promoter corr (Thurman, 2012)","PCHi-C (Jung, 2019)","VEP (Ensembl)"
"AMH",0.026559356136820922,291000,,,,,,,,
"ADAT3",0.05975855130784708,52910,,,,,,,,
"TIMM13",0.0066398390342052305,469277,,,,,,,,
"KLF16",0.053118712273641844,94730,,,,,,,,
"UQCR11",0.01991951710261569,352836,,,,,,,,
"PCSK4",0.0066398390342052305,467557,,,,,,,,
"OAZ1",0.026559356136820922,311200,,,,,,,,
"BTBD2",0.14607645875251507,76572,,,0.7,,,,0,
"MOB3A",0.04647887323943661,138364,,,,,,,0,
"SCAMP4",0.08631790744466801,52937,,,0.2,,,,,
"C19orf25",0,479090,,,,,,,,
"MKNK2",0.053118712273641844,92935,,,,,,,0,
"PEAK3",0.026559356136820922,323866,,,,,,,0,
"REXO1",0.053118712273641844,109826,,,,,,,,
"ONECUT3",0.03983903420523138,204803,,,,,,,,
"ADAMTSL5",0.0066398390342052305,444705,,,,,,,,
"REEP6",0.0066398390342052305,467143,,,,,,,,
"AP3D1",0.03983903420523138,206159,,,,,,,,
"LMNB2",0,498650,,,,,,,,
"ATP8B3",0.04647887323943661,146033,,,,,,,,
"MBD3",0.01991951710261569,365444,,,,,,,,
"DOT1L",0.03983903420523138,205624,,,,,,,,
"PLK5",0.0066398390342052305,450286,,,,,,,,
"LSM7",0.03983903420523138,370302,,,,,0.3,,,
"LINGO3",0.01991951710261569,349845,,,,,,,0,
"MEX3D",0.013279678068410461,389984,,,,,,,,
"PLEKHJ1",0.026559356136820922,279395,,,,,,,,
"TCF3",0.026559356136820922,305694,,,,,,,,
"CSNK1G2",0.3537223340040241,17137,,0.8,0.8,,,,,"intron_variant"
"SF3A2",0.026559356136820922,278515,,,,,,,,
"ABHD17A",0.05975855130784708,72813,,,,,,,,
"SPPL2B",0.01991951710261569,370306,,,,,,,,
"IZUMO4",0.04647887323943661,138120,,,,,,,0,
"JSRP1",0.026559356136820922,311450,,,,,,,,
"TMPRSS9",0.013279678068410461,401929,,,,,,,0,