"Gene","Overall V2G","Distance (Canonical TSS)","pQTL","sQTL","eQTL","Enhancer-TSS corr (FANTOM5)","PCHi-C (Javierre, 2016)","DHS-promoter corr (Thurman, 2012)","PCHi-C (Jung, 2019)","VEP (Ensembl)"
"ZMYM2",0.04647887323943661,195399,,,,,0.1,,,
"IFT88",0.013279678068410461,413062,,,,,,,,
"ZMYM5",0.026559356136820922,290427,,,,,,,0,
"GJA3",0.08651911468812877,6976,,,,,,,,"intron_variant"
"GJB6",0.053118712273641844,78289,,,,,,,,
"CRYL1",0.01991951710261569,371797,,,,,,,0,
"PSPC1",0.01991951710261569,371057,,,,,,,,
"GJB2",0.05975855130784708,38862,,,,,,,,