[INFO  uvicorn.error server:75 - serve() - 22.11.2022 11:12:53 AM]
	 Started server process [16387] 

[INFO  uvicorn.error on:47 - startup() - 22.11.2022 11:12:53 AM]
	 Waiting for application startup. 

[INFO  uvicorn.error on:61 - startup() - 22.11.2022 11:12:53 AM]
	 Application startup complete. 

[INFO  uvicorn.error server:253 - shutdown() - 22.11.2022 11:12:56 AM]
	 Shutting down 

[INFO  uvicorn.error on:66 - shutdown() - 22.11.2022 11:12:56 AM]
	 Waiting for application shutdown. 

[INFO  uvicorn.error on:77 - shutdown() - 22.11.2022 11:12:56 AM]
	 Application shutdown complete. 

[INFO  uvicorn.error server:85 - serve() - 22.11.2022 11:12:56 AM]
	 Finished server process [16387] 

[INFO  uvicorn.error server:75 - serve() - 22.11.2022 11:12:57 AM]
	 Started server process [16420] 

[INFO  uvicorn.error on:47 - startup() - 22.11.2022 11:12:57 AM]
	 Waiting for application startup. 

[INFO  uvicorn.error on:61 - startup() - 22.11.2022 11:12:57 AM]
	 Application startup complete. 

[INFO  uvicorn.error server:253 - shutdown() - 22.11.2022 11:14:01 AM]
	 Shutting down 

[INFO  uvicorn.error on:66 - shutdown() - 22.11.2022 11:14:01 AM]
	 Waiting for application shutdown. 

[INFO  uvicorn.error on:77 - shutdown() - 22.11.2022 11:14:01 AM]
	 Application shutdown complete. 

[INFO  uvicorn.error server:85 - serve() - 22.11.2022 11:14:01 AM]
	 Finished server process [16420] 

[INFO  uvicorn.error server:75 - serve() - 22.11.2022 11:14:02 AM]
	 Started server process [16578] 

[INFO  uvicorn.error on:47 - startup() - 22.11.2022 11:14:02 AM]
	 Waiting for application startup. 

[INFO  uvicorn.error on:61 - startup() - 22.11.2022 11:14:02 AM]
	 Application startup complete. 

[INFO  uvicorn.error server:253 - shutdown() - 22.11.2022 11:14:07 AM]
	 Shutting down 

[INFO  uvicorn.error on:66 - shutdown() - 22.11.2022 11:14:07 AM]
	 Waiting for application shutdown. 

[INFO  uvicorn.error on:77 - shutdown() - 22.11.2022 11:14:07 AM]
	 Application shutdown complete. 

[INFO  uvicorn.error server:85 - serve() - 22.11.2022 11:14:07 AM]
	 Finished server process [16578] 

[INFO  uvicorn.error server:75 - serve() - 22.11.2022 11:14:08 AM]
	 Started server process [16653] 

[INFO  uvicorn.error on:47 - startup() - 22.11.2022 11:14:08 AM]
	 Waiting for application startup. 

[INFO  uvicorn.error on:61 - startup() - 22.11.2022 11:14:08 AM]
	 Application startup complete. 

[INFO  uvicorn.error server:253 - shutdown() - 22.11.2022 11:14:11 AM]
	 Shutting down 

[INFO  uvicorn.error on:66 - shutdown() - 22.11.2022 11:14:11 AM]
	 Waiting for application shutdown. 

[INFO  uvicorn.error on:77 - shutdown() - 22.11.2022 11:14:11 AM]
	 Application shutdown complete. 

[INFO  uvicorn.error server:85 - serve() - 22.11.2022 11:14:11 AM]
	 Finished server process [16653] 

[INFO  uvicorn.error server:75 - serve() - 22.11.2022 11:14:12 AM]
	 Started server process [16670] 

[INFO  uvicorn.error on:47 - startup() - 22.11.2022 11:14:12 AM]
	 Waiting for application startup. 

[INFO  uvicorn.error on:61 - startup() - 22.11.2022 11:14:12 AM]
	 Application startup complete. 

[INFO  uvicorn.error server:253 - shutdown() - 22.11.2022 11:14:21 AM]
	 Shutting down 

[INFO  uvicorn.error on:66 - shutdown() - 22.11.2022 11:14:21 AM]
	 Waiting for application shutdown. 

[INFO  uvicorn.error on:77 - shutdown() - 22.11.2022 11:14:21 AM]
	 Application shutdown complete. 

[INFO  uvicorn.error server:85 - serve() - 22.11.2022 11:14:21 AM]
	 Finished server process [16670] 

[INFO  uvicorn.error server:75 - serve() - 22.11.2022 11:14:27 AM]
	 Started server process [16748] 

[INFO  uvicorn.error on:47 - startup() - 22.11.2022 11:14:27 AM]
	 Waiting for application startup. 

[INFO  uvicorn.error on:61 - startup() - 22.11.2022 11:14:27 AM]
	 Application startup complete. 

[INFO  uvicorn.error server:253 - shutdown() - 22.11.2022 11:14:28 AM]
	 Shutting down 

[INFO  uvicorn.error on:66 - shutdown() - 22.11.2022 11:14:28 AM]
	 Waiting for application shutdown. 

[INFO  uvicorn.error on:77 - shutdown() - 22.11.2022 11:14:28 AM]
	 Application shutdown complete. 

[INFO  uvicorn.error server:85 - serve() - 22.11.2022 11:14:28 AM]
	 Finished server process [16748] 

[INFO  uvicorn.error server:75 - serve() - 22.11.2022 11:14:29 AM]
	 Started server process [16777] 

[INFO  uvicorn.error on:47 - startup() - 22.11.2022 11:14:29 AM]
	 Waiting for application startup. 

[INFO  uvicorn.error on:61 - startup() - 22.11.2022 11:14:29 AM]
	 Application startup complete. 

[INFO  uvicorn.error server:253 - shutdown() - 22.11.2022 11:14:39 AM]
	 Shutting down 

[INFO  uvicorn.error on:66 - shutdown() - 22.11.2022 11:14:39 AM]
	 Waiting for application shutdown. 

[INFO  uvicorn.error on:77 - shutdown() - 22.11.2022 11:14:39 AM]
	 Application shutdown complete. 

[INFO  uvicorn.error server:85 - serve() - 22.11.2022 11:14:39 AM]
	 Finished server process [16777] 

[INFO  uvicorn.error server:75 - serve() - 22.11.2022 11:14:40 AM]
	 Started server process [16809] 

[INFO  uvicorn.error on:47 - startup() - 22.11.2022 11:14:40 AM]
	 Waiting for application startup. 

[INFO  uvicorn.error on:61 - startup() - 22.11.2022 11:14:40 AM]
	 Application startup complete. 

[INFO  uvicorn.error server:253 - shutdown() - 22.11.2022 11:14:47 AM]
	 Shutting down 

[INFO  uvicorn.error on:66 - shutdown() - 22.11.2022 11:14:47 AM]
	 Waiting for application shutdown. 

[INFO  uvicorn.error on:77 - shutdown() - 22.11.2022 11:14:47 AM]
	 Application shutdown complete. 

[INFO  uvicorn.error server:85 - serve() - 22.11.2022 11:14:47 AM]
	 Finished server process [16809] 

[INFO  uvicorn.error server:75 - serve() - 22.11.2022 11:14:51 AM]
	 Started server process [16866] 

[INFO  uvicorn.error on:47 - startup() - 22.11.2022 11:14:51 AM]
	 Waiting for application startup. 

[INFO  uvicorn.error on:61 - startup() - 22.11.2022 11:14:51 AM]
	 Application startup complete. 

[INFO  uvicorn.error server:253 - shutdown() - 22.11.2022 11:14:53 AM]
	 Shutting down 

[INFO  uvicorn.error on:66 - shutdown() - 22.11.2022 11:14:53 AM]
	 Waiting for application shutdown. 

[INFO  uvicorn.error on:77 - shutdown() - 22.11.2022 11:14:53 AM]
	 Application shutdown complete. 

[INFO  uvicorn.error server:85 - serve() - 22.11.2022 11:14:53 AM]
	 Finished server process [16866] 

[INFO  uvicorn.error server:75 - serve() - 22.11.2022 11:14:54 AM]
	 Started server process [16899] 

[INFO  uvicorn.error on:47 - startup() - 22.11.2022 11:14:54 AM]
	 Waiting for application startup. 

[INFO  uvicorn.error on:61 - startup() - 22.11.2022 11:14:54 AM]
	 Application startup complete. 

[INFO  uvicorn.error server:253 - shutdown() - 22.11.2022 11:15:00 AM]
	 Shutting down 

[INFO  uvicorn.error on:66 - shutdown() - 22.11.2022 11:15:00 AM]
	 Waiting for application shutdown. 

[INFO  uvicorn.error on:77 - shutdown() - 22.11.2022 11:15:00 AM]
	 Application shutdown complete. 

[INFO  uvicorn.error server:85 - serve() - 22.11.2022 11:15:00 AM]
	 Finished server process [16899] 

[INFO  uvicorn.error server:75 - serve() - 22.11.2022 11:15:01 AM]
	 Started server process [16940] 

[INFO  uvicorn.error on:47 - startup() - 22.11.2022 11:15:01 AM]
	 Waiting for application startup. 

[INFO  uvicorn.error on:61 - startup() - 22.11.2022 11:15:01 AM]
	 Application startup complete. 

[INFO  uvicorn.error server:253 - shutdown() - 22.11.2022 11:15:21 AM]
	 Shutting down 

[INFO  uvicorn.error on:66 - shutdown() - 22.11.2022 11:15:21 AM]
	 Waiting for application shutdown. 

[INFO  uvicorn.error on:77 - shutdown() - 22.11.2022 11:15:21 AM]
	 Application shutdown complete. 

[INFO  uvicorn.error server:85 - serve() - 22.11.2022 11:15:21 AM]
	 Finished server process [16940] 

[INFO  uvicorn.error server:75 - serve() - 22.11.2022 11:15:22 AM]
	 Started server process [17033] 

[INFO  uvicorn.error on:47 - startup() - 22.11.2022 11:15:22 AM]
	 Waiting for application startup. 

[INFO  uvicorn.error on:61 - startup() - 22.11.2022 11:15:22 AM]
	 Application startup complete. 

[INFO  uvicorn.error server:253 - shutdown() - 22.11.2022 11:15:34 AM]
	 Shutting down 

[INFO  uvicorn.error on:66 - shutdown() - 22.11.2022 11:15:34 AM]
	 Waiting for application shutdown. 

[INFO  uvicorn.error on:77 - shutdown() - 22.11.2022 11:15:34 AM]
	 Application shutdown complete. 

[INFO  uvicorn.error server:85 - serve() - 22.11.2022 11:15:34 AM]
	 Finished server process [17033] 

[INFO  uvicorn.error server:75 - serve() - 22.11.2022 11:15:35 AM]
	 Started server process [17092] 

[INFO  uvicorn.error on:47 - startup() - 22.11.2022 11:15:35 AM]
	 Waiting for application startup. 

[INFO  uvicorn.error on:61 - startup() - 22.11.2022 11:15:35 AM]
	 Application startup complete. 

[INFO  uvicorn.error server:253 - shutdown() - 22.11.2022 11:15:39 AM]
	 Shutting down 

[INFO  uvicorn.error on:66 - shutdown() - 22.11.2022 11:15:39 AM]
	 Waiting for application shutdown. 

[INFO  uvicorn.error on:77 - shutdown() - 22.11.2022 11:15:39 AM]
	 Application shutdown complete. 

[INFO  uvicorn.error server:85 - serve() - 22.11.2022 11:15:39 AM]
	 Finished server process [17092] 

[INFO  uvicorn.error server:75 - serve() - 22.11.2022 11:15:40 AM]
	 Started server process [17132] 

[INFO  uvicorn.error on:47 - startup() - 22.11.2022 11:15:40 AM]
	 Waiting for application startup. 

[INFO  uvicorn.error on:61 - startup() - 22.11.2022 11:15:40 AM]
	 Application startup complete. 

[INFO  uvicorn.error server:253 - shutdown() - 22.11.2022 11:15:45 AM]
	 Shutting down 

[INFO  uvicorn.error on:66 - shutdown() - 22.11.2022 11:15:45 AM]
	 Waiting for application shutdown. 

[INFO  uvicorn.error on:77 - shutdown() - 22.11.2022 11:15:45 AM]
	 Application shutdown complete. 

[INFO  uvicorn.error server:85 - serve() - 22.11.2022 11:15:45 AM]
	 Finished server process [17132] 

[INFO  uvicorn.error server:75 - serve() - 22.11.2022 11:15:46 AM]
	 Started server process [17163] 

[INFO  uvicorn.error on:47 - startup() - 22.11.2022 11:15:46 AM]
	 Waiting for application startup. 

[INFO  uvicorn.error on:61 - startup() - 22.11.2022 11:15:46 AM]
	 Application startup complete. 

[INFO  uvicorn.error server:253 - shutdown() - 22.11.2022 11:15:48 AM]
	 Shutting down 

[INFO  uvicorn.error on:66 - shutdown() - 22.11.2022 11:15:48 AM]
	 Waiting for application shutdown. 

[INFO  uvicorn.error on:77 - shutdown() - 22.11.2022 11:15:48 AM]
	 Application shutdown complete. 

[INFO  uvicorn.error server:85 - serve() - 22.11.2022 11:15:48 AM]
	 Finished server process [17163] 

[INFO  uvicorn.error server:75 - serve() - 22.11.2022 11:15:49 AM]
	 Started server process [17181] 

[INFO  uvicorn.error on:47 - startup() - 22.11.2022 11:15:49 AM]
	 Waiting for application startup. 

[INFO  uvicorn.error on:61 - startup() - 22.11.2022 11:15:49 AM]
	 Application startup complete. 

[INFO  uvicorn.error server:253 - shutdown() - 22.11.2022 11:15:54 AM]
	 Shutting down 

[INFO  uvicorn.error on:66 - shutdown() - 22.11.2022 11:15:54 AM]
	 Waiting for application shutdown. 

[INFO  uvicorn.error on:77 - shutdown() - 22.11.2022 11:15:54 AM]
	 Application shutdown complete. 

[INFO  uvicorn.error server:85 - serve() - 22.11.2022 11:15:54 AM]
	 Finished server process [17181] 

[INFO  uvicorn.error server:75 - serve() - 22.11.2022 11:15:57 AM]
	 Started server process [17235] 

[INFO  uvicorn.error on:47 - startup() - 22.11.2022 11:15:57 AM]
	 Waiting for application startup. 

[INFO  uvicorn.error on:61 - startup() - 22.11.2022 11:15:57 AM]
	 Application startup complete. 

[INFO  uvicorn.error server:253 - shutdown() - 22.11.2022 11:16:05 AM]
	 Shutting down 

[INFO  uvicorn.error on:66 - shutdown() - 22.11.2022 11:16:05 AM]
	 Waiting for application shutdown. 

[INFO  uvicorn.error on:77 - shutdown() - 22.11.2022 11:16:05 AM]
	 Application shutdown complete. 

[INFO  uvicorn.error server:85 - serve() - 22.11.2022 11:16:05 AM]
	 Finished server process [17235] 

[INFO  uvicorn.error server:75 - serve() - 22.11.2022 11:16:06 AM]
	 Started server process [17304] 

[INFO  uvicorn.error on:47 - startup() - 22.11.2022 11:16:06 AM]
	 Waiting for application startup. 

[INFO  uvicorn.error on:61 - startup() - 22.11.2022 11:16:06 AM]
	 Application startup complete. 

[INFO  uvicorn.error server:253 - shutdown() - 22.11.2022 11:16:16 AM]
	 Shutting down 

[INFO  uvicorn.error on:66 - shutdown() - 22.11.2022 11:16:16 AM]
	 Waiting for application shutdown. 

[INFO  uvicorn.error on:77 - shutdown() - 22.11.2022 11:16:16 AM]
	 Application shutdown complete. 

[INFO  uvicorn.error server:85 - serve() - 22.11.2022 11:16:16 AM]
	 Finished server process [17304] 

[INFO  uvicorn.error server:75 - serve() - 22.11.2022 11:16:18 AM]
	 Started server process [17360] 

[INFO  uvicorn.error on:47 - startup() - 22.11.2022 11:16:18 AM]
	 Waiting for application startup. 

[INFO  uvicorn.error on:61 - startup() - 22.11.2022 11:16:18 AM]
	 Application startup complete. 

[INFO  uvicorn.error server:253 - shutdown() - 22.11.2022 11:16:24 AM]
	 Shutting down 

[INFO  uvicorn.error on:66 - shutdown() - 22.11.2022 11:16:24 AM]
	 Waiting for application shutdown. 

[INFO  uvicorn.error on:77 - shutdown() - 22.11.2022 11:16:24 AM]
	 Application shutdown complete. 

[INFO  uvicorn.error server:85 - serve() - 22.11.2022 11:16:24 AM]
	 Finished server process [17360] 

[INFO  uvicorn.error server:75 - serve() - 22.11.2022 11:16:25 AM]
	 Started server process [17412] 

[INFO  uvicorn.error on:47 - startup() - 22.11.2022 11:16:25 AM]
	 Waiting for application startup. 

[INFO  uvicorn.error on:61 - startup() - 22.11.2022 11:16:25 AM]
	 Application startup complete. 

[INFO  uvicorn.error server:253 - shutdown() - 22.11.2022 11:16:30 AM]
	 Shutting down 

[INFO  uvicorn.error on:66 - shutdown() - 22.11.2022 11:16:30 AM]
	 Waiting for application shutdown. 

[INFO  uvicorn.error on:77 - shutdown() - 22.11.2022 11:16:30 AM]
	 Application shutdown complete. 

[INFO  uvicorn.error server:85 - serve() - 22.11.2022 11:16:30 AM]
	 Finished server process [17412] 

[INFO  uvicorn.error server:75 - serve() - 22.11.2022 11:16:31 AM]
	 Started server process [17443] 

[INFO  uvicorn.error on:47 - startup() - 22.11.2022 11:16:31 AM]
	 Waiting for application startup. 

[INFO  uvicorn.error on:61 - startup() - 22.11.2022 11:16:31 AM]
	 Application startup complete. 

[INFO  uvicorn.error server:253 - shutdown() - 22.11.2022 11:16:46 AM]
	 Shutting down 

[INFO  uvicorn.error on:66 - shutdown() - 22.11.2022 11:16:46 AM]
	 Waiting for application shutdown. 

[INFO  uvicorn.error on:77 - shutdown() - 22.11.2022 11:16:46 AM]
	 Application shutdown complete. 

[INFO  uvicorn.error server:85 - serve() - 22.11.2022 11:16:46 AM]
	 Finished server process [17443] 

[INFO  uvicorn.error server:75 - serve() - 22.11.2022 11:16:48 AM]
	 Started server process [17480] 

[INFO  uvicorn.error on:47 - startup() - 22.11.2022 11:16:48 AM]
	 Waiting for application startup. 

[INFO  uvicorn.error on:61 - startup() - 22.11.2022 11:16:48 AM]
	 Application startup complete. 

[INFO  uvicorn.error server:253 - shutdown() - 22.11.2022 11:16:49 AM]
	 Shutting down 

[INFO  uvicorn.error on:66 - shutdown() - 22.11.2022 11:16:49 AM]
	 Waiting for application shutdown. 

[INFO  uvicorn.error on:77 - shutdown() - 22.11.2022 11:16:49 AM]
	 Application shutdown complete. 

[INFO  uvicorn.error server:85 - serve() - 22.11.2022 11:16:49 AM]
	 Finished server process [17480] 

[INFO  uvicorn.error server:75 - serve() - 22.11.2022 11:16:50 AM]
	 Started server process [17511] 

[INFO  uvicorn.error on:47 - startup() - 22.11.2022 11:16:50 AM]
	 Waiting for application startup. 

[INFO  uvicorn.error on:61 - startup() - 22.11.2022 11:16:50 AM]
	 Application startup complete. 

[INFO  uvicorn.error server:253 - shutdown() - 22.11.2022 11:17:08 AM]
	 Shutting down 

[INFO  uvicorn.error on:66 - shutdown() - 22.11.2022 11:17:08 AM]
	 Waiting for application shutdown. 

[INFO  uvicorn.error on:77 - shutdown() - 22.11.2022 11:17:08 AM]
	 Application shutdown complete. 

[INFO  uvicorn.error server:85 - serve() - 22.11.2022 11:17:08 AM]
	 Finished server process [17511] 

[INFO  uvicorn.error server:75 - serve() - 22.11.2022 11:17:10 AM]
	 Started server process [17587] 

[INFO  uvicorn.error on:47 - startup() - 22.11.2022 11:17:10 AM]
	 Waiting for application startup. 

[INFO  uvicorn.error on:61 - startup() - 22.11.2022 11:17:10 AM]
	 Application startup complete. 

[INFO  uvicorn.error server:253 - shutdown() - 22.11.2022 11:17:12 AM]
	 Shutting down 

[INFO  uvicorn.error on:66 - shutdown() - 22.11.2022 11:17:12 AM]
	 Waiting for application shutdown. 

[INFO  uvicorn.error on:77 - shutdown() - 22.11.2022 11:17:12 AM]
	 Application shutdown complete. 

[INFO  uvicorn.error server:85 - serve() - 22.11.2022 11:17:12 AM]
	 Finished server process [17587] 

[INFO  uvicorn.error server:75 - serve() - 22.11.2022 11:17:14 AM]
	 Started server process [17616] 

[INFO  uvicorn.error on:47 - startup() - 22.11.2022 11:17:14 AM]
	 Waiting for application startup. 

[INFO  uvicorn.error on:61 - startup() - 22.11.2022 11:17:14 AM]
	 Application startup complete. 

[INFO  uvicorn.error server:253 - shutdown() - 22.11.2022 11:17:14 AM]
	 Shutting down 

[INFO  uvicorn.error on:66 - shutdown() - 22.11.2022 11:17:14 AM]
	 Waiting for application shutdown. 

[INFO  uvicorn.error on:77 - shutdown() - 22.11.2022 11:17:14 AM]
	 Application shutdown complete. 

[INFO  uvicorn.error server:85 - serve() - 22.11.2022 11:17:14 AM]
	 Finished server process [17616] 

[INFO  uvicorn.error server:75 - serve() - 22.11.2022 11:17:16 AM]
	 Started server process [17637] 

[INFO  uvicorn.error on:47 - startup() - 22.11.2022 11:17:16 AM]
	 Waiting for application startup. 

[INFO  uvicorn.error on:61 - startup() - 22.11.2022 11:17:16 AM]
	 Application startup complete. 

[INFO  uvicorn.error server:253 - shutdown() - 22.11.2022 11:17:18 AM]
	 Shutting down 

[INFO  uvicorn.error on:66 - shutdown() - 22.11.2022 11:17:18 AM]
	 Waiting for application shutdown. 

[INFO  uvicorn.error on:77 - shutdown() - 22.11.2022 11:17:18 AM]
	 Application shutdown complete. 

[INFO  uvicorn.error server:85 - serve() - 22.11.2022 11:17:18 AM]
	 Finished server process [17637] 

[INFO  uvicorn.error server:75 - serve() - 22.11.2022 11:17:19 AM]
	 Started server process [17652] 

[INFO  uvicorn.error on:47 - startup() - 22.11.2022 11:17:19 AM]
	 Waiting for application startup. 

[INFO  uvicorn.error on:61 - startup() - 22.11.2022 11:17:19 AM]
	 Application startup complete. 

[DEBUG  passlib.handlers.bcrypt bcrypt:625 - _load_backend_mixin() - 22.11.2022 11:17:54 AM]
	 detected 'bcrypt' backend, version '3.1.7' 

[DEBUG  passlib.handlers.bcrypt bcrypt:406 - _finalize_backend_mixin() - 22.11.2022 11:17:54 AM]
	 'bcrypt' backend lacks $2$ support, enabling workaround 

[INFO  app.users.controllers controllers:28 - register_user() - 22.11.2022 11:17:58 AM]
	 jap@yopmail.com is registered as new user 

[ERROR  app.users.controllers controllers:47 - verify_login() - 22.11.2022 11:22:38 AM]
	 2 or more items returned, instead of 1 

[INFO  app.users.controllers controllers:28 - register_user() - 22.11.2022 11:23:32 AM]
	 jap3@yopmail.com is registered as new user 

[INFO  app.users.controllers controllers:54 - verify_login() - 22.11.2022 11:23:39 AM]
	 jap3@yopmail.com is logged in the system 

[INFO  uvicorn.error server:253 - shutdown() - 22.11.2022 11:48:38 AM]
	 Shutting down 

[INFO  uvicorn.error on:66 - shutdown() - 22.11.2022 11:48:38 AM]
	 Waiting for application shutdown. 

[INFO  uvicorn.error on:77 - shutdown() - 22.11.2022 11:48:38 AM]
	 Application shutdown complete. 

[INFO  uvicorn.error server:85 - serve() - 22.11.2022 11:48:38 AM]
	 Finished server process [17652] 

[INFO  uvicorn.error server:75 - serve() - 22.11.2022 11:48:39 AM]
	 Started server process [20755] 

[INFO  uvicorn.error on:47 - startup() - 22.11.2022 11:48:39 AM]
	 Waiting for application startup. 

[INFO  uvicorn.error on:61 - startup() - 22.11.2022 11:48:39 AM]
	 Application startup complete. 

[INFO  uvicorn.error server:253 - shutdown() - 22.11.2022 11:48:48 AM]
	 Shutting down 

[INFO  uvicorn.error on:66 - shutdown() - 22.11.2022 11:48:48 AM]
	 Waiting for application shutdown. 

[INFO  uvicorn.error on:77 - shutdown() - 22.11.2022 11:48:48 AM]
	 Application shutdown complete. 

[INFO  uvicorn.error server:85 - serve() - 22.11.2022 11:48:48 AM]
	 Finished server process [20755] 

[INFO  uvicorn.error server:75 - serve() - 22.11.2022 11:48:57 AM]
	 Started server process [20862] 

[INFO  uvicorn.error on:47 - startup() - 22.11.2022 11:48:57 AM]
	 Waiting for application startup. 

[INFO  uvicorn.error on:61 - startup() - 22.11.2022 11:48:57 AM]
	 Application startup complete. 

[INFO  uvicorn.error server:253 - shutdown() - 22.11.2022 11:49:04 AM]
	 Shutting down 

[INFO  uvicorn.error on:66 - shutdown() - 22.11.2022 11:49:04 AM]
	 Waiting for application shutdown. 

[INFO  uvicorn.error on:77 - shutdown() - 22.11.2022 11:49:04 AM]
	 Application shutdown complete. 

[INFO  uvicorn.error server:85 - serve() - 22.11.2022 11:49:04 AM]
	 Finished server process [20862] 

[INFO  uvicorn.error server:75 - serve() - 22.11.2022 11:49:14 AM]
	 Started server process [20953] 

[INFO  uvicorn.error on:47 - startup() - 22.11.2022 11:49:14 AM]
	 Waiting for application startup. 

[INFO  uvicorn.error on:61 - startup() - 22.11.2022 11:49:14 AM]
	 Application startup complete. 

[ERROR  app.users.controllers controllers:47 - verify_login() - 22.11.2022 11:49:36 AM]
	 UserProfile matching query does not exist. 

[DEBUG  passlib.handlers.bcrypt bcrypt:625 - _load_backend_mixin() - 22.11.2022 11:50:22 AM]
	 detected 'bcrypt' backend, version '3.1.7' 

[DEBUG  passlib.handlers.bcrypt bcrypt:406 - _finalize_backend_mixin() - 22.11.2022 11:50:22 AM]
	 'bcrypt' backend lacks $2$ support, enabling workaround 

[INFO  app.users.controllers controllers:28 - register_user() - 22.11.2022 11:50:26 AM]
	 jap4@yopmail.com is registered as new user 

[INFO  app.users.controllers controllers:54 - verify_login() - 22.11.2022 11:50:47 AM]
	 jap4@yopmail.com is logged in the system 

[ERROR  app.users.controllers controllers:47 - verify_login() - 22.11.2022 11:50:56 AM]
	 UserProfile matching query does not exist. 

[INFO  app.users.controllers controllers:54 - verify_login() - 22.11.2022 11:54:45 AM]
	 jap4@yopmail.com is logged in the system 

[INFO  uvicorn.error server:253 - shutdown() - 22.11.2022 03:05:38 PM]
	 Shutting down 

[INFO  uvicorn.error on:66 - shutdown() - 22.11.2022 03:05:38 PM]
	 Waiting for application shutdown. 

[INFO  uvicorn.error on:77 - shutdown() - 22.11.2022 03:05:38 PM]
	 Application shutdown complete. 

[INFO  uvicorn.error server:85 - serve() - 22.11.2022 03:05:38 PM]
	 Finished server process [20953] 

[INFO  uvicorn.error server:75 - serve() - 22.11.2022 03:06:19 PM]
	 Started server process [40245] 

[INFO  uvicorn.error on:47 - startup() - 22.11.2022 03:06:19 PM]
	 Waiting for application startup. 

[INFO  uvicorn.error on:61 - startup() - 22.11.2022 03:06:19 PM]
	 Application startup complete. 

[DEBUG  passlib.handlers.bcrypt bcrypt:625 - _load_backend_mixin() - 22.11.2022 03:06:32 PM]
	 detected 'bcrypt' backend, version '3.1.7' 

[DEBUG  passlib.handlers.bcrypt bcrypt:406 - _finalize_backend_mixin() - 22.11.2022 03:06:32 PM]
	 'bcrypt' backend lacks $2$ support, enabling workaround 

[INFO  app.users.controllers controllers:28 - register_user() - 22.11.2022 03:06:36 PM]
	 jap5@yopmail.com is registered as new user 

[INFO  uvicorn.error server:253 - shutdown() - 22.11.2022 03:07:59 PM]
	 Shutting down 

[INFO  uvicorn.error on:66 - shutdown() - 22.11.2022 03:07:59 PM]
	 Waiting for application shutdown. 

[INFO  uvicorn.error on:77 - shutdown() - 22.11.2022 03:07:59 PM]
	 Application shutdown complete. 

[INFO  uvicorn.error server:85 - serve() - 22.11.2022 03:07:59 PM]
	 Finished server process [40245] 

[INFO  uvicorn.error server:75 - serve() - 22.11.2022 03:11:10 PM]
	 Started server process [41321] 

[INFO  uvicorn.error on:47 - startup() - 22.11.2022 03:11:10 PM]
	 Waiting for application startup. 

[INFO  uvicorn.error on:61 - startup() - 22.11.2022 03:11:10 PM]
	 Application startup complete. 

[INFO  uvicorn.error server:253 - shutdown() - 22.11.2022 03:12:14 PM]
	 Shutting down 

[INFO  uvicorn.error on:66 - shutdown() - 22.11.2022 03:12:14 PM]
	 Waiting for application shutdown. 

[INFO  uvicorn.error on:77 - shutdown() - 22.11.2022 03:12:14 PM]
	 Application shutdown complete. 

[INFO  uvicorn.error server:85 - serve() - 22.11.2022 03:12:14 PM]
	 Finished server process [41321] 

[INFO  uvicorn.error server:75 - serve() - 22.11.2022 03:13:36 PM]
	 Started server process [41934] 

[INFO  uvicorn.error on:47 - startup() - 22.11.2022 03:13:36 PM]
	 Waiting for application startup. 

[INFO  uvicorn.error on:61 - startup() - 22.11.2022 03:13:36 PM]
	 Application startup complete. 

[INFO  uvicorn.error server:253 - shutdown() - 22.11.2022 03:13:42 PM]
	 Shutting down 

[INFO  uvicorn.error on:66 - shutdown() - 22.11.2022 03:13:43 PM]
	 Waiting for application shutdown. 

[INFO  uvicorn.error on:77 - shutdown() - 22.11.2022 03:13:43 PM]
	 Application shutdown complete. 

[INFO  uvicorn.error server:85 - serve() - 22.11.2022 03:13:43 PM]
	 Finished server process [41934] 

[INFO  uvicorn.error server:75 - serve() - 22.11.2022 03:13:44 PM]
	 Started server process [41968] 

[INFO  uvicorn.error on:47 - startup() - 22.11.2022 03:13:44 PM]
	 Waiting for application startup. 

[INFO  uvicorn.error on:61 - startup() - 22.11.2022 03:13:44 PM]
	 Application startup complete. 

[DEBUG  passlib.handlers.bcrypt bcrypt:625 - _load_backend_mixin() - 22.11.2022 03:16:21 PM]
	 detected 'bcrypt' backend, version '3.1.7' 

[DEBUG  passlib.handlers.bcrypt bcrypt:406 - _finalize_backend_mixin() - 22.11.2022 03:16:21 PM]
	 'bcrypt' backend lacks $2$ support, enabling workaround 

[INFO  app.users.controllers controllers:55 - verify_login() - 22.11.2022 03:16:21 PM]
	 jap4@yopmail.com is logged in the system 

[INFO  uvicorn.error server:253 - shutdown() - 22.11.2022 03:16:44 PM]
	 Shutting down 

[INFO  uvicorn.error on:66 - shutdown() - 22.11.2022 03:16:44 PM]
	 Waiting for application shutdown. 

[INFO  uvicorn.error on:77 - shutdown() - 22.11.2022 03:16:44 PM]
	 Application shutdown complete. 

[INFO  uvicorn.error server:85 - serve() - 22.11.2022 03:16:44 PM]
	 Finished server process [41968] 

[INFO  uvicorn.error server:75 - serve() - 22.11.2022 03:16:47 PM]
	 Started server process [42619] 

[INFO  uvicorn.error on:47 - startup() - 22.11.2022 03:16:47 PM]
	 Waiting for application startup. 

[INFO  uvicorn.error on:61 - startup() - 22.11.2022 03:16:47 PM]
	 Application startup complete. 

[INFO  uvicorn.error server:253 - shutdown() - 22.11.2022 03:17:11 PM]
	 Shutting down 

[INFO  uvicorn.error on:66 - shutdown() - 22.11.2022 03:17:11 PM]
	 Waiting for application shutdown. 

[INFO  uvicorn.error on:77 - shutdown() - 22.11.2022 03:17:11 PM]
	 Application shutdown complete. 

[INFO  uvicorn.error server:85 - serve() - 22.11.2022 03:17:11 PM]
	 Finished server process [42619] 

[INFO  uvicorn.error server:75 - serve() - 22.11.2022 03:17:12 PM]
	 Started server process [42706] 

[INFO  uvicorn.error on:47 - startup() - 22.11.2022 03:17:12 PM]
	 Waiting for application startup. 

[INFO  uvicorn.error on:61 - startup() - 22.11.2022 03:17:12 PM]
	 Application startup complete. 

[INFO  uvicorn.error server:253 - shutdown() - 22.11.2022 03:17:39 PM]
	 Shutting down 

[INFO  uvicorn.error on:66 - shutdown() - 22.11.2022 03:17:39 PM]
	 Waiting for application shutdown. 

[INFO  uvicorn.error on:77 - shutdown() - 22.11.2022 03:17:39 PM]
	 Application shutdown complete. 

[INFO  uvicorn.error server:85 - serve() - 22.11.2022 03:17:39 PM]
	 Finished server process [42706] 

[INFO  uvicorn.error server:75 - serve() - 22.11.2022 03:17:41 PM]
	 Started server process [42827] 

[INFO  uvicorn.error on:47 - startup() - 22.11.2022 03:17:41 PM]
	 Waiting for application startup. 

[INFO  uvicorn.error on:61 - startup() - 22.11.2022 03:17:41 PM]
	 Application startup complete. 

[DEBUG  passlib.handlers.bcrypt bcrypt:625 - _load_backend_mixin() - 22.11.2022 03:17:46 PM]
	 detected 'bcrypt' backend, version '3.1.7' 

[DEBUG  passlib.handlers.bcrypt bcrypt:406 - _finalize_backend_mixin() - 22.11.2022 03:17:46 PM]
	 'bcrypt' backend lacks $2$ support, enabling workaround 

[INFO  app.users.controllers controllers:55 - verify_login() - 22.11.2022 03:17:46 PM]
	 jap4@yopmail.com is logged in the system 

[INFO  app.users.controllers controllers:72 - get_user_profile() - 22.11.2022 03:17:56 PM]
	 jap4@yopmail.com has requested for profile view 

[INFO  uvicorn.error server:253 - shutdown() - 22.11.2022 03:18:28 PM]
	 Shutting down 

[INFO  uvicorn.error on:66 - shutdown() - 22.11.2022 03:18:28 PM]
	 Waiting for application shutdown. 

[INFO  uvicorn.error on:77 - shutdown() - 22.11.2022 03:18:28 PM]
	 Application shutdown complete. 

[INFO  uvicorn.error server:85 - serve() - 22.11.2022 03:18:28 PM]
	 Finished server process [42827] 

[INFO  uvicorn.error server:75 - serve() - 22.11.2022 03:18:29 PM]
	 Started server process [42971] 

[INFO  uvicorn.error on:47 - startup() - 22.11.2022 03:18:29 PM]
	 Waiting for application startup. 

[INFO  uvicorn.error on:61 - startup() - 22.11.2022 03:18:29 PM]
	 Application startup complete. 

[INFO  uvicorn.error server:253 - shutdown() - 22.11.2022 03:18:34 PM]
	 Shutting down 

[INFO  uvicorn.error on:66 - shutdown() - 22.11.2022 03:18:34 PM]
	 Waiting for application shutdown. 

[INFO  uvicorn.error on:77 - shutdown() - 22.11.2022 03:18:34 PM]
	 Application shutdown complete. 

[INFO  uvicorn.error server:85 - serve() - 22.11.2022 03:18:34 PM]
	 Finished server process [42971] 

[INFO  uvicorn.error server:75 - serve() - 22.11.2022 03:18:35 PM]
	 Started server process [43036] 

[INFO  uvicorn.error on:47 - startup() - 22.11.2022 03:18:35 PM]
	 Waiting for application startup. 

[INFO  uvicorn.error on:61 - startup() - 22.11.2022 03:18:35 PM]
	 Application startup complete. 

[INFO  app.users.controllers controllers:72 - get_user_profile() - 22.11.2022 03:18:42 PM]
	 jap4@yopmail.com has requested for profile view 

[INFO  uvicorn.error server:253 - shutdown() - 22.11.2022 03:18:56 PM]
	 Shutting down 

[INFO  uvicorn.error on:66 - shutdown() - 22.11.2022 03:18:56 PM]
	 Waiting for application shutdown. 

[INFO  uvicorn.error on:77 - shutdown() - 22.11.2022 03:18:56 PM]
	 Application shutdown complete. 

[INFO  uvicorn.error server:85 - serve() - 22.11.2022 03:18:56 PM]
	 Finished server process [43036] 

[INFO  uvicorn.error server:75 - serve() - 22.11.2022 03:18:58 PM]
	 Started server process [43119] 

[INFO  uvicorn.error on:47 - startup() - 22.11.2022 03:18:58 PM]
	 Waiting for application startup. 

[INFO  uvicorn.error on:61 - startup() - 22.11.2022 03:18:58 PM]
	 Application startup complete. 

[INFO  uvicorn.error server:253 - shutdown() - 22.11.2022 03:19:00 PM]
	 Shutting down 

[INFO  uvicorn.error on:66 - shutdown() - 22.11.2022 03:19:00 PM]
	 Waiting for application shutdown. 

[INFO  uvicorn.error on:77 - shutdown() - 22.11.2022 03:19:00 PM]
	 Application shutdown complete. 

[INFO  uvicorn.error server:85 - serve() - 22.11.2022 03:19:00 PM]
	 Finished server process [43119] 

[INFO  uvicorn.error server:75 - serve() - 22.11.2022 03:19:01 PM]
	 Started server process [43153] 

[INFO  uvicorn.error on:47 - startup() - 22.11.2022 03:19:01 PM]
	 Waiting for application startup. 

[INFO  uvicorn.error on:61 - startup() - 22.11.2022 03:19:01 PM]
	 Application startup complete. 

[INFO  uvicorn.error server:253 - shutdown() - 22.11.2022 03:21:31 PM]
	 Shutting down 

[INFO  uvicorn.error on:66 - shutdown() - 22.11.2022 03:21:31 PM]
	 Waiting for application shutdown. 

[INFO  uvicorn.error on:77 - shutdown() - 22.11.2022 03:21:31 PM]
	 Application shutdown complete. 

[INFO  uvicorn.error server:85 - serve() - 22.11.2022 03:21:31 PM]
	 Finished server process [43153] 

[INFO  uvicorn.error server:75 - serve() - 22.11.2022 03:22:10 PM]
	 Started server process [43509] 

[INFO  uvicorn.error on:47 - startup() - 22.11.2022 03:22:10 PM]
	 Waiting for application startup. 

[INFO  uvicorn.error on:61 - startup() - 22.11.2022 03:22:10 PM]
	 Application startup complete. 

[INFO  uvicorn.error server:253 - shutdown() - 22.11.2022 03:22:12 PM]
	 Shutting down 

[INFO  uvicorn.error on:66 - shutdown() - 22.11.2022 03:22:13 PM]
	 Waiting for application shutdown. 

[INFO  uvicorn.error on:77 - shutdown() - 22.11.2022 03:22:13 PM]
	 Application shutdown complete. 

[INFO  uvicorn.error server:85 - serve() - 22.11.2022 03:22:13 PM]
	 Finished server process [43509] 

[INFO  uvicorn.error server:75 - serve() - 22.11.2022 03:22:14 PM]
	 Started server process [43538] 

[INFO  uvicorn.error on:47 - startup() - 22.11.2022 03:22:14 PM]
	 Waiting for application startup. 

[INFO  uvicorn.error on:61 - startup() - 22.11.2022 03:22:14 PM]
	 Application startup complete. 

[INFO  uvicorn.error server:253 - shutdown() - 22.11.2022 03:22:19 PM]
	 Shutting down 

[INFO  uvicorn.error on:66 - shutdown() - 22.11.2022 03:22:19 PM]
	 Waiting for application shutdown. 

[INFO  uvicorn.error on:77 - shutdown() - 22.11.2022 03:22:19 PM]
	 Application shutdown complete. 

[INFO  uvicorn.error server:85 - serve() - 22.11.2022 03:22:19 PM]
	 Finished server process [43538] 

[INFO  uvicorn.error server:75 - serve() - 22.11.2022 03:22:33 PM]
	 Started server process [43627] 

[INFO  uvicorn.error on:47 - startup() - 22.11.2022 03:22:33 PM]
	 Waiting for application startup. 

[INFO  uvicorn.error on:61 - startup() - 22.11.2022 03:22:33 PM]
	 Application startup complete. 

[DEBUG  passlib.handlers.bcrypt bcrypt:625 - _load_backend_mixin() - 22.11.2022 03:22:42 PM]
	 detected 'bcrypt' backend, version '3.1.7' 

[DEBUG  passlib.handlers.bcrypt bcrypt:406 - _finalize_backend_mixin() - 22.11.2022 03:22:42 PM]
	 'bcrypt' backend lacks $2$ support, enabling workaround 

[INFO  app.users.controllers controllers:55 - verify_login() - 22.11.2022 03:22:43 PM]
	 jap4@yopmail.com is logged in the system 

[INFO  app.users.controllers controllers:76 - get_user_profile() - 22.11.2022 03:23:12 PM]
	 jap4@yopmail.com has requested for profile view 

[ERROR  uvicorn.error httptools_impl:409 - run_asgi() - 22.11.2022 03:23:12 PM]
	 Exception in ASGI application
 
Traceback (most recent call last):
  File "/home/jap/.local/lib/python3.8/site-packages/uvicorn/protocols/http/httptools_impl.py", line 404, in run_asgi
    result = await app(  # type: ignore[func-returns-value]
  File "/home/jap/.local/lib/python3.8/site-packages/uvicorn/middleware/proxy_headers.py", line 78, in __call__
    return await self.app(scope, receive, send)
  File "/home/jap/.local/lib/python3.8/site-packages/fastapi/applications.py", line 269, in __call__
    await super().__call__(scope, receive, send)
  File "/home/jap/.local/lib/python3.8/site-packages/starlette/applications.py", line 124, in __call__
    await self.middleware_stack(scope, receive, send)
  File "/home/jap/.local/lib/python3.8/site-packages/starlette/middleware/errors.py", line 184, in __call__
    raise exc
  File "/home/jap/.local/lib/python3.8/site-packages/starlette/middleware/errors.py", line 162, in __call__
    await self.app(scope, receive, _send)
  File "/home/jap/.local/lib/python3.8/site-packages/starlette/middleware/cors.py", line 84, in __call__
    await self.app(scope, receive, send)
  File "/home/jap/.local/lib/python3.8/site-packages/starlette/exceptions.py", line 93, in __call__
    raise exc
  File "/home/jap/.local/lib/python3.8/site-packages/starlette/exceptions.py", line 82, in __call__
    await self.app(scope, receive, sender)
  File "/home/jap/.local/lib/python3.8/site-packages/fastapi/middleware/asyncexitstack.py", line 21, in __call__
    raise e
  File "/home/jap/.local/lib/python3.8/site-packages/fastapi/middleware/asyncexitstack.py", line 18, in __call__
    await self.app(scope, receive, send)
  File "/home/jap/.local/lib/python3.8/site-packages/starlette/routing.py", line 670, in __call__
    await route.handle(scope, receive, send)
  File "/home/jap/.local/lib/python3.8/site-packages/starlette/routing.py", line 266, in handle
    await self.app(scope, receive, send)
  File "/home/jap/.local/lib/python3.8/site-packages/starlette/routing.py", line 65, in app
    response = await func(request)
  File "/home/jap/.local/lib/python3.8/site-packages/fastapi/routing.py", line 231, in app
    raw_response = await run_endpoint_function(
  File "/home/jap/.local/lib/python3.8/site-packages/fastapi/routing.py", line 160, in run_endpoint_function
    return await dependant.call(**values)
  File "/home/jap/Python Tasks/FastAPi Demo 1/./app/users/controllers.py", line 77, in get_user_profile
    return JSONResponse(status_code=status.HTTP_200_OK,content=response)
  File "/home/jap/.local/lib/python3.8/site-packages/starlette/responses.py", line 187, in __init__
    super().__init__(content, status_code, headers, media_type, background)
  File "/home/jap/.local/lib/python3.8/site-packages/starlette/responses.py", line 49, in __init__
    self.body = self.render(content)
  File "/home/jap/.local/lib/python3.8/site-packages/starlette/responses.py", line 190, in render
    return json.dumps(
  File "/usr/lib/python3.8/json/__init__.py", line 234, in dumps
    return cls(
  File "/usr/lib/python3.8/json/encoder.py", line 199, in encode
    chunks = self.iterencode(o, _one_shot=True)
  File "/usr/lib/python3.8/json/encoder.py", line 257, in iterencode
    return _iterencode(o, 0)
  File "/usr/lib/python3.8/json/encoder.py", line 179, in default
    raise TypeError(f'Object of type {o.__class__.__name__} '
TypeError: Object of type coroutine is not JSON serializable
[INFO  uvicorn.error server:253 - shutdown() - 22.11.2022 03:23:55 PM]
	 Shutting down 

[INFO  uvicorn.error on:66 - shutdown() - 22.11.2022 03:23:55 PM]
	 Waiting for application shutdown. 

[INFO  uvicorn.error on:77 - shutdown() - 22.11.2022 03:23:55 PM]
	 Application shutdown complete. 

[INFO  uvicorn.error server:85 - serve() - 22.11.2022 03:23:55 PM]
	 Finished server process [43627] 

[INFO  uvicorn.error server:75 - serve() - 22.11.2022 03:23:56 PM]
	 Started server process [43910] 

[INFO  uvicorn.error on:47 - startup() - 22.11.2022 03:23:56 PM]
	 Waiting for application startup. 

[INFO  uvicorn.error on:61 - startup() - 22.11.2022 03:23:56 PM]
	 Application startup complete. 

[INFO  uvicorn.error server:253 - shutdown() - 22.11.2022 03:24:21 PM]
	 Shutting down 

[INFO  uvicorn.error on:66 - shutdown() - 22.11.2022 03:24:21 PM]
	 Waiting for application shutdown. 

[INFO  uvicorn.error on:77 - shutdown() - 22.11.2022 03:24:21 PM]
	 Application shutdown complete. 

[INFO  uvicorn.error server:85 - serve() - 22.11.2022 03:24:21 PM]
	 Finished server process [43910] 

[INFO  uvicorn.error server:75 - serve() - 22.11.2022 03:24:22 PM]
	 Started server process [43995] 

[INFO  uvicorn.error on:47 - startup() - 22.11.2022 03:24:22 PM]
	 Waiting for application startup. 

[INFO  uvicorn.error on:61 - startup() - 22.11.2022 03:24:22 PM]
	 Application startup complete. 

[DEBUG  passlib.handlers.bcrypt bcrypt:625 - _load_backend_mixin() - 22.11.2022 03:24:24 PM]
	 detected 'bcrypt' backend, version '3.1.7' 

[DEBUG  passlib.handlers.bcrypt bcrypt:406 - _finalize_backend_mixin() - 22.11.2022 03:24:24 PM]
	 'bcrypt' backend lacks $2$ support, enabling workaround 

[INFO  app.users.controllers controllers:55 - verify_login() - 22.11.2022 03:24:25 PM]
	 jap4@yopmail.com is logged in the system 

[INFO  app.users.controllers controllers:76 - get_user_profile() - 22.11.2022 03:24:36 PM]
	 jap4@yopmail.com has requested for profile view 

[INFO  uvicorn.error server:253 - shutdown() - 22.11.2022 03:24:49 PM]
	 Shutting down 

[INFO  uvicorn.error on:66 - shutdown() - 22.11.2022 03:24:49 PM]
	 Waiting for application shutdown. 

[INFO  uvicorn.error on:77 - shutdown() - 22.11.2022 03:24:49 PM]
	 Application shutdown complete. 

[INFO  uvicorn.error server:85 - serve() - 22.11.2022 03:24:49 PM]
	 Finished server process [43995] 

[INFO  uvicorn.error server:75 - serve() - 22.11.2022 03:24:50 PM]
	 Started server process [44136] 

[INFO  uvicorn.error on:47 - startup() - 22.11.2022 03:24:50 PM]
	 Waiting for application startup. 

[INFO  uvicorn.error on:61 - startup() - 22.11.2022 03:24:50 PM]
	 Application startup complete. 

[INFO  uvicorn.error server:253 - shutdown() - 22.11.2022 03:24:55 PM]
	 Shutting down 

[INFO  uvicorn.error on:66 - shutdown() - 22.11.2022 03:24:55 PM]
	 Waiting for application shutdown. 

[INFO  uvicorn.error on:77 - shutdown() - 22.11.2022 03:24:55 PM]
	 Application shutdown complete. 

[INFO  uvicorn.error server:85 - serve() - 22.11.2022 03:24:55 PM]
	 Finished server process [44136] 

[INFO  uvicorn.error server:75 - serve() - 22.11.2022 03:24:56 PM]
	 Started server process [44179] 

[INFO  uvicorn.error on:47 - startup() - 22.11.2022 03:24:56 PM]
	 Waiting for application startup. 

[INFO  uvicorn.error on:61 - startup() - 22.11.2022 03:24:56 PM]
	 Application startup complete. 

[INFO  uvicorn.error server:253 - shutdown() - 22.11.2022 03:24:58 PM]
	 Shutting down 

[INFO  uvicorn.error on:66 - shutdown() - 22.11.2022 03:24:58 PM]
	 Waiting for application shutdown. 

[INFO  uvicorn.error on:77 - shutdown() - 22.11.2022 03:24:58 PM]
	 Application shutdown complete. 

[INFO  uvicorn.error server:85 - serve() - 22.11.2022 03:24:58 PM]
	 Finished server process [44179] 

[INFO  uvicorn.error server:75 - serve() - 22.11.2022 03:24:59 PM]
	 Started server process [44194] 

[INFO  uvicorn.error on:47 - startup() - 22.11.2022 03:24:59 PM]
	 Waiting for application startup. 

[INFO  uvicorn.error on:61 - startup() - 22.11.2022 03:24:59 PM]
	 Application startup complete. 

[INFO  app.users.controllers controllers:78 - get_user_profile() - 22.11.2022 03:25:02 PM]
	 jap4@yopmail.com has requested for profile view 

[INFO  app.users.controllers controllers:78 - get_user_profile() - 22.11.2022 03:25:05 PM]
	 jap4@yopmail.com has requested for profile view 

[ERROR  uvicorn.error httptools_impl:409 - run_asgi() - 22.11.2022 03:25:05 PM]
	 Exception in ASGI application
 
Traceback (most recent call last):
  File "/home/jap/.local/lib/python3.8/site-packages/uvicorn/protocols/http/httptools_impl.py", line 404, in run_asgi
    result = await app(  # type: ignore[func-returns-value]
  File "/home/jap/.local/lib/python3.8/site-packages/uvicorn/middleware/proxy_headers.py", line 78, in __call__
    return await self.app(scope, receive, send)
  File "/home/jap/.local/lib/python3.8/site-packages/fastapi/applications.py", line 269, in __call__
    await super().__call__(scope, receive, send)
  File "/home/jap/.local/lib/python3.8/site-packages/starlette/applications.py", line 124, in __call__
    await self.middleware_stack(scope, receive, send)
  File "/home/jap/.local/lib/python3.8/site-packages/starlette/middleware/errors.py", line 184, in __call__
    raise exc
  File "/home/jap/.local/lib/python3.8/site-packages/starlette/middleware/errors.py", line 162, in __call__
    await self.app(scope, receive, _send)
  File "/home/jap/.local/lib/python3.8/site-packages/starlette/middleware/cors.py", line 84, in __call__
    await self.app(scope, receive, send)
  File "/home/jap/.local/lib/python3.8/site-packages/starlette/exceptions.py", line 93, in __call__
    raise exc
  File "/home/jap/.local/lib/python3.8/site-packages/starlette/exceptions.py", line 82, in __call__
    await self.app(scope, receive, sender)
  File "/home/jap/.local/lib/python3.8/site-packages/fastapi/middleware/asyncexitstack.py", line 21, in __call__
    raise e
  File "/home/jap/.local/lib/python3.8/site-packages/fastapi/middleware/asyncexitstack.py", line 18, in __call__
    await self.app(scope, receive, send)
  File "/home/jap/.local/lib/python3.8/site-packages/starlette/routing.py", line 670, in __call__
    await route.handle(scope, receive, send)
  File "/home/jap/.local/lib/python3.8/site-packages/starlette/routing.py", line 266, in handle
    await self.app(scope, receive, send)
  File "/home/jap/.local/lib/python3.8/site-packages/starlette/routing.py", line 65, in app
    response = await func(request)
  File "/home/jap/.local/lib/python3.8/site-packages/fastapi/routing.py", line 231, in app
    raw_response = await run_endpoint_function(
  File "/home/jap/.local/lib/python3.8/site-packages/fastapi/routing.py", line 160, in run_endpoint_function
    return await dependant.call(**values)
  File "/home/jap/Python Tasks/FastAPi Demo 1/./app/users/controllers.py", line 79, in get_user_profile
    return JSONResponse(status_code=status.HTTP_200_OK,content=response)
  File "/home/jap/.local/lib/python3.8/site-packages/starlette/responses.py", line 187, in __init__
    super().__init__(content, status_code, headers, media_type, background)
  File "/home/jap/.local/lib/python3.8/site-packages/starlette/responses.py", line 49, in __init__
    self.body = self.render(content)
  File "/home/jap/.local/lib/python3.8/site-packages/starlette/responses.py", line 190, in render
    return json.dumps(
  File "/usr/lib/python3.8/json/__init__.py", line 234, in dumps
    return cls(
  File "/usr/lib/python3.8/json/encoder.py", line 199, in encode
    chunks = self.iterencode(o, _one_shot=True)
  File "/usr/lib/python3.8/json/encoder.py", line 257, in iterencode
    return _iterencode(o, 0)
  File "/usr/lib/python3.8/json/encoder.py", line 179, in default
    raise TypeError(f'Object of type {o.__class__.__name__} '
TypeError: Object of type coroutine is not JSON serializable
[INFO  uvicorn.error server:253 - shutdown() - 22.11.2022 03:25:30 PM]
	 Shutting down 

[INFO  uvicorn.error on:66 - shutdown() - 22.11.2022 03:25:30 PM]
	 Waiting for application shutdown. 

[INFO  uvicorn.error on:77 - shutdown() - 22.11.2022 03:25:30 PM]
	 Application shutdown complete. 

[INFO  uvicorn.error server:85 - serve() - 22.11.2022 03:25:30 PM]
	 Finished server process [44194] 

[INFO  uvicorn.error server:75 - serve() - 22.11.2022 03:25:31 PM]
	 Started server process [44293] 

[INFO  uvicorn.error on:47 - startup() - 22.11.2022 03:25:31 PM]
	 Waiting for application startup. 

[INFO  uvicorn.error on:61 - startup() - 22.11.2022 03:25:31 PM]
	 Application startup complete. 

[INFO  app.users.controllers controllers:78 - get_user_profile() - 22.11.2022 03:25:33 PM]
	 jap4@yopmail.com has requested for profile view 

[INFO  app.users.controllers controllers:78 - get_user_profile() - 22.11.2022 03:25:38 PM]
	 jap4@yopmail.com has requested for profile view 

[INFO  app.users.controllers controllers:78 - get_user_profile() - 22.11.2022 03:25:42 PM]
	 jap4@yopmail.com has requested for profile view 

[INFO  app.users.controllers controllers:78 - get_user_profile() - 22.11.2022 03:25:44 PM]
	 jap4@yopmail.com has requested for profile view 

[INFO  uvicorn.error server:253 - shutdown() - 22.11.2022 03:43:32 PM]
	 Shutting down 

[INFO  uvicorn.error on:66 - shutdown() - 22.11.2022 03:43:32 PM]
	 Waiting for application shutdown. 

[INFO  uvicorn.error on:77 - shutdown() - 22.11.2022 03:43:32 PM]
	 Application shutdown complete. 

[INFO  uvicorn.error server:85 - serve() - 22.11.2022 03:43:32 PM]
	 Finished server process [44293] 

[INFO  uvicorn.error server:75 - serve() - 22.11.2022 03:43:35 PM]
	 Started server process [45753] 

[INFO  uvicorn.error on:47 - startup() - 22.11.2022 03:43:35 PM]
	 Waiting for application startup. 

[INFO  uvicorn.error on:61 - startup() - 22.11.2022 03:43:35 PM]
	 Application startup complete. 

[DEBUG  passlib.handlers.bcrypt bcrypt:625 - _load_backend_mixin() - 22.11.2022 03:43:47 PM]
	 detected 'bcrypt' backend, version '3.1.7' 

[DEBUG  passlib.handlers.bcrypt bcrypt:406 - _finalize_backend_mixin() - 22.11.2022 03:43:47 PM]
	 'bcrypt' backend lacks $2$ support, enabling workaround 

[INFO  app.users.controllers controllers:29 - register_user() - 22.11.2022 03:43:55 PM]
	 jap6@yopmail.com is registered as new user 

[INFO  uvicorn.error server:253 - shutdown() - 22.11.2022 03:44:27 PM]
	 Shutting down 

[INFO  uvicorn.error on:66 - shutdown() - 22.11.2022 03:44:28 PM]
	 Waiting for application shutdown. 

[INFO  uvicorn.error on:77 - shutdown() - 22.11.2022 03:44:28 PM]
	 Application shutdown complete. 

[INFO  uvicorn.error server:85 - serve() - 22.11.2022 03:44:28 PM]
	 Finished server process [45753] 

[INFO  uvicorn.error server:75 - serve() - 22.11.2022 03:44:29 PM]
	 Started server process [45913] 

[INFO  uvicorn.error on:47 - startup() - 22.11.2022 03:44:29 PM]
	 Waiting for application startup. 

[INFO  uvicorn.error on:61 - startup() - 22.11.2022 03:44:29 PM]
	 Application startup complete. 

[INFO  uvicorn.error server:253 - shutdown() - 22.11.2022 03:44:32 PM]
	 Shutting down 

[INFO  uvicorn.error on:66 - shutdown() - 22.11.2022 03:44:32 PM]
	 Waiting for application shutdown. 

[INFO  uvicorn.error on:77 - shutdown() - 22.11.2022 03:44:32 PM]
	 Application shutdown complete. 

[INFO  uvicorn.error server:85 - serve() - 22.11.2022 03:44:32 PM]
	 Finished server process [45913] 

[INFO  uvicorn.error server:75 - serve() - 22.11.2022 03:44:33 PM]
	 Started server process [45943] 

[INFO  uvicorn.error on:47 - startup() - 22.11.2022 03:44:33 PM]
	 Waiting for application startup. 

[INFO  uvicorn.error on:61 - startup() - 22.11.2022 03:44:33 PM]
	 Application startup complete. 

[INFO  uvicorn.error server:253 - shutdown() - 22.11.2022 03:56:25 PM]
	 Shutting down 

[INFO  uvicorn.error on:66 - shutdown() - 22.11.2022 03:56:25 PM]
	 Waiting for application shutdown. 

[INFO  uvicorn.error on:77 - shutdown() - 22.11.2022 03:56:25 PM]
	 Application shutdown complete. 

[INFO  uvicorn.error server:85 - serve() - 22.11.2022 03:56:25 PM]
	 Finished server process [45943] 

[INFO  uvicorn.error server:75 - serve() - 22.11.2022 05:50:32 PM]
	 Started server process [74198] 

[INFO  uvicorn.error on:47 - startup() - 22.11.2022 05:50:32 PM]
	 Waiting for application startup. 

[INFO  uvicorn.error on:61 - startup() - 22.11.2022 05:50:32 PM]
	 Application startup complete. 

[INFO  uvicorn.error server:253 - shutdown() - 22.11.2022 05:50:34 PM]
	 Shutting down 

[INFO  uvicorn.error on:66 - shutdown() - 22.11.2022 05:50:34 PM]
	 Waiting for application shutdown. 

[INFO  uvicorn.error on:77 - shutdown() - 22.11.2022 05:50:34 PM]
	 Application shutdown complete. 

[INFO  uvicorn.error server:85 - serve() - 22.11.2022 05:50:34 PM]
	 Finished server process [74198] 

[INFO  uvicorn.error server:75 - serve() - 22.11.2022 06:27:35 PM]
	 Started server process [79677] 

[INFO  uvicorn.error on:47 - startup() - 22.11.2022 06:27:35 PM]
	 Waiting for application startup. 

[INFO  uvicorn.error on:61 - startup() - 22.11.2022 06:27:35 PM]
	 Application startup complete. 

[DEBUG  passlib.handlers.bcrypt bcrypt:625 - _load_backend_mixin() - 22.11.2022 06:28:14 PM]
	 detected 'bcrypt' backend, version '3.1.7' 

[DEBUG  passlib.handlers.bcrypt bcrypt:406 - _finalize_backend_mixin() - 22.11.2022 06:28:14 PM]
	 'bcrypt' backend lacks $2$ support, enabling workaround 

[INFO  app.users.controllers controllers:29 - register_user() - 22.11.2022 06:30:54 PM]
	 japdave@yopmail.com is registered as new user 

[INFO  app.users.controllers controllers:55 - verify_login() - 22.11.2022 06:32:19 PM]
	 japdave@yopmail.com is logged in the system 

[INFO  app.users.controllers controllers:55 - verify_login() - 22.11.2022 06:32:34 PM]
	 japdave@yopmail.com is logged in the system 

[INFO  uvicorn.error server:253 - shutdown() - 22.11.2022 06:49:28 PM]
	 Shutting down 

[INFO  uvicorn.error on:66 - shutdown() - 22.11.2022 06:49:28 PM]
	 Waiting for application shutdown. 

[INFO  uvicorn.error on:77 - shutdown() - 22.11.2022 06:49:28 PM]
	 Application shutdown complete. 

[INFO  uvicorn.error server:85 - serve() - 22.11.2022 06:49:28 PM]
	 Finished server process [79677] 

[INFO  uvicorn.error server:75 - serve() - 23.11.2022 10:42:59 AM]
	 Started server process [97465] 

[INFO  uvicorn.error on:47 - startup() - 23.11.2022 10:42:59 AM]
	 Waiting for application startup. 

[INFO  uvicorn.error on:61 - startup() - 23.11.2022 10:42:59 AM]
	 Application startup complete. 

[INFO  uvicorn.error server:253 - shutdown() - 23.11.2022 10:44:22 AM]
	 Shutting down 

[INFO  uvicorn.error on:66 - shutdown() - 23.11.2022 10:44:22 AM]
	 Waiting for application shutdown. 

[INFO  uvicorn.error on:77 - shutdown() - 23.11.2022 10:44:22 AM]
	 Application shutdown complete. 

[INFO  uvicorn.error server:85 - serve() - 23.11.2022 10:44:22 AM]
	 Finished server process [97465] 

[INFO  uvicorn.error server:75 - serve() - 23.11.2022 10:44:23 AM]
	 Started server process [97735] 

[INFO  uvicorn.error on:47 - startup() - 23.11.2022 10:44:23 AM]
	 Waiting for application startup. 

[INFO  uvicorn.error on:61 - startup() - 23.11.2022 10:44:23 AM]
	 Application startup complete. 

[INFO  uvicorn.error server:253 - shutdown() - 23.11.2022 10:49:13 AM]
	 Shutting down 

[INFO  uvicorn.error on:66 - shutdown() - 23.11.2022 10:49:13 AM]
	 Waiting for application shutdown. 

[INFO  uvicorn.error on:77 - shutdown() - 23.11.2022 10:49:13 AM]
	 Application shutdown complete. 

[INFO  uvicorn.error server:85 - serve() - 23.11.2022 10:49:13 AM]
	 Finished server process [97735] 

[INFO  uvicorn.error server:75 - serve() - 23.11.2022 10:49:15 AM]
	 Started server process [98771] 

[INFO  uvicorn.error on:47 - startup() - 23.11.2022 10:49:15 AM]
	 Waiting for application startup. 

[INFO  uvicorn.error on:61 - startup() - 23.11.2022 10:49:15 AM]
	 Application startup complete. 

[INFO  uvicorn.error server:253 - shutdown() - 23.11.2022 10:49:20 AM]
	 Shutting down 

[INFO  uvicorn.error on:66 - shutdown() - 23.11.2022 10:49:20 AM]
	 Waiting for application shutdown. 

[INFO  uvicorn.error on:77 - shutdown() - 23.11.2022 10:49:20 AM]
	 Application shutdown complete. 

[INFO  uvicorn.error server:85 - serve() - 23.11.2022 10:49:20 AM]
	 Finished server process [98771] 

[INFO  uvicorn.error server:75 - serve() - 23.11.2022 10:49:21 AM]
	 Started server process [98826] 

[INFO  uvicorn.error on:47 - startup() - 23.11.2022 10:49:21 AM]
	 Waiting for application startup. 

[INFO  uvicorn.error on:61 - startup() - 23.11.2022 10:49:21 AM]
	 Application startup complete. 

[INFO  uvicorn.error server:253 - shutdown() - 23.11.2022 10:49:28 AM]
	 Shutting down 

[INFO  uvicorn.error on:66 - shutdown() - 23.11.2022 10:49:28 AM]
	 Waiting for application shutdown. 

[INFO  uvicorn.error on:77 - shutdown() - 23.11.2022 10:49:28 AM]
	 Application shutdown complete. 

[INFO  uvicorn.error server:85 - serve() - 23.11.2022 10:49:28 AM]
	 Finished server process [98826] 

[INFO  uvicorn.error server:75 - serve() - 23.11.2022 10:49:29 AM]
	 Started server process [98880] 

[INFO  uvicorn.error on:47 - startup() - 23.11.2022 10:49:29 AM]
	 Waiting for application startup. 

[INFO  uvicorn.error on:61 - startup() - 23.11.2022 10:49:29 AM]
	 Application startup complete. 

[ERROR  uvicorn.error config:481 - load() - 23.11.2022 11:24:49 AM]
	 Error loading ASGI app. Could not import module "app.main". 

[ERROR  uvicorn.error config:481 - load() - 23.11.2022 11:25:16 AM]
	 Error loading ASGI app. Could not import module "app.main". 

[ERROR  uvicorn.error config:481 - load() - 23.11.2022 11:25:22 AM]
	 Error loading ASGI app. Could not import module "app.main". 

[INFO  uvicorn.error server:75 - serve() - 23.11.2022 11:25:40 AM]
	 Started server process [106211] 

[INFO  uvicorn.error on:47 - startup() - 23.11.2022 11:25:40 AM]
	 Waiting for application startup. 

[INFO  uvicorn.error on:61 - startup() - 23.11.2022 11:25:40 AM]
	 Application startup complete. 

[INFO  uvicorn.error server:253 - shutdown() - 23.11.2022 11:25:43 AM]
	 Shutting down 

[INFO  uvicorn.error on:66 - shutdown() - 23.11.2022 11:25:43 AM]
	 Waiting for application shutdown. 

[INFO  uvicorn.error on:77 - shutdown() - 23.11.2022 11:25:43 AM]
	 Application shutdown complete. 

[INFO  uvicorn.error server:85 - serve() - 23.11.2022 11:25:43 AM]
	 Finished server process [106211] 

[INFO  uvicorn.error server:75 - serve() - 23.11.2022 11:25:44 AM]
	 Started server process [106262] 

[INFO  uvicorn.error on:47 - startup() - 23.11.2022 11:25:44 AM]
	 Waiting for application startup. 

[INFO  uvicorn.error on:61 - startup() - 23.11.2022 11:25:44 AM]
	 Application startup complete. 

[INFO  uvicorn.error server:253 - shutdown() - 23.11.2022 11:25:45 AM]
	 Shutting down 

[INFO  uvicorn.error on:66 - shutdown() - 23.11.2022 11:25:45 AM]
	 Waiting for application shutdown. 

[INFO  uvicorn.error on:77 - shutdown() - 23.11.2022 11:25:45 AM]
	 Application shutdown complete. 

[INFO  uvicorn.error server:85 - serve() - 23.11.2022 11:25:45 AM]
	 Finished server process [106262] 

[INFO  uvicorn.error server:75 - serve() - 23.11.2022 11:25:49 AM]
	 Started server process [106322] 

[INFO  uvicorn.error on:47 - startup() - 23.11.2022 11:25:49 AM]
	 Waiting for application startup. 

[INFO  uvicorn.error on:61 - startup() - 23.11.2022 11:25:49 AM]
	 Application startup complete. 

[DEBUG  passlib.handlers.bcrypt bcrypt:625 - _load_backend_mixin() - 23.11.2022 11:27:14 AM]
	 detected 'bcrypt' backend, version '3.1.7' 

[DEBUG  passlib.handlers.bcrypt bcrypt:406 - _finalize_backend_mixin() - 23.11.2022 11:27:14 AM]
	 'bcrypt' backend lacks $2$ support, enabling workaround 

[INFO  app.users.controllers controllers:30 - register_user() - 23.11.2022 11:30:11 AM]
	 jap56@yopmail.com is registered as new user 

[INFO  app.users.controllers controllers:56 - verify_login() - 23.11.2022 11:32:32 AM]
	 jap56@yopmail.com is logged in the system 

[INFO  app.users.controllers controllers:79 - trigger_emails() - 23.11.2022 11:32:47 AM]
	 jap56@yopmail.com has requested for profile view 

[INFO  uvicorn.error server:253 - shutdown() - 23.11.2022 11:33:23 AM]
	 Shutting down 

[INFO  uvicorn.error on:66 - shutdown() - 23.11.2022 11:33:23 AM]
	 Waiting for application shutdown. 

[INFO  uvicorn.error on:77 - shutdown() - 23.11.2022 11:33:23 AM]
	 Application shutdown complete. 

[INFO  uvicorn.error server:85 - serve() - 23.11.2022 11:33:23 AM]
	 Finished server process [106322] 

[INFO  uvicorn.error server:75 - serve() - 23.11.2022 11:33:25 AM]
	 Started server process [107574] 

[INFO  uvicorn.error on:47 - startup() - 23.11.2022 11:33:25 AM]
	 Waiting for application startup. 

[INFO  uvicorn.error on:61 - startup() - 23.11.2022 11:33:25 AM]
	 Application startup complete. 

[INFO  uvicorn.error server:253 - shutdown() - 23.11.2022 11:33:26 AM]
	 Shutting down 

[INFO  uvicorn.error on:66 - shutdown() - 23.11.2022 11:33:26 AM]
	 Waiting for application shutdown. 

[INFO  uvicorn.error on:77 - shutdown() - 23.11.2022 11:33:26 AM]
	 Application shutdown complete. 

[INFO  uvicorn.error server:85 - serve() - 23.11.2022 11:33:26 AM]
	 Finished server process [107574] 

[INFO  uvicorn.error server:75 - serve() - 23.11.2022 11:33:27 AM]
	 Started server process [107659] 

[INFO  uvicorn.error on:47 - startup() - 23.11.2022 11:33:27 AM]
	 Waiting for application startup. 

[INFO  uvicorn.error on:61 - startup() - 23.11.2022 11:33:27 AM]
	 Application startup complete. 

[INFO  uvicorn.error server:253 - shutdown() - 23.11.2022 11:33:29 AM]
	 Shutting down 

[INFO  uvicorn.error on:66 - shutdown() - 23.11.2022 11:33:29 AM]
	 Waiting for application shutdown. 

[INFO  uvicorn.error on:77 - shutdown() - 23.11.2022 11:33:29 AM]
	 Application shutdown complete. 

[INFO  uvicorn.error server:85 - serve() - 23.11.2022 11:33:29 AM]
	 Finished server process [107659] 

[INFO  uvicorn.error server:75 - serve() - 23.11.2022 11:33:30 AM]
	 Started server process [107683] 

[INFO  uvicorn.error on:47 - startup() - 23.11.2022 11:33:30 AM]
	 Waiting for application startup. 

[INFO  uvicorn.error on:61 - startup() - 23.11.2022 11:33:30 AM]
	 Application startup complete. 

[INFO  app.users.controllers controllers:79 - trigger_emails() - 23.11.2022 11:33:34 AM]
	 jap56@yopmail.com has requested for profile view 

[INFO  uvicorn.error server:253 - shutdown() - 23.11.2022 11:33:51 AM]
	 Shutting down 

[INFO  uvicorn.error on:66 - shutdown() - 23.11.2022 11:33:51 AM]
	 Waiting for application shutdown. 

[INFO  uvicorn.error on:77 - shutdown() - 23.11.2022 11:33:51 AM]
	 Application shutdown complete. 

[INFO  uvicorn.error server:85 - serve() - 23.11.2022 11:33:51 AM]
	 Finished server process [107683] 

[INFO  uvicorn.error server:75 - serve() - 23.11.2022 11:33:52 AM]
	 Started server process [107809] 

[INFO  uvicorn.error on:47 - startup() - 23.11.2022 11:33:52 AM]
	 Waiting for application startup. 

[INFO  uvicorn.error on:61 - startup() - 23.11.2022 11:33:52 AM]
	 Application startup complete. 

[INFO  uvicorn.error server:253 - shutdown() - 23.11.2022 11:34:02 AM]
	 Shutting down 

[INFO  uvicorn.error on:66 - shutdown() - 23.11.2022 11:34:02 AM]
	 Waiting for application shutdown. 

[INFO  uvicorn.error on:77 - shutdown() - 23.11.2022 11:34:02 AM]
	 Application shutdown complete. 

[INFO  uvicorn.error server:85 - serve() - 23.11.2022 11:34:02 AM]
	 Finished server process [107809] 

[INFO  uvicorn.error server:75 - serve() - 23.11.2022 11:34:19 AM]
	 Started server process [108068] 

[INFO  uvicorn.error on:47 - startup() - 23.11.2022 11:34:19 AM]
	 Waiting for application startup. 

[INFO  uvicorn.error on:61 - startup() - 23.11.2022 11:34:19 AM]
	 Application startup complete. 

[INFO  app.users.controllers controllers:79 - trigger_emails() - 23.11.2022 11:34:25 AM]
	 jap56@yopmail.com has requested for profile view 

[INFO  app.users.controllers controllers:79 - trigger_emails() - 23.11.2022 11:34:33 AM]
	 jap56@yopmail.com has requested for profile view 

[INFO  uvicorn.error server:253 - shutdown() - 23.11.2022 11:39:50 AM]
	 Shutting down 

[INFO  uvicorn.error on:66 - shutdown() - 23.11.2022 11:39:50 AM]
	 Waiting for application shutdown. 

[INFO  uvicorn.error on:77 - shutdown() - 23.11.2022 11:39:50 AM]
	 Application shutdown complete. 

[INFO  uvicorn.error server:85 - serve() - 23.11.2022 11:39:50 AM]
	 Finished server process [108068] 

[INFO  uvicorn.error server:75 - serve() - 23.11.2022 11:39:52 AM]
	 Started server process [109157] 

[INFO  uvicorn.error on:47 - startup() - 23.11.2022 11:39:52 AM]
	 Waiting for application startup. 

[INFO  uvicorn.error on:61 - startup() - 23.11.2022 11:39:52 AM]
	 Application startup complete. 

[INFO  uvicorn.error server:253 - shutdown() - 23.11.2022 12:16:52 PM]
	 Shutting down 

[INFO  uvicorn.error on:66 - shutdown() - 23.11.2022 12:16:52 PM]
	 Waiting for application shutdown. 

[INFO  uvicorn.error on:77 - shutdown() - 23.11.2022 12:16:52 PM]
	 Application shutdown complete. 

[INFO  uvicorn.error server:85 - serve() - 23.11.2022 12:16:52 PM]
	 Finished server process [109157] 

[INFO  uvicorn.error server:75 - serve() - 23.11.2022 12:16:55 PM]
	 Started server process [117635] 

[INFO  uvicorn.error on:47 - startup() - 23.11.2022 12:16:55 PM]
	 Waiting for application startup. 

[INFO  uvicorn.error on:61 - startup() - 23.11.2022 12:16:55 PM]
	 Application startup complete. 

[INFO  uvicorn.error server:253 - shutdown() - 23.11.2022 12:17:54 PM]
	 Shutting down 

[INFO  uvicorn.error on:66 - shutdown() - 23.11.2022 12:17:54 PM]
	 Waiting for application shutdown. 

[INFO  uvicorn.error on:77 - shutdown() - 23.11.2022 12:17:54 PM]
	 Application shutdown complete. 

[INFO  uvicorn.error server:85 - serve() - 23.11.2022 12:17:54 PM]
	 Finished server process [117635] 

[INFO  uvicorn.error server:75 - serve() - 23.11.2022 12:17:56 PM]
	 Started server process [117857] 

[INFO  uvicorn.error on:47 - startup() - 23.11.2022 12:17:56 PM]
	 Waiting for application startup. 

[INFO  uvicorn.error on:61 - startup() - 23.11.2022 12:17:56 PM]
	 Application startup complete. 

[INFO  uvicorn.error server:253 - shutdown() - 23.11.2022 12:21:35 PM]
	 Shutting down 

[INFO  uvicorn.error on:66 - shutdown() - 23.11.2022 12:21:35 PM]
	 Waiting for application shutdown. 

[INFO  uvicorn.error on:77 - shutdown() - 23.11.2022 12:21:35 PM]
	 Application shutdown complete. 

[INFO  uvicorn.error server:85 - serve() - 23.11.2022 12:21:35 PM]
	 Finished server process [117857] 

[INFO  uvicorn.error server:75 - serve() - 23.11.2022 12:21:51 PM]
	 Started server process [118575] 

[INFO  uvicorn.error on:47 - startup() - 23.11.2022 12:21:51 PM]
	 Waiting for application startup. 

[INFO  uvicorn.error on:61 - startup() - 23.11.2022 12:21:51 PM]
	 Application startup complete. 

[INFO  uvicorn.error server:253 - shutdown() - 23.11.2022 12:54:51 PM]
	 Shutting down 

[INFO  uvicorn.error on:66 - shutdown() - 23.11.2022 12:54:52 PM]
	 Waiting for application shutdown. 

[INFO  uvicorn.error on:77 - shutdown() - 23.11.2022 12:54:52 PM]
	 Application shutdown complete. 

[INFO  uvicorn.error server:85 - serve() - 23.11.2022 12:54:52 PM]
	 Finished server process [118575] 

[INFO  uvicorn.error server:75 - serve() - 23.11.2022 12:54:53 PM]
	 Started server process [122518] 

[INFO  uvicorn.error on:47 - startup() - 23.11.2022 12:54:53 PM]
	 Waiting for application startup. 

[INFO  uvicorn.error on:61 - startup() - 23.11.2022 12:54:53 PM]
	 Application startup complete. 

[INFO  uvicorn.error server:253 - shutdown() - 23.11.2022 12:57:05 PM]
	 Shutting down 

[INFO  uvicorn.error on:66 - shutdown() - 23.11.2022 12:57:05 PM]
	 Waiting for application shutdown. 

[INFO  uvicorn.error on:77 - shutdown() - 23.11.2022 12:57:05 PM]
	 Application shutdown complete. 

[INFO  uvicorn.error server:85 - serve() - 23.11.2022 12:57:05 PM]
	 Finished server process [122518] 

[INFO  uvicorn.error server:75 - serve() - 23.11.2022 12:57:06 PM]
	 Started server process [122807] 

[INFO  uvicorn.error on:47 - startup() - 23.11.2022 12:57:06 PM]
	 Waiting for application startup. 

[INFO  uvicorn.error on:61 - startup() - 23.11.2022 12:57:06 PM]
	 Application startup complete. 

[INFO  uvicorn.error server:253 - shutdown() - 23.11.2022 04:23:54 PM]
	 Shutting down 

[INFO  uvicorn.error on:66 - shutdown() - 23.11.2022 04:23:54 PM]
	 Waiting for application shutdown. 

[INFO  uvicorn.error on:77 - shutdown() - 23.11.2022 04:23:54 PM]
	 Application shutdown complete. 

[INFO  uvicorn.error server:85 - serve() - 23.11.2022 04:23:54 PM]
	 Finished server process [122807] 

