%!PS-Adobe-3.0
%%Creator: PCBNEW
%%CreationDate: Sun Dec 19 14:13:30 2021
%%Title: C:\Users\Jannis\Documents\kicad\maguey_schematics\gerbers\maguey-NPTH-drl_map.ps
%%Pages: 1
%%PageOrder: Ascend
%%BoundingBox: 0 0 596 842
%%DocumentMedia: A4 595 842 0 () ()
%%Orientation: Landscape
%%EndComments
%%BeginProlog
/line { newpath moveto lineto stroke } bind def
/cir0 { newpath 0 360 arc stroke } bind def
/cir1 { newpath 0 360 arc gsave fill grestore stroke } bind def
/cir2 { newpath 0 360 arc gsave fill grestore stroke } bind def
/arc0 { newpath arc stroke } bind def
/arc1 { newpath 4 index 4 index moveto arc closepath gsave fill
    grestore stroke } bind def
/arc2 { newpath 4 index 4 index moveto arc closepath gsave fill
    grestore stroke } bind def
/poly0 { stroke } bind def
/poly1 { closepath gsave fill grestore stroke } bind def
/poly2 { closepath gsave fill grestore stroke } bind def
/rect0 { rectstroke } bind def
/rect1 { rectfill } bind def
/rect2 { rectfill } bind def
/linemode0 { 0 setlinecap 0 setlinejoin 0 setlinewidth } bind def
/linemode1 { 1 setlinecap 1 setlinejoin } bind def
/dashedline { [200] 100 setdash } bind def
/solidline { [] 0 setdash } bind def
/phantomshow { moveto
    /KicadFont findfont 0.000001 scalefont setfont
    show } bind def
/textshow { gsave
    findfont exch scalefont setfont concat 1 scale 0 0 moveto show
    } bind def
/reencodefont {
  findfont dup length dict begin
  { 1 index /FID ne
    { def }
    { pop pop } ifelse
  } forall
  /Encoding ISOLatin1Encoding def
  currentdict
  end } bind def
/KicadFont /Helvetica reencodefont definefont pop
/KicadFont-Bold /Helvetica-Bold reencodefont definefont pop
/KicadFont-Oblique /Helvetica-Oblique reencodefont definefont pop
/KicadFont-BoldOblique /Helvetica-BoldOblique reencodefont definefont pop
%%EndProlog
%%Page: 1 1
%%BeginPageSetup
gsave
0.0072 0.0072 scale
linemode1
82680 0 translate 90 rotate
80.2455 setlinewidth
%%EndPageSetup
0 0 0 setrgbcolor
31.5927 setlinewidth
newpath
66995 78727.2 moveto
49935 78727.2 lineto
stroke
0 0 0 setrgbcolor
newpath
69522.5 39552.2 moveto
69522.5 76199.8 lineto
stroke
0 0 0 setrgbcolor
newpath
49935 37024.8 moveto
66995 37024.8 lineto
stroke
0 0 0 setrgbcolor
newpath
47407.5 76199.8 moveto
47407.5 39552.2 lineto
stroke
0 0 0 setrgbcolor
66995 76199.8 2527.42 -0 90 arc0
0 0 0 setrgbcolor
66995 39552.2 2527.42 -90 -0 arc0
0 0 0 setrgbcolor
49935 76199.8 2527.42 90 180 arc0
0 0 0 setrgbcolor
49935 39552.2 2527.42 180 270 arc0
78.7398 setlinewidth
newpath
49050.4 77526.7 moveto
50440.4 76136.6 lineto
stroke
newpath
50440.4 77526.7 moveto
49050.4 76136.6 lineto
stroke
newpath
49050.4 39615.4 moveto
50440.4 38225.3 lineto
stroke
newpath
50440.4 39615.4 moveto
49050.4 38225.3 lineto
stroke
newpath
66742.3 77526.7 moveto
68132.4 76136.6 lineto
stroke
newpath
68132.4 77526.7 moveto
66742.3 76136.6 lineto
stroke
newpath
66742.3 39615.4 moveto
68132.4 38225.3 lineto
stroke
newpath
68132.4 39615.4 moveto
66742.3 38225.3 lineto
stroke
118.11 setlinewidth
0 0 0 setrgbcolor
0 0 0 setrgbcolor
newpath
48519.4 35175.5 moveto
48519.4 36356.6 lineto
48800.6 36356.6 lineto
48969.4 36300.3 lineto
49081.9 36187.9 lineto
49138.1 36075.4 lineto
49194.3 35850.4 lineto
49194.3 35681.7 lineto
49138.1 35456.7 lineto
49081.9 35344.2 lineto
48969.4 35231.7 lineto
48800.6 35175.5 lineto
48519.4 35175.5 lineto
stroke
newpath
49700.5 35175.5 moveto
49700.5 35962.9 lineto
stroke
newpath
49700.5 35737.9 moveto
49756.8 35850.4 lineto
49813 35906.6 lineto
49925.5 35962.9 lineto
50038 35962.9 lineto
stroke
newpath
50431.7 35175.5 moveto
50431.7 35962.9 lineto
stroke
newpath
50431.7 36356.6 moveto
50375.4 36300.3 lineto
50431.7 36244.1 lineto
50487.9 36300.3 lineto
50431.7 36356.6 lineto
50431.7 36244.1 lineto
stroke
newpath
51162.8 35175.5 moveto
51050.4 35231.7 lineto
50994.1 35344.2 lineto
50994.1 36356.6 lineto
stroke
newpath
51781.5 35175.5 moveto
51669 35231.7 lineto
51612.8 35344.2 lineto
51612.8 36356.6 lineto
stroke
newpath
53131.3 35175.5 moveto
53131.3 36356.6 lineto
53525 35512.9 lineto
53918.7 36356.6 lineto
53918.7 35175.5 lineto
stroke
newpath
54987.4 35175.5 moveto
54987.4 35794.2 lineto
54931.1 35906.6 lineto
54818.6 35962.9 lineto
54593.7 35962.9 lineto
54481.2 35906.6 lineto
stroke
newpath
54987.4 35231.7 moveto
54874.9 35175.5 lineto
54593.7 35175.5 lineto
54481.2 35231.7 lineto
54424.9 35344.2 lineto
54424.9 35456.7 lineto
54481.2 35569.2 lineto
54593.7 35625.4 lineto
54874.9 35625.4 lineto
54987.4 35681.7 lineto
stroke
newpath
55549.8 35962.9 moveto
55549.8 34781.8 lineto
stroke
newpath
55549.8 35906.6 moveto
55662.3 35962.9 lineto
55887.2 35962.9 lineto
55999.7 35906.6 lineto
56056 35850.4 lineto
56112.2 35737.9 lineto
56112.2 35400.5 lineto
56056 35288 lineto
55999.7 35231.7 lineto
55887.2 35175.5 lineto
55662.3 35175.5 lineto
55549.8 35231.7 lineto
stroke
newpath
56618.4 35288 moveto
56674.7 35231.7 lineto
56618.4 35175.5 lineto
56562.2 35231.7 lineto
56618.4 35288 lineto
56618.4 35175.5 lineto
stroke
newpath
56618.4 35906.6 moveto
56674.7 35850.4 lineto
56618.4 35794.2 lineto
56562.2 35850.4 lineto
56618.4 35906.6 lineto
56618.4 35794.2 lineto
stroke
newpath
46001.7 33924.5 moveto
47391.8 32534.4 lineto
stroke
newpath
47391.8 33924.5 moveto
46001.7 32534.4 lineto
stroke
0 0 0 setrgbcolor
0 0 0 setrgbcolor
newpath
48463.2 33763.8 moveto
48519.4 33820 lineto
48631.9 33876.3 lineto
48913.1 33876.3 lineto
49025.6 33820 lineto
49081.9 33763.8 lineto
49138.1 33651.3 lineto
49138.1 33538.8 lineto
49081.9 33370.1 lineto
48406.9 32695.2 lineto
49138.1 32695.2 lineto
stroke
newpath
49644.3 32807.7 moveto
49700.5 32751.4 lineto
49644.3 32695.2 lineto
49588 32751.4 lineto
49644.3 32807.7 lineto
49644.3 32695.2 lineto
stroke
newpath
50150.5 33763.8 moveto
50206.7 33820 lineto
50319.2 33876.3 lineto
50600.4 33876.3 lineto
50712.9 33820 lineto
50769.1 33763.8 lineto
50825.4 33651.3 lineto
50825.4 33538.8 lineto
50769.1 33370.1 lineto
50094.2 32695.2 lineto
50825.4 32695.2 lineto
stroke
newpath
51556.5 33876.3 moveto
51669 33876.3 lineto
51781.5 33820 lineto
51837.8 33763.8 lineto
51894 33651.3 lineto
51950.2 33426.3 lineto
51950.2 33145.1 lineto
51894 32920.1 lineto
51837.8 32807.7 lineto
51781.5 32751.4 lineto
51669 32695.2 lineto
51556.5 32695.2 lineto
51444.1 32751.4 lineto
51387.8 32807.7 lineto
51331.6 32920.1 lineto
51275.3 33145.1 lineto
51275.3 33426.3 lineto
51331.6 33651.3 lineto
51387.8 33763.8 lineto
51444.1 33820 lineto
51556.5 33876.3 lineto
stroke
newpath
52681.4 33876.3 moveto
52793.9 33876.3 lineto
52906.4 33820 lineto
52962.6 33763.8 lineto
53018.9 33651.3 lineto
53075.1 33426.3 lineto
53075.1 33145.1 lineto
53018.9 32920.1 lineto
52962.6 32807.7 lineto
52906.4 32751.4 lineto
52793.9 32695.2 lineto
52681.4 32695.2 lineto
52568.9 32751.4 lineto
52512.7 32807.7 lineto
52456.4 32920.1 lineto
52400.2 33145.1 lineto
52400.2 33426.3 lineto
52456.4 33651.3 lineto
52512.7 33763.8 lineto
52568.9 33820 lineto
52681.4 33876.3 lineto
stroke
newpath
53581.3 32695.2 moveto
53581.3 33482.6 lineto
stroke
newpath
53581.3 33370.1 moveto
53637.5 33426.3 lineto
53750 33482.6 lineto
53918.7 33482.6 lineto
54031.2 33426.3 lineto
54087.5 33313.8 lineto
54087.5 32695.2 lineto
stroke
newpath
54087.5 33313.8 moveto
54143.7 33426.3 lineto
54256.2 33482.6 lineto
54424.9 33482.6 lineto
54537.4 33426.3 lineto
54593.7 33313.8 lineto
54593.7 32695.2 lineto
stroke
newpath
55156.1 32695.2 moveto
55156.1 33482.6 lineto
stroke
newpath
55156.1 33370.1 moveto
55212.3 33426.3 lineto
55324.8 33482.6 lineto
55493.5 33482.6 lineto
55606 33426.3 lineto
55662.3 33313.8 lineto
55662.3 32695.2 lineto
stroke
newpath
55662.3 33313.8 moveto
55718.5 33426.3 lineto
55831 33482.6 lineto
55999.7 33482.6 lineto
56112.2 33426.3 lineto
56168.5 33313.8 lineto
56168.5 32695.2 lineto
stroke
newpath
58474.4 33932.5 moveto
57462.1 32414 lineto
stroke
newpath
59993 33876.3 moveto
60105.5 33876.3 lineto
60218 33820 lineto
60274.2 33763.8 lineto
60330.4 33651.3 lineto
60386.7 33426.3 lineto
60386.7 33145.1 lineto
60330.4 32920.1 lineto
60274.2 32807.7 lineto
60218 32751.4 lineto
60105.5 32695.2 lineto
59993 32695.2 lineto
59880.5 32751.4 lineto
59824.3 32807.7 lineto
59768 32920.1 lineto
59711.8 33145.1 lineto
59711.8 33426.3 lineto
59768 33651.3 lineto
59824.3 33763.8 lineto
59880.5 33820 lineto
59993 33876.3 lineto
stroke
newpath
60892.9 32807.7 moveto
60949.1 32751.4 lineto
60892.9 32695.2 lineto
60836.6 32751.4 lineto
60892.9 32807.7 lineto
60892.9 32695.2 lineto
stroke
newpath
61680.3 33876.3 moveto
61792.8 33876.3 lineto
61905.2 33820 lineto
61961.5 33763.8 lineto
62017.7 33651.3 lineto
62074 33426.3 lineto
62074 33145.1 lineto
62017.7 32920.1 lineto
61961.5 32807.7 lineto
61905.2 32751.4 lineto
61792.8 32695.2 lineto
61680.3 32695.2 lineto
61567.8 32751.4 lineto
61511.5 32807.7 lineto
61455.3 32920.1 lineto
61399.1 33145.1 lineto
61399.1 33426.3 lineto
61455.3 33651.3 lineto
61511.5 33763.8 lineto
61567.8 33820 lineto
61680.3 33876.3 lineto
stroke
newpath
62748.9 33370.1 moveto
62636.4 33426.3 lineto
62580.2 33482.6 lineto
62523.9 33595.1 lineto
62523.9 33651.3 lineto
62580.2 33763.8 lineto
62636.4 33820 lineto
62748.9 33876.3 lineto
62973.9 33876.3 lineto
63086.3 33820 lineto
63142.6 33763.8 lineto
63198.8 33651.3 lineto
63198.8 33595.1 lineto
63142.6 33482.6 lineto
63086.3 33426.3 lineto
62973.9 33370.1 lineto
62748.9 33370.1 lineto
62636.4 33313.8 lineto
62580.2 33257.6 lineto
62523.9 33145.1 lineto
62523.9 32920.1 lineto
62580.2 32807.7 lineto
62636.4 32751.4 lineto
62748.9 32695.2 lineto
62973.9 32695.2 lineto
63086.3 32751.4 lineto
63142.6 32807.7 lineto
63198.8 32920.1 lineto
63198.8 33145.1 lineto
63142.6 33257.6 lineto
63086.3 33313.8 lineto
62973.9 33370.1 lineto
stroke
newpath
64211.2 33876.3 moveto
63986.2 33876.3 lineto
63873.7 33820 lineto
63817.5 33763.8 lineto
63705 33595.1 lineto
63648.8 33370.1 lineto
63648.8 32920.1 lineto
63705 32807.7 lineto
63761.3 32751.4 lineto
63873.7 32695.2 lineto
64098.7 32695.2 lineto
64211.2 32751.4 lineto
64267.5 32807.7 lineto
64323.7 32920.1 lineto
64323.7 33201.4 lineto
64267.5 33313.8 lineto
64211.2 33370.1 lineto
64098.7 33426.3 lineto
63873.7 33426.3 lineto
63761.3 33370.1 lineto
63705 33313.8 lineto
63648.8 33201.4 lineto
stroke
newpath
65336.1 33876.3 moveto
65111.1 33876.3 lineto
64998.6 33820 lineto
64942.4 33763.8 lineto
64829.9 33595.1 lineto
64773.6 33370.1 lineto
64773.6 32920.1 lineto
64829.9 32807.7 lineto
64886.1 32751.4 lineto
64998.6 32695.2 lineto
65223.6 32695.2 lineto
65336.1 32751.4 lineto
65392.3 32807.7 lineto
65448.6 32920.1 lineto
65448.6 33201.4 lineto
65392.3 33313.8 lineto
65336.1 33370.1 lineto
65223.6 33426.3 lineto
64998.6 33426.3 lineto
64886.1 33370.1 lineto
64829.9 33313.8 lineto
64773.6 33201.4 lineto
stroke
newpath
65898.5 33876.3 moveto
65898.5 33651.3 lineto
stroke
newpath
66348.4 33876.3 moveto
66348.4 33651.3 lineto
stroke
newpath
68092 32245.2 moveto
68035.7 32301.5 lineto
67923.2 32470.2 lineto
67867 32582.7 lineto
67810.8 32751.4 lineto
67754.5 33032.6 lineto
67754.5 33257.6 lineto
67810.8 33538.8 lineto
67867 33707.5 lineto
67923.2 33820 lineto
68035.7 33988.8 lineto
68092 34045 lineto
stroke
newpath
69048.1 33482.6 moveto
69048.1 32695.2 lineto
stroke
newpath
68766.9 33932.5 moveto
68485.7 33088.9 lineto
69216.8 33088.9 lineto
stroke
newpath
70566.7 32695.2 moveto
70566.7 33876.3 lineto
stroke
newpath
71072.8 32695.2 moveto
71072.8 33313.8 lineto
71016.6 33426.3 lineto
70904.1 33482.6 lineto
70735.4 33482.6 lineto
70622.9 33426.3 lineto
70566.7 33370.1 lineto
stroke
newpath
71804 32695.2 moveto
71691.5 32751.4 lineto
71635.3 32807.7 lineto
71579 32920.1 lineto
71579 33257.6 lineto
71635.3 33370.1 lineto
71691.5 33426.3 lineto
71804 33482.6 lineto
71972.7 33482.6 lineto
72085.2 33426.3 lineto
72141.5 33370.1 lineto
72197.7 33257.6 lineto
72197.7 32920.1 lineto
72141.5 32807.7 lineto
72085.2 32751.4 lineto
71972.7 32695.2 lineto
71804 32695.2 lineto
stroke
newpath
72872.6 32695.2 moveto
72760.1 32751.4 lineto
72703.9 32863.9 lineto
72703.9 33876.3 lineto
stroke
newpath
73772.5 32751.4 moveto
73660 32695.2 lineto
73435.1 32695.2 lineto
73322.6 32751.4 lineto
73266.3 32863.9 lineto
73266.3 33313.8 lineto
73322.6 33426.3 lineto
73435.1 33482.6 lineto
73660 33482.6 lineto
73772.5 33426.3 lineto
73828.8 33313.8 lineto
73828.8 33201.4 lineto
73266.3 33088.9 lineto
stroke
newpath
74278.7 32751.4 moveto
74391.2 32695.2 lineto
74616.2 32695.2 lineto
74728.6 32751.4 lineto
74784.9 32863.9 lineto
74784.9 32920.1 lineto
74728.6 33032.6 lineto
74616.2 33088.9 lineto
74447.4 33088.9 lineto
74334.9 33145.1 lineto
74278.7 33257.6 lineto
74278.7 33313.8 lineto
74334.9 33426.3 lineto
74447.4 33482.6 lineto
74616.2 33482.6 lineto
74728.6 33426.3 lineto
stroke
newpath
75178.6 32245.2 moveto
75234.8 32301.5 lineto
75347.3 32470.2 lineto
75403.6 32582.7 lineto
75459.8 32751.4 lineto
75516 33032.6 lineto
75516 33257.6 lineto
75459.8 33538.8 lineto
75403.6 33707.5 lineto
75347.3 33820 lineto
75234.8 33988.8 lineto
75178.6 34045 lineto
stroke
newpath
77315.8 32245.2 moveto
77259.6 32301.5 lineto
77147.1 32470.2 lineto
77090.8 32582.7 lineto
77034.6 32751.4 lineto
76978.4 33032.6 lineto
76978.4 33257.6 lineto
77034.6 33538.8 lineto
77090.8 33707.5 lineto
77147.1 33820 lineto
77259.6 33988.8 lineto
77315.8 34045 lineto
stroke
newpath
77765.8 33482.6 moveto
77765.8 32695.2 lineto
stroke
newpath
77765.8 33370.1 moveto
77822 33426.3 lineto
77934.5 33482.6 lineto
78103.2 33482.6 lineto
78215.7 33426.3 lineto
78271.9 33313.8 lineto
78271.9 32695.2 lineto
stroke
newpath
79003.1 32695.2 moveto
78890.6 32751.4 lineto
78834.4 32807.7 lineto
78778.1 32920.1 lineto
78778.1 33257.6 lineto
78834.4 33370.1 lineto
78890.6 33426.3 lineto
79003.1 33482.6 lineto
79171.8 33482.6 lineto
79284.3 33426.3 lineto
79340.6 33370.1 lineto
79396.8 33257.6 lineto
79396.8 32920.1 lineto
79340.6 32807.7 lineto
79284.3 32751.4 lineto
79171.8 32695.2 lineto
79003.1 32695.2 lineto
stroke
newpath
79734.3 33482.6 moveto
80184.2 33482.6 lineto
stroke
newpath
79903 33876.3 moveto
79903 32863.9 lineto
79959.2 32751.4 lineto
80071.7 32695.2 lineto
80184.2 32695.2 lineto
stroke
newpath
81477.8 33482.6 moveto
81477.8 32301.5 lineto
stroke
newpath
81477.8 33426.3 moveto
81590.3 33482.6 lineto
81815.3 33482.6 lineto
81927.7 33426.3 lineto
81984 33370.1 lineto
82040.2 33257.6 lineto
82040.2 32920.1 lineto
81984 32807.7 lineto
81927.7 32751.4 lineto
81815.3 32695.2 lineto
81590.3 32695.2 lineto
81477.8 32751.4 lineto
stroke
newpath
82715.1 32695.2 moveto
82602.7 32751.4 lineto
82546.4 32863.9 lineto
82546.4 33876.3 lineto
stroke
newpath
83671.3 32695.2 moveto
83671.3 33313.8 lineto
83615 33426.3 lineto
83502.5 33482.6 lineto
83277.6 33482.6 lineto
83165.1 33426.3 lineto
stroke
newpath
83671.3 32751.4 moveto
83558.8 32695.2 lineto
83277.6 32695.2 lineto
83165.1 32751.4 lineto
83108.8 32863.9 lineto
83108.8 32976.4 lineto
83165.1 33088.9 lineto
83277.6 33145.1 lineto
83558.8 33145.1 lineto
83671.3 33201.4 lineto
stroke
newpath
84065 33482.6 moveto
84514.9 33482.6 lineto
stroke
newpath
84233.7 33876.3 moveto
84233.7 32863.9 lineto
84289.9 32751.4 lineto
84402.4 32695.2 lineto
84514.9 32695.2 lineto
stroke
newpath
85358.6 32751.4 moveto
85246.1 32695.2 lineto
85021.1 32695.2 lineto
84908.6 32751.4 lineto
84852.4 32863.9 lineto
84852.4 33313.8 lineto
84908.6 33426.3 lineto
85021.1 33482.6 lineto
85246.1 33482.6 lineto
85358.6 33426.3 lineto
85414.8 33313.8 lineto
85414.8 33201.4 lineto
84852.4 33088.9 lineto
stroke
newpath
86427.2 32695.2 moveto
86427.2 33876.3 lineto
stroke
newpath
86427.2 32751.4 moveto
86314.7 32695.2 lineto
86089.7 32695.2 lineto
85977.2 32751.4 lineto
85921 32807.7 lineto
85864.7 32920.1 lineto
85864.7 33257.6 lineto
85921 33370.1 lineto
85977.2 33426.3 lineto
86089.7 33482.6 lineto
86314.7 33482.6 lineto
86427.2 33426.3 lineto
stroke
newpath
86877.1 32245.2 moveto
86933.4 32301.5 lineto
87045.8 32470.2 lineto
87102.1 32582.7 lineto
87158.3 32751.4 lineto
87214.6 33032.6 lineto
87214.6 33257.6 lineto
87158.3 33538.8 lineto
87102.1 33707.5 lineto
87045.8 33820 lineto
86933.4 33988.8 lineto
86877.1 34045 lineto
stroke
showpage
grestore
%%EOF
