%!PS-Adobe-3.0
%%Creator: PCBNEW
%%CreationDate: Sun Dec 19 14:13:30 2021
%%Title: C:\Users\Jannis\Documents\kicad\maguey_schematics\gerbers\maguey-PTH-drl_map.ps
%%Pages: 1
%%PageOrder: Ascend
%%BoundingBox: 0 0 596 842
%%DocumentMedia: A4 595 842 0 () ()
%%Orientation: Landscape
%%EndComments
%%BeginProlog
/line { newpath moveto lineto stroke } bind def
/cir0 { newpath 0 360 arc stroke } bind def
/cir1 { newpath 0 360 arc gsave fill grestore stroke } bind def
/cir2 { newpath 0 360 arc gsave fill grestore stroke } bind def
/arc0 { newpath arc stroke } bind def
/arc1 { newpath 4 index 4 index moveto arc closepath gsave fill
    grestore stroke } bind def
/arc2 { newpath 4 index 4 index moveto arc closepath gsave fill
    grestore stroke } bind def
/poly0 { stroke } bind def
/poly1 { closepath gsave fill grestore stroke } bind def
/poly2 { closepath gsave fill grestore stroke } bind def
/rect0 { rectstroke } bind def
/rect1 { rectfill } bind def
/rect2 { rectfill } bind def
/linemode0 { 0 setlinecap 0 setlinejoin 0 setlinewidth } bind def
/linemode1 { 1 setlinecap 1 setlinejoin } bind def
/dashedline { [200] 100 setdash } bind def
/solidline { [] 0 setdash } bind def
/phantomshow { moveto
    /KicadFont findfont 0.000001 scalefont setfont
    show } bind def
/textshow { gsave
    findfont exch scalefont setfont concat 1 scale 0 0 moveto show
    } bind def
/reencodefont {
  findfont dup length dict begin
  { 1 index /FID ne
    { def }
    { pop pop } ifelse
  } forall
  /Encoding ISOLatin1Encoding def
  currentdict
  end } bind def
/KicadFont /Helvetica reencodefont definefont pop
/KicadFont-Bold /Helvetica-Bold reencodefont definefont pop
/KicadFont-Oblique /Helvetica-Oblique reencodefont definefont pop
/KicadFont-BoldOblique /Helvetica-BoldOblique reencodefont definefont pop
%%EndProlog
%%Page: 1 1
%%BeginPageSetup
gsave
0.0072 0.0072 scale
linemode1
82680 0 translate 90 rotate
80.2455 setlinewidth
%%EndPageSetup
0 0 0 setrgbcolor
31.5927 setlinewidth
newpath
66995 78727.2 moveto
49935 78727.2 lineto
stroke
0 0 0 setrgbcolor
newpath
69522.5 39552.2 moveto
69522.5 76199.8 lineto
stroke
0 0 0 setrgbcolor
newpath
49935 37024.8 moveto
66995 37024.8 lineto
stroke
0 0 0 setrgbcolor
newpath
47407.5 76199.8 moveto
47407.5 39552.2 lineto
stroke
0 0 0 setrgbcolor
66995 76199.8 2527.42 -0 90 arc0
0 0 0 setrgbcolor
66995 39552.2 2527.42 -90 -0 arc0
0 0 0 setrgbcolor
49935 76199.8 2527.42 90 180 arc0
0 0 0 setrgbcolor
49935 39552.2 2527.42 180 270 arc0
78.7398 setlinewidth
newpath
48071 50909.8 moveto
48323.7 50657.1 lineto
stroke
newpath
48323.7 50909.8 moveto
48071 50657.1 lineto
stroke
newpath
50519.4 48571.9 moveto
50772.2 48319.2 lineto
stroke
newpath
50772.2 48571.9 moveto
50519.4 48319.2 lineto
stroke
newpath
52683.5 63452.1 moveto
52936.3 63199.4 lineto
stroke
newpath
52936.3 63452.1 moveto
52683.5 63199.4 lineto
stroke
newpath
52699.3 54258.6 moveto
52952.1 54005.9 lineto
stroke
newpath
52952.1 54258.6 moveto
52699.3 54005.9 lineto
stroke
newpath
53568.1 54195.4 moveto
53820.9 53942.7 lineto
stroke
newpath
53820.9 54195.4 moveto
53568.1 53942.7 lineto
stroke
newpath
53694.5 53500.4 moveto
53947.2 53247.7 lineto
stroke
newpath
53947.2 53500.4 moveto
53694.5 53247.7 lineto
stroke
newpath
54642.3 50909.8 moveto
54895 50657.1 lineto
stroke
newpath
54895 50909.8 moveto
54642.3 50657.1 lineto
stroke
newpath
57138.1 55364.4 moveto
57390.8 55111.6 lineto
stroke
newpath
57390.8 55364.4 moveto
57138.1 55111.6 lineto
stroke
newpath
58907.3 57023 moveto
59160 56770.3 lineto
stroke
newpath
59160 57023 moveto
58907.3 56770.3 lineto
stroke
newpath
59523.4 54116.5 moveto
59776.1 53863.7 lineto
stroke
newpath
59776.1 54116.5 moveto
59523.4 53863.7 lineto
stroke
newpath
62572.1 54779.9 moveto
62824.8 54527.2 lineto
stroke
newpath
62824.8 54779.9 moveto
62572.1 54527.2 lineto
stroke
newpath
63330.3 54779.9 moveto
63583 54527.2 lineto
stroke
newpath
63583 54779.9 moveto
63330.3 54527.2 lineto
stroke
newpath
63330.3 49788.3 moveto
63583 49535.5 lineto
stroke
newpath
63583 49788.3 moveto
63330.3 49535.5 lineto
stroke
newpath
65683.9 75299.4 moveto
65936.7 75046.6 lineto
stroke
newpath
65936.7 75299.4 moveto
65683.9 75046.6 lineto
stroke
54515.9 56643.9 189.556 cir0
55779.6 56643.9 189.556 cir0
59365.4 45823.4 189.556 cir0
60629.1 45823.4 189.556 cir0
61987.6 43359.1 189.556 cir0
63251.3 43359.1 189.556 cir0
newpath
58149.1 52912.8 moveto
58149.1 52470.5 lineto
stroke
newpath
57927.9 52691.6 moveto
58370.2 52691.6 lineto
stroke
newpath
58149.1 48098.1 moveto
58149.1 47655.8 lineto
stroke
newpath
57927.9 47876.9 moveto
58370.2 47876.9 lineto
stroke
newpath
48926.2 41461.3 moveto
48926.2 41908.1 lineto
48479.5 41908.1 lineto
48479.5 41461.3 lineto
48926.2 41461.3 lineto
poly0
newpath
50474.3 73752.3 moveto
50474.3 74199 lineto
50027.5 74199 lineto
50027.5 73752.3 lineto
50474.3 73752.3 lineto
poly0
newpath
50474.3 72147.3 moveto
50474.3 72594.1 lineto
50027.5 72594.1 lineto
50027.5 72147.3 lineto
50474.3 72147.3 lineto
poly0
newpath
50474.3 70542.4 moveto
50474.3 70989.2 lineto
50027.5 70989.2 lineto
50027.5 70542.4 lineto
50474.3 70542.4 lineto
poly0
newpath
50474.3 68937.5 moveto
50474.3 69384.3 lineto
50027.5 69384.3 lineto
50027.5 68937.5 lineto
50474.3 68937.5 lineto
poly0
newpath
50474.3 67332.6 moveto
50474.3 67779.4 lineto
50027.5 67779.4 lineto
50027.5 67332.6 lineto
50474.3 67332.6 lineto
poly0
newpath
50474.3 65727.7 moveto
50474.3 66174.5 lineto
50027.5 66174.5 lineto
50027.5 65727.7 lineto
50474.3 65727.7 lineto
poly0
newpath
50474.3 64122.8 moveto
50474.3 64569.6 lineto
50027.5 64569.6 lineto
50027.5 64122.8 lineto
50474.3 64122.8 lineto
poly0
newpath
50474.3 62517.9 moveto
50474.3 62964.7 lineto
50027.5 62964.7 lineto
50027.5 62517.9 lineto
50474.3 62517.9 lineto
poly0
newpath
50474.3 60913 moveto
50474.3 61359.8 lineto
50027.5 61359.8 lineto
50027.5 60913 lineto
50474.3 60913 lineto
poly0
newpath
50474.3 59308.1 moveto
50474.3 59754.9 lineto
50027.5 59754.9 lineto
50027.5 59308.1 lineto
50474.3 59308.1 lineto
poly0
newpath
50531.2 41461.3 moveto
50531.2 41908.1 lineto
50084.4 41908.1 lineto
50084.4 41461.3 lineto
50531.2 41461.3 lineto
poly0
newpath
52136.1 41461.3 moveto
52136.1 41908.1 lineto
51689.3 41908.1 lineto
51689.3 41461.3 lineto
52136.1 41461.3 lineto
poly0
newpath
52597.3 48775 moveto
52597.3 49221.8 lineto
52150.5 49221.8 lineto
52150.5 48775 lineto
52597.3 48775 lineto
poly0
newpath
53741 41461.3 moveto
53741 41908.1 lineto
53294.2 41908.1 lineto
53294.2 41461.3 lineto
53741 41461.3 lineto
poly0
newpath
54202.2 48775 moveto
54202.2 49221.8 lineto
53755.4 49221.8 lineto
53755.4 48775 lineto
54202.2 48775 lineto
poly0
newpath
54407.6 45157.7 moveto
54407.6 45604.5 lineto
53960.8 45604.5 lineto
53960.8 45157.7 lineto
54407.6 45157.7 lineto
poly0
newpath
56012.5 45157.7 moveto
56012.5 45604.5 lineto
55565.7 45604.5 lineto
55565.7 45157.7 lineto
56012.5 45157.7 lineto
poly0
newpath
56161 42472.3 moveto
56161 42919.1 lineto
55714.2 42919.1 lineto
55714.2 42472.3 lineto
56161 42472.3 lineto
poly0
newpath
56161 40087.1 moveto
56161 40533.8 lineto
55714.2 40533.8 lineto
55714.2 40087.1 lineto
56161 40087.1 lineto
poly0
newpath
57765.9 42472.3 moveto
57765.9 42919.1 lineto
57319.1 42919.1 lineto
57319.1 42472.3 lineto
57765.9 42472.3 lineto
poly0
newpath
57765.9 40087.1 moveto
57765.9 40533.8 lineto
57319.1 40533.8 lineto
57319.1 40087.1 lineto
57765.9 40087.1 lineto
poly0
newpath
59370.8 40087.1 moveto
59370.8 40533.8 lineto
58924 40533.8 lineto
58924 40087.1 lineto
59370.8 40087.1 lineto
poly0
newpath
60975.7 40087.1 moveto
60975.7 40533.8 lineto
60528.9 40533.8 lineto
60528.9 40087.1 lineto
60975.7 40087.1 lineto
poly0
newpath
62580.6 40087.1 moveto
62580.6 40533.8 lineto
62133.8 40533.8 lineto
62133.8 40087.1 lineto
62580.6 40087.1 lineto
poly0
newpath
64185.5 40087.1 moveto
64185.5 40533.8 lineto
63738.7 40533.8 lineto
63738.7 40087.1 lineto
64185.5 40087.1 lineto
poly0
newpath
65834.7 56436.3 moveto
65834.7 56883.1 lineto
65387.9 56883.1 lineto
65387.9 56436.3 lineto
65834.7 56436.3 lineto
poly0
newpath
67439.6 56436.3 moveto
67439.6 56883.1 lineto
66992.8 56883.1 lineto
66992.8 56436.3 lineto
67439.6 56436.3 lineto
poly0
newpath
67518.6 73780.7 moveto
67518.6 74227.5 lineto
67071.8 74227.5 lineto
67071.8 73780.7 lineto
67518.6 73780.7 lineto
poly0
newpath
67518.6 72175.8 moveto
67518.6 72622.6 lineto
67071.8 72622.6 lineto
67071.8 72175.8 lineto
67518.6 72175.8 lineto
poly0
newpath
67518.6 70570.9 moveto
67518.6 71017.7 lineto
67071.8 71017.7 lineto
67071.8 70570.9 lineto
67518.6 70570.9 lineto
poly0
newpath
67518.6 68966 moveto
67518.6 69412.7 lineto
67071.8 69412.7 lineto
67071.8 68966 lineto
67518.6 68966 lineto
poly0
newpath
67518.6 67361 moveto
67518.6 67807.8 lineto
67071.8 67807.8 lineto
67071.8 67361 lineto
67518.6 67361 lineto
poly0
newpath
67518.6 65756.1 moveto
67518.6 66202.9 lineto
67071.8 66202.9 lineto
67071.8 65756.1 lineto
67518.6 65756.1 lineto
poly0
newpath
67518.6 64151.2 moveto
67518.6 64598 lineto
67071.8 64598 lineto
67071.8 64151.2 lineto
67518.6 64151.2 lineto
poly0
newpath
67518.6 62546.3 moveto
67518.6 62993.1 lineto
67071.8 62993.1 lineto
67071.8 62546.3 lineto
67518.6 62546.3 lineto
poly0
newpath
67518.6 60941.4 moveto
67518.6 61388.2 lineto
67071.8 61388.2 lineto
67071.8 60941.4 lineto
67518.6 60941.4 lineto
poly0
newpath
67518.6 59336.5 moveto
67518.6 59783.3 lineto
67071.8 59783.3 lineto
67071.8 59336.5 lineto
67518.6 59336.5 lineto
poly0
118.11 setlinewidth
0 0 0 setrgbcolor
0 0 0 setrgbcolor
newpath
48519.4 35175.5 moveto
48519.4 36356.6 lineto
48800.6 36356.6 lineto
48969.4 36300.3 lineto
49081.9 36187.9 lineto
49138.1 36075.4 lineto
49194.3 35850.4 lineto
49194.3 35681.7 lineto
49138.1 35456.7 lineto
49081.9 35344.2 lineto
48969.4 35231.7 lineto
48800.6 35175.5 lineto
48519.4 35175.5 lineto
stroke
newpath
49700.5 35175.5 moveto
49700.5 35962.9 lineto
stroke
newpath
49700.5 35737.9 moveto
49756.8 35850.4 lineto
49813 35906.6 lineto
49925.5 35962.9 lineto
50038 35962.9 lineto
stroke
newpath
50431.7 35175.5 moveto
50431.7 35962.9 lineto
stroke
newpath
50431.7 36356.6 moveto
50375.4 36300.3 lineto
50431.7 36244.1 lineto
50487.9 36300.3 lineto
50431.7 36356.6 lineto
50431.7 36244.1 lineto
stroke
newpath
51162.8 35175.5 moveto
51050.4 35231.7 lineto
50994.1 35344.2 lineto
50994.1 36356.6 lineto
stroke
newpath
51781.5 35175.5 moveto
51669 35231.7 lineto
51612.8 35344.2 lineto
51612.8 36356.6 lineto
stroke
newpath
53131.3 35175.5 moveto
53131.3 36356.6 lineto
53525 35512.9 lineto
53918.7 36356.6 lineto
53918.7 35175.5 lineto
stroke
newpath
54987.4 35175.5 moveto
54987.4 35794.2 lineto
54931.1 35906.6 lineto
54818.6 35962.9 lineto
54593.7 35962.9 lineto
54481.2 35906.6 lineto
stroke
newpath
54987.4 35231.7 moveto
54874.9 35175.5 lineto
54593.7 35175.5 lineto
54481.2 35231.7 lineto
54424.9 35344.2 lineto
54424.9 35456.7 lineto
54481.2 35569.2 lineto
54593.7 35625.4 lineto
54874.9 35625.4 lineto
54987.4 35681.7 lineto
stroke
newpath
55549.8 35962.9 moveto
55549.8 34781.8 lineto
stroke
newpath
55549.8 35906.6 moveto
55662.3 35962.9 lineto
55887.2 35962.9 lineto
55999.7 35906.6 lineto
56056 35850.4 lineto
56112.2 35737.9 lineto
56112.2 35400.5 lineto
56056 35288 lineto
55999.7 35231.7 lineto
55887.2 35175.5 lineto
55662.3 35175.5 lineto
55549.8 35231.7 lineto
stroke
newpath
56618.4 35288 moveto
56674.7 35231.7 lineto
56618.4 35175.5 lineto
56562.2 35231.7 lineto
56618.4 35288 lineto
56618.4 35175.5 lineto
stroke
newpath
56618.4 35906.6 moveto
56674.7 35850.4 lineto
56618.4 35794.2 lineto
56562.2 35850.4 lineto
56618.4 35906.6 lineto
56618.4 35794.2 lineto
stroke
newpath
47139 33355.9 moveto
47391.8 33103.1 lineto
stroke
newpath
47391.8 33355.9 moveto
47139 33103.1 lineto
stroke
0 0 0 setrgbcolor
0 0 0 setrgbcolor
newpath
48744.4 33876.3 moveto
48856.9 33876.3 lineto
48969.4 33820 lineto
49025.6 33763.8 lineto
49081.9 33651.3 lineto
49138.1 33426.3 lineto
49138.1 33145.1 lineto
49081.9 32920.1 lineto
49025.6 32807.7 lineto
48969.4 32751.4 lineto
48856.9 32695.2 lineto
48744.4 32695.2 lineto
48631.9 32751.4 lineto
48575.7 32807.7 lineto
48519.4 32920.1 lineto
48463.2 33145.1 lineto
48463.2 33426.3 lineto
48519.4 33651.3 lineto
48575.7 33763.8 lineto
48631.9 33820 lineto
48744.4 33876.3 lineto
stroke
newpath
49644.3 32807.7 moveto
49700.5 32751.4 lineto
49644.3 32695.2 lineto
49588 32751.4 lineto
49644.3 32807.7 lineto
49644.3 32695.2 lineto
stroke
newpath
50712.9 33482.6 moveto
50712.9 32695.2 lineto
stroke
newpath
50431.7 33932.5 moveto
50150.5 33088.9 lineto
50881.6 33088.9 lineto
stroke
newpath
51556.5 33876.3 moveto
51669 33876.3 lineto
51781.5 33820 lineto
51837.8 33763.8 lineto
51894 33651.3 lineto
51950.2 33426.3 lineto
51950.2 33145.1 lineto
51894 32920.1 lineto
51837.8 32807.7 lineto
51781.5 32751.4 lineto
51669 32695.2 lineto
51556.5 32695.2 lineto
51444.1 32751.4 lineto
51387.8 32807.7 lineto
51331.6 32920.1 lineto
51275.3 33145.1 lineto
51275.3 33426.3 lineto
51331.6 33651.3 lineto
51387.8 33763.8 lineto
51444.1 33820 lineto
51556.5 33876.3 lineto
stroke
newpath
52681.4 33876.3 moveto
52793.9 33876.3 lineto
52906.4 33820 lineto
52962.6 33763.8 lineto
53018.9 33651.3 lineto
53075.1 33426.3 lineto
53075.1 33145.1 lineto
53018.9 32920.1 lineto
52962.6 32807.7 lineto
52906.4 32751.4 lineto
52793.9 32695.2 lineto
52681.4 32695.2 lineto
52568.9 32751.4 lineto
52512.7 32807.7 lineto
52456.4 32920.1 lineto
52400.2 33145.1 lineto
52400.2 33426.3 lineto
52456.4 33651.3 lineto
52512.7 33763.8 lineto
52568.9 33820 lineto
52681.4 33876.3 lineto
stroke
newpath
53581.3 32695.2 moveto
53581.3 33482.6 lineto
stroke
newpath
53581.3 33370.1 moveto
53637.5 33426.3 lineto
53750 33482.6 lineto
53918.7 33482.6 lineto
54031.2 33426.3 lineto
54087.5 33313.8 lineto
54087.5 32695.2 lineto
stroke
newpath
54087.5 33313.8 moveto
54143.7 33426.3 lineto
54256.2 33482.6 lineto
54424.9 33482.6 lineto
54537.4 33426.3 lineto
54593.7 33313.8 lineto
54593.7 32695.2 lineto
stroke
newpath
55156.1 32695.2 moveto
55156.1 33482.6 lineto
stroke
newpath
55156.1 33370.1 moveto
55212.3 33426.3 lineto
55324.8 33482.6 lineto
55493.5 33482.6 lineto
55606 33426.3 lineto
55662.3 33313.8 lineto
55662.3 32695.2 lineto
stroke
newpath
55662.3 33313.8 moveto
55718.5 33426.3 lineto
55831 33482.6 lineto
55999.7 33482.6 lineto
56112.2 33426.3 lineto
56168.5 33313.8 lineto
56168.5 32695.2 lineto
stroke
newpath
58474.4 33932.5 moveto
57462.1 32414 lineto
stroke
newpath
59993 33876.3 moveto
60105.5 33876.3 lineto
60218 33820 lineto
60274.2 33763.8 lineto
60330.4 33651.3 lineto
60386.7 33426.3 lineto
60386.7 33145.1 lineto
60330.4 32920.1 lineto
60274.2 32807.7 lineto
60218 32751.4 lineto
60105.5 32695.2 lineto
59993 32695.2 lineto
59880.5 32751.4 lineto
59824.3 32807.7 lineto
59768 32920.1 lineto
59711.8 33145.1 lineto
59711.8 33426.3 lineto
59768 33651.3 lineto
59824.3 33763.8 lineto
59880.5 33820 lineto
59993 33876.3 lineto
stroke
newpath
60892.9 32807.7 moveto
60949.1 32751.4 lineto
60892.9 32695.2 lineto
60836.6 32751.4 lineto
60892.9 32807.7 lineto
60892.9 32695.2 lineto
stroke
newpath
61680.3 33876.3 moveto
61792.8 33876.3 lineto
61905.2 33820 lineto
61961.5 33763.8 lineto
62017.7 33651.3 lineto
62074 33426.3 lineto
62074 33145.1 lineto
62017.7 32920.1 lineto
61961.5 32807.7 lineto
61905.2 32751.4 lineto
61792.8 32695.2 lineto
61680.3 32695.2 lineto
61567.8 32751.4 lineto
61511.5 32807.7 lineto
61455.3 32920.1 lineto
61399.1 33145.1 lineto
61399.1 33426.3 lineto
61455.3 33651.3 lineto
61511.5 33763.8 lineto
61567.8 33820 lineto
61680.3 33876.3 lineto
stroke
newpath
63198.8 32695.2 moveto
62523.9 32695.2 lineto
stroke
newpath
62861.4 32695.2 moveto
62861.4 33876.3 lineto
62748.9 33707.5 lineto
62636.4 33595.1 lineto
62523.9 33538.8 lineto
stroke
newpath
64267.5 33876.3 moveto
63705 33876.3 lineto
63648.8 33313.8 lineto
63705 33370.1 lineto
63817.5 33426.3 lineto
64098.7 33426.3 lineto
64211.2 33370.1 lineto
64267.5 33313.8 lineto
64323.7 33201.4 lineto
64323.7 32920.1 lineto
64267.5 32807.7 lineto
64211.2 32751.4 lineto
64098.7 32695.2 lineto
63817.5 32695.2 lineto
63705 32751.4 lineto
63648.8 32807.7 lineto
stroke
newpath
64717.4 33876.3 moveto
65504.8 33876.3 lineto
64998.6 32695.2 lineto
stroke
newpath
65898.5 33876.3 moveto
65898.5 33651.3 lineto
stroke
newpath
66348.4 33876.3 moveto
66348.4 33651.3 lineto
stroke
newpath
68092 32245.2 moveto
68035.7 32301.5 lineto
67923.2 32470.2 lineto
67867 32582.7 lineto
67810.8 32751.4 lineto
67754.5 33032.6 lineto
67754.5 33257.6 lineto
67810.8 33538.8 lineto
67867 33707.5 lineto
67923.2 33820 lineto
68035.7 33988.8 lineto
68092 34045 lineto
stroke
newpath
69160.6 32695.2 moveto
68485.7 32695.2 lineto
stroke
newpath
68823.1 32695.2 moveto
68823.1 33876.3 lineto
68710.6 33707.5 lineto
68598.2 33595.1 lineto
68485.7 33538.8 lineto
stroke
newpath
70173 33482.6 moveto
70173 32695.2 lineto
stroke
newpath
69891.7 33932.5 moveto
69610.5 33088.9 lineto
70341.7 33088.9 lineto
stroke
newpath
71691.5 32695.2 moveto
71691.5 33876.3 lineto
stroke
newpath
72197.7 32695.2 moveto
72197.7 33313.8 lineto
72141.5 33426.3 lineto
72029 33482.6 lineto
71860.2 33482.6 lineto
71747.8 33426.3 lineto
71691.5 33370.1 lineto
stroke
newpath
72928.9 32695.2 moveto
72816.4 32751.4 lineto
72760.1 32807.7 lineto
72703.9 32920.1 lineto
72703.9 33257.6 lineto
72760.1 33370.1 lineto
72816.4 33426.3 lineto
72928.9 33482.6 lineto
73097.6 33482.6 lineto
73210.1 33426.3 lineto
73266.3 33370.1 lineto
73322.6 33257.6 lineto
73322.6 32920.1 lineto
73266.3 32807.7 lineto
73210.1 32751.4 lineto
73097.6 32695.2 lineto
72928.9 32695.2 lineto
stroke
newpath
73997.5 32695.2 moveto
73885 32751.4 lineto
73828.8 32863.9 lineto
73828.8 33876.3 lineto
stroke
newpath
74897.4 32751.4 moveto
74784.9 32695.2 lineto
74559.9 32695.2 lineto
74447.4 32751.4 lineto
74391.2 32863.9 lineto
74391.2 33313.8 lineto
74447.4 33426.3 lineto
74559.9 33482.6 lineto
74784.9 33482.6 lineto
74897.4 33426.3 lineto
74953.6 33313.8 lineto
74953.6 33201.4 lineto
74391.2 33088.9 lineto
stroke
newpath
75403.6 32751.4 moveto
75516 32695.2 lineto
75741 32695.2 lineto
75853.5 32751.4 lineto
75909.7 32863.9 lineto
75909.7 32920.1 lineto
75853.5 33032.6 lineto
75741 33088.9 lineto
75572.3 33088.9 lineto
75459.8 33145.1 lineto
75403.6 33257.6 lineto
75403.6 33313.8 lineto
75459.8 33426.3 lineto
75572.3 33482.6 lineto
75741 33482.6 lineto
75853.5 33426.3 lineto
stroke
newpath
76303.4 32245.2 moveto
76359.7 32301.5 lineto
76472.2 32470.2 lineto
76528.4 32582.7 lineto
76584.7 32751.4 lineto
76640.9 33032.6 lineto
76640.9 33257.6 lineto
76584.7 33538.8 lineto
76528.4 33707.5 lineto
76472.2 33820 lineto
76359.7 33988.8 lineto
76303.4 34045 lineto
stroke
47202.2 31670.4 189.556 cir0
0 0 0 setrgbcolor
0 0 0 setrgbcolor
newpath
48744.4 32317.2 moveto
48856.9 32317.2 lineto
48969.4 32261 lineto
49025.6 32204.7 lineto
49081.9 32092.2 lineto
49138.1 31867.3 lineto
49138.1 31586.1 lineto
49081.9 31361.1 lineto
49025.6 31248.6 lineto
48969.4 31192.4 lineto
48856.9 31136.1 lineto
48744.4 31136.1 lineto
48631.9 31192.4 lineto
48575.7 31248.6 lineto
48519.4 31361.1 lineto
48463.2 31586.1 lineto
48463.2 31867.3 lineto
48519.4 32092.2 lineto
48575.7 32204.7 lineto
48631.9 32261 lineto
48744.4 32317.2 lineto
stroke
newpath
49644.3 31248.6 moveto
49700.5 31192.4 lineto
49644.3 31136.1 lineto
49588 31192.4 lineto
49644.3 31248.6 lineto
49644.3 31136.1 lineto
stroke
newpath
50712.9 32317.2 moveto
50487.9 32317.2 lineto
50375.4 32261 lineto
50319.2 32204.7 lineto
50206.7 32036 lineto
50150.5 31811 lineto
50150.5 31361.1 lineto
50206.7 31248.6 lineto
50263 31192.4 lineto
50375.4 31136.1 lineto
50600.4 31136.1 lineto
50712.9 31192.4 lineto
50769.1 31248.6 lineto
50825.4 31361.1 lineto
50825.4 31642.3 lineto
50769.1 31754.8 lineto
50712.9 31811 lineto
50600.4 31867.3 lineto
50375.4 31867.3 lineto
50263 31811 lineto
50206.7 31754.8 lineto
50150.5 31642.3 lineto
stroke
newpath
51556.5 32317.2 moveto
51669 32317.2 lineto
51781.5 32261 lineto
51837.8 32204.7 lineto
51894 32092.2 lineto
51950.2 31867.3 lineto
51950.2 31586.1 lineto
51894 31361.1 lineto
51837.8 31248.6 lineto
51781.5 31192.4 lineto
51669 31136.1 lineto
51556.5 31136.1 lineto
51444.1 31192.4 lineto
51387.8 31248.6 lineto
51331.6 31361.1 lineto
51275.3 31586.1 lineto
51275.3 31867.3 lineto
51331.6 32092.2 lineto
51387.8 32204.7 lineto
51444.1 32261 lineto
51556.5 32317.2 lineto
stroke
newpath
52681.4 32317.2 moveto
52793.9 32317.2 lineto
52906.4 32261 lineto
52962.6 32204.7 lineto
53018.9 32092.2 lineto
53075.1 31867.3 lineto
53075.1 31586.1 lineto
53018.9 31361.1 lineto
52962.6 31248.6 lineto
52906.4 31192.4 lineto
52793.9 31136.1 lineto
52681.4 31136.1 lineto
52568.9 31192.4 lineto
52512.7 31248.6 lineto
52456.4 31361.1 lineto
52400.2 31586.1 lineto
52400.2 31867.3 lineto
52456.4 32092.2 lineto
52512.7 32204.7 lineto
52568.9 32261 lineto
52681.4 32317.2 lineto
stroke
newpath
53581.3 31136.1 moveto
53581.3 31923.5 lineto
stroke
newpath
53581.3 31811 moveto
53637.5 31867.3 lineto
53750 31923.5 lineto
53918.7 31923.5 lineto
54031.2 31867.3 lineto
54087.5 31754.8 lineto
54087.5 31136.1 lineto
stroke
newpath
54087.5 31754.8 moveto
54143.7 31867.3 lineto
54256.2 31923.5 lineto
54424.9 31923.5 lineto
54537.4 31867.3 lineto
54593.7 31754.8 lineto
54593.7 31136.1 lineto
stroke
newpath
55156.1 31136.1 moveto
55156.1 31923.5 lineto
stroke
newpath
55156.1 31811 moveto
55212.3 31867.3 lineto
55324.8 31923.5 lineto
55493.5 31923.5 lineto
55606 31867.3 lineto
55662.3 31754.8 lineto
55662.3 31136.1 lineto
stroke
newpath
55662.3 31754.8 moveto
55718.5 31867.3 lineto
55831 31923.5 lineto
55999.7 31923.5 lineto
56112.2 31867.3 lineto
56168.5 31754.8 lineto
56168.5 31136.1 lineto
stroke
newpath
58474.4 32373.5 moveto
57462.1 30854.9 lineto
stroke
newpath
59993 32317.2 moveto
60105.5 32317.2 lineto
60218 32261 lineto
60274.2 32204.7 lineto
60330.4 32092.2 lineto
60386.7 31867.3 lineto
60386.7 31586.1 lineto
60330.4 31361.1 lineto
60274.2 31248.6 lineto
60218 31192.4 lineto
60105.5 31136.1 lineto
59993 31136.1 lineto
59880.5 31192.4 lineto
59824.3 31248.6 lineto
59768 31361.1 lineto
59711.8 31586.1 lineto
59711.8 31867.3 lineto
59768 32092.2 lineto
59824.3 32204.7 lineto
59880.5 32261 lineto
59993 32317.2 lineto
stroke
newpath
60892.9 31248.6 moveto
60949.1 31192.4 lineto
60892.9 31136.1 lineto
60836.6 31192.4 lineto
60892.9 31248.6 lineto
60892.9 31136.1 lineto
stroke
newpath
61680.3 32317.2 moveto
61792.8 32317.2 lineto
61905.2 32261 lineto
61961.5 32204.7 lineto
62017.7 32092.2 lineto
62074 31867.3 lineto
62074 31586.1 lineto
62017.7 31361.1 lineto
61961.5 31248.6 lineto
61905.2 31192.4 lineto
61792.8 31136.1 lineto
61680.3 31136.1 lineto
61567.8 31192.4 lineto
61511.5 31248.6 lineto
61455.3 31361.1 lineto
61399.1 31586.1 lineto
61399.1 31867.3 lineto
61455.3 32092.2 lineto
61511.5 32204.7 lineto
61567.8 32261 lineto
61680.3 32317.2 lineto
stroke
newpath
62523.9 32204.7 moveto
62580.2 32261 lineto
62692.6 32317.2 lineto
62973.9 32317.2 lineto
63086.3 32261 lineto
63142.6 32204.7 lineto
63198.8 32092.2 lineto
63198.8 31979.8 lineto
63142.6 31811 lineto
62467.7 31136.1 lineto
63198.8 31136.1 lineto
stroke
newpath
63592.5 32317.2 moveto
64323.7 32317.2 lineto
63930 31867.3 lineto
64098.7 31867.3 lineto
64211.2 31811 lineto
64267.5 31754.8 lineto
64323.7 31642.3 lineto
64323.7 31361.1 lineto
64267.5 31248.6 lineto
64211.2 31192.4 lineto
64098.7 31136.1 lineto
63761.3 31136.1 lineto
63648.8 31192.4 lineto
63592.5 31248.6 lineto
stroke
newpath
65336.1 32317.2 moveto
65111.1 32317.2 lineto
64998.6 32261 lineto
64942.4 32204.7 lineto
64829.9 32036 lineto
64773.6 31811 lineto
64773.6 31361.1 lineto
64829.9 31248.6 lineto
64886.1 31192.4 lineto
64998.6 31136.1 lineto
65223.6 31136.1 lineto
65336.1 31192.4 lineto
65392.3 31248.6 lineto
65448.6 31361.1 lineto
65448.6 31642.3 lineto
65392.3 31754.8 lineto
65336.1 31811 lineto
65223.6 31867.3 lineto
64998.6 31867.3 lineto
64886.1 31811 lineto
64829.9 31754.8 lineto
64773.6 31642.3 lineto
stroke
newpath
65898.5 32317.2 moveto
65898.5 32092.2 lineto
stroke
newpath
66348.4 32317.2 moveto
66348.4 32092.2 lineto
stroke
newpath
68092 30686.2 moveto
68035.7 30742.4 lineto
67923.2 30911.1 lineto
67867 31023.6 lineto
67810.8 31192.4 lineto
67754.5 31473.6 lineto
67754.5 31698.5 lineto
67810.8 31979.8 lineto
67867 32148.5 lineto
67923.2 32261 lineto
68035.7 32429.7 lineto
68092 32486 lineto
stroke
newpath
69048.1 32317.2 moveto
68823.1 32317.2 lineto
68710.6 32261 lineto
68654.4 32204.7 lineto
68541.9 32036 lineto
68485.7 31811 lineto
68485.7 31361.1 lineto
68541.9 31248.6 lineto
68598.2 31192.4 lineto
68710.6 31136.1 lineto
68935.6 31136.1 lineto
69048.1 31192.4 lineto
69104.3 31248.6 lineto
69160.6 31361.1 lineto
69160.6 31642.3 lineto
69104.3 31754.8 lineto
69048.1 31811 lineto
68935.6 31867.3 lineto
68710.6 31867.3 lineto
68598.2 31811 lineto
68541.9 31754.8 lineto
68485.7 31642.3 lineto
stroke
newpath
70566.7 31136.1 moveto
70566.7 32317.2 lineto
stroke
newpath
71072.8 31136.1 moveto
71072.8 31754.8 lineto
71016.6 31867.3 lineto
70904.1 31923.5 lineto
70735.4 31923.5 lineto
70622.9 31867.3 lineto
70566.7 31811 lineto
stroke
newpath
71804 31136.1 moveto
71691.5 31192.4 lineto
71635.3 31248.6 lineto
71579 31361.1 lineto
71579 31698.5 lineto
71635.3 31811 lineto
71691.5 31867.3 lineto
71804 31923.5 lineto
71972.7 31923.5 lineto
72085.2 31867.3 lineto
72141.5 31811 lineto
72197.7 31698.5 lineto
72197.7 31361.1 lineto
72141.5 31248.6 lineto
72085.2 31192.4 lineto
71972.7 31136.1 lineto
71804 31136.1 lineto
stroke
newpath
72872.6 31136.1 moveto
72760.1 31192.4 lineto
72703.9 31304.8 lineto
72703.9 32317.2 lineto
stroke
newpath
73772.5 31192.4 moveto
73660 31136.1 lineto
73435.1 31136.1 lineto
73322.6 31192.4 lineto
73266.3 31304.8 lineto
73266.3 31754.8 lineto
73322.6 31867.3 lineto
73435.1 31923.5 lineto
73660 31923.5 lineto
73772.5 31867.3 lineto
73828.8 31754.8 lineto
73828.8 31642.3 lineto
73266.3 31529.8 lineto
stroke
newpath
74278.7 31192.4 moveto
74391.2 31136.1 lineto
74616.2 31136.1 lineto
74728.6 31192.4 lineto
74784.9 31304.8 lineto
74784.9 31361.1 lineto
74728.6 31473.6 lineto
74616.2 31529.8 lineto
74447.4 31529.8 lineto
74334.9 31586.1 lineto
74278.7 31698.5 lineto
74278.7 31754.8 lineto
74334.9 31867.3 lineto
74447.4 31923.5 lineto
74616.2 31923.5 lineto
74728.6 31867.3 lineto
stroke
newpath
75178.6 30686.2 moveto
75234.8 30742.4 lineto
75347.3 30911.1 lineto
75403.6 31023.6 lineto
75459.8 31192.4 lineto
75516 31473.6 lineto
75516 31698.5 lineto
75459.8 31979.8 lineto
75403.6 32148.5 lineto
75347.3 32261 lineto
75234.8 32429.7 lineto
75178.6 32486 lineto
stroke
newpath
47170.6 30332.5 moveto
47170.6 29890.2 lineto
stroke
newpath
46949.5 30111.4 moveto
47391.8 30111.4 lineto
stroke
0 0 0 setrgbcolor
0 0 0 setrgbcolor
newpath
48744.4 30758.2 moveto
48856.9 30758.2 lineto
48969.4 30701.9 lineto
49025.6 30645.7 lineto
49081.9 30533.2 lineto
49138.1 30308.2 lineto
49138.1 30027 lineto
49081.9 29802 lineto
49025.6 29689.6 lineto
48969.4 29633.3 lineto
48856.9 29577.1 lineto
48744.4 29577.1 lineto
48631.9 29633.3 lineto
48575.7 29689.6 lineto
48519.4 29802 lineto
48463.2 30027 lineto
48463.2 30308.2 lineto
48519.4 30533.2 lineto
48575.7 30645.7 lineto
48631.9 30701.9 lineto
48744.4 30758.2 lineto
stroke
newpath
49644.3 29689.6 moveto
49700.5 29633.3 lineto
49644.3 29577.1 lineto
49588 29633.3 lineto
49644.3 29689.6 lineto
49644.3 29577.1 lineto
stroke
newpath
50094.2 30758.2 moveto
50881.6 30758.2 lineto
50375.4 29577.1 lineto
stroke
newpath
51556.5 30758.2 moveto
51669 30758.2 lineto
51781.5 30701.9 lineto
51837.8 30645.7 lineto
51894 30533.2 lineto
51950.2 30308.2 lineto
51950.2 30027 lineto
51894 29802 lineto
51837.8 29689.6 lineto
51781.5 29633.3 lineto
51669 29577.1 lineto
51556.5 29577.1 lineto
51444.1 29633.3 lineto
51387.8 29689.6 lineto
51331.6 29802 lineto
51275.3 30027 lineto
51275.3 30308.2 lineto
51331.6 30533.2 lineto
51387.8 30645.7 lineto
51444.1 30701.9 lineto
51556.5 30758.2 lineto
stroke
newpath
52681.4 30758.2 moveto
52793.9 30758.2 lineto
52906.4 30701.9 lineto
52962.6 30645.7 lineto
53018.9 30533.2 lineto
53075.1 30308.2 lineto
53075.1 30027 lineto
53018.9 29802 lineto
52962.6 29689.6 lineto
52906.4 29633.3 lineto
52793.9 29577.1 lineto
52681.4 29577.1 lineto
52568.9 29633.3 lineto
52512.7 29689.6 lineto
52456.4 29802 lineto
52400.2 30027 lineto
52400.2 30308.2 lineto
52456.4 30533.2 lineto
52512.7 30645.7 lineto
52568.9 30701.9 lineto
52681.4 30758.2 lineto
stroke
newpath
53581.3 29577.1 moveto
53581.3 30364.5 lineto
stroke
newpath
53581.3 30252 moveto
53637.5 30308.2 lineto
53750 30364.5 lineto
53918.7 30364.5 lineto
54031.2 30308.2 lineto
54087.5 30195.7 lineto
54087.5 29577.1 lineto
stroke
newpath
54087.5 30195.7 moveto
54143.7 30308.2 lineto
54256.2 30364.5 lineto
54424.9 30364.5 lineto
54537.4 30308.2 lineto
54593.7 30195.7 lineto
54593.7 29577.1 lineto
stroke
newpath
55156.1 29577.1 moveto
55156.1 30364.5 lineto
stroke
newpath
55156.1 30252 moveto
55212.3 30308.2 lineto
55324.8 30364.5 lineto
55493.5 30364.5 lineto
55606 30308.2 lineto
55662.3 30195.7 lineto
55662.3 29577.1 lineto
stroke
newpath
55662.3 30195.7 moveto
55718.5 30308.2 lineto
55831 30364.5 lineto
55999.7 30364.5 lineto
56112.2 30308.2 lineto
56168.5 30195.7 lineto
56168.5 29577.1 lineto
stroke
newpath
58474.4 30814.4 moveto
57462.1 29295.9 lineto
stroke
newpath
59993 30758.2 moveto
60105.5 30758.2 lineto
60218 30701.9 lineto
60274.2 30645.7 lineto
60330.4 30533.2 lineto
60386.7 30308.2 lineto
60386.7 30027 lineto
60330.4 29802 lineto
60274.2 29689.6 lineto
60218 29633.3 lineto
60105.5 29577.1 lineto
59993 29577.1 lineto
59880.5 29633.3 lineto
59824.3 29689.6 lineto
59768 29802 lineto
59711.8 30027 lineto
59711.8 30308.2 lineto
59768 30533.2 lineto
59824.3 30645.7 lineto
59880.5 30701.9 lineto
59993 30758.2 lineto
stroke
newpath
60892.9 29689.6 moveto
60949.1 29633.3 lineto
60892.9 29577.1 lineto
60836.6 29633.3 lineto
60892.9 29689.6 lineto
60892.9 29577.1 lineto
stroke
newpath
61680.3 30758.2 moveto
61792.8 30758.2 lineto
61905.2 30701.9 lineto
61961.5 30645.7 lineto
62017.7 30533.2 lineto
62074 30308.2 lineto
62074 30027 lineto
62017.7 29802 lineto
61961.5 29689.6 lineto
61905.2 29633.3 lineto
61792.8 29577.1 lineto
61680.3 29577.1 lineto
61567.8 29633.3 lineto
61511.5 29689.6 lineto
61455.3 29802 lineto
61399.1 30027 lineto
61399.1 30308.2 lineto
61455.3 30533.2 lineto
61511.5 30645.7 lineto
61567.8 30701.9 lineto
61680.3 30758.2 lineto
stroke
newpath
62523.9 30645.7 moveto
62580.2 30701.9 lineto
62692.6 30758.2 lineto
62973.9 30758.2 lineto
63086.3 30701.9 lineto
63142.6 30645.7 lineto
63198.8 30533.2 lineto
63198.8 30420.7 lineto
63142.6 30252 lineto
62467.7 29577.1 lineto
63198.8 29577.1 lineto
stroke
newpath
63592.5 30758.2 moveto
64379.9 30758.2 lineto
63873.7 29577.1 lineto
stroke
newpath
65336.1 30758.2 moveto
65111.1 30758.2 lineto
64998.6 30701.9 lineto
64942.4 30645.7 lineto
64829.9 30477 lineto
64773.6 30252 lineto
64773.6 29802 lineto
64829.9 29689.6 lineto
64886.1 29633.3 lineto
64998.6 29577.1 lineto
65223.6 29577.1 lineto
65336.1 29633.3 lineto
65392.3 29689.6 lineto
65448.6 29802 lineto
65448.6 30083.3 lineto
65392.3 30195.7 lineto
65336.1 30252 lineto
65223.6 30308.2 lineto
64998.6 30308.2 lineto
64886.1 30252 lineto
64829.9 30195.7 lineto
64773.6 30083.3 lineto
stroke
newpath
65898.5 30758.2 moveto
65898.5 30533.2 lineto
stroke
newpath
66348.4 30758.2 moveto
66348.4 30533.2 lineto
stroke
newpath
68092 29127.1 moveto
68035.7 29183.4 lineto
67923.2 29352.1 lineto
67867 29464.6 lineto
67810.8 29633.3 lineto
67754.5 29914.5 lineto
67754.5 30139.5 lineto
67810.8 30420.7 lineto
67867 30589.4 lineto
67923.2 30701.9 lineto
68035.7 30870.7 lineto
68092 30926.9 lineto
stroke
newpath
68485.7 30645.7 moveto
68541.9 30701.9 lineto
68654.4 30758.2 lineto
68935.6 30758.2 lineto
69048.1 30701.9 lineto
69104.3 30645.7 lineto
69160.6 30533.2 lineto
69160.6 30420.7 lineto
69104.3 30252 lineto
68429.4 29577.1 lineto
69160.6 29577.1 lineto
stroke
newpath
70566.7 29577.1 moveto
70566.7 30758.2 lineto
stroke
newpath
71072.8 29577.1 moveto
71072.8 30195.7 lineto
71016.6 30308.2 lineto
70904.1 30364.5 lineto
70735.4 30364.5 lineto
70622.9 30308.2 lineto
70566.7 30252 lineto
stroke
newpath
71804 29577.1 moveto
71691.5 29633.3 lineto
71635.3 29689.6 lineto
71579 29802 lineto
71579 30139.5 lineto
71635.3 30252 lineto
71691.5 30308.2 lineto
71804 30364.5 lineto
71972.7 30364.5 lineto
72085.2 30308.2 lineto
72141.5 30252 lineto
72197.7 30139.5 lineto
72197.7 29802 lineto
72141.5 29689.6 lineto
72085.2 29633.3 lineto
71972.7 29577.1 lineto
71804 29577.1 lineto
stroke
newpath
72872.6 29577.1 moveto
72760.1 29633.3 lineto
72703.9 29745.8 lineto
72703.9 30758.2 lineto
stroke
newpath
73772.5 29633.3 moveto
73660 29577.1 lineto
73435.1 29577.1 lineto
73322.6 29633.3 lineto
73266.3 29745.8 lineto
73266.3 30195.7 lineto
73322.6 30308.2 lineto
73435.1 30364.5 lineto
73660 30364.5 lineto
73772.5 30308.2 lineto
73828.8 30195.7 lineto
73828.8 30083.3 lineto
73266.3 29970.8 lineto
stroke
newpath
74278.7 29633.3 moveto
74391.2 29577.1 lineto
74616.2 29577.1 lineto
74728.6 29633.3 lineto
74784.9 29745.8 lineto
74784.9 29802 lineto
74728.6 29914.5 lineto
74616.2 29970.8 lineto
74447.4 29970.8 lineto
74334.9 30027 lineto
74278.7 30139.5 lineto
74278.7 30195.7 lineto
74334.9 30308.2 lineto
74447.4 30364.5 lineto
74616.2 30364.5 lineto
74728.6 30308.2 lineto
stroke
newpath
75178.6 29127.1 moveto
75234.8 29183.4 lineto
75347.3 29352.1 lineto
75403.6 29464.6 lineto
75459.8 29633.3 lineto
75516 29914.5 lineto
75516 30139.5 lineto
75459.8 30420.7 lineto
75403.6 30589.4 lineto
75347.3 30701.9 lineto
75234.8 30870.7 lineto
75178.6 30926.9 lineto
stroke
newpath
47299.2 28328.9 moveto
47299.2 28775.7 lineto
46852.4 28775.7 lineto
46852.4 28328.9 lineto
47299.2 28328.9 lineto
poly0
0 0 0 setrgbcolor
0 0 0 setrgbcolor
newpath
49138.1 28018 moveto
48463.2 28018 lineto
stroke
newpath
48800.6 28018 moveto
48800.6 29199.1 lineto
48688.2 29030.4 lineto
48575.7 28917.9 lineto
48463.2 28861.7 lineto
stroke
newpath
49644.3 28130.5 moveto
49700.5 28074.3 lineto
49644.3 28018 lineto
49588 28074.3 lineto
49644.3 28130.5 lineto
49644.3 28018 lineto
stroke
newpath
50431.7 29199.1 moveto
50544.2 29199.1 lineto
50656.7 29142.9 lineto
50712.9 29086.6 lineto
50769.1 28974.1 lineto
50825.4 28749.2 lineto
50825.4 28468 lineto
50769.1 28243 lineto
50712.9 28130.5 lineto
50656.7 28074.3 lineto
50544.2 28018 lineto
50431.7 28018 lineto
50319.2 28074.3 lineto
50263 28130.5 lineto
50206.7 28243 lineto
50150.5 28468 lineto
50150.5 28749.2 lineto
50206.7 28974.1 lineto
50263 29086.6 lineto
50319.2 29142.9 lineto
50431.7 29199.1 lineto
stroke
newpath
51556.5 29199.1 moveto
51669 29199.1 lineto
51781.5 29142.9 lineto
51837.8 29086.6 lineto
51894 28974.1 lineto
51950.2 28749.2 lineto
51950.2 28468 lineto
51894 28243 lineto
51837.8 28130.5 lineto
51781.5 28074.3 lineto
51669 28018 lineto
51556.5 28018 lineto
51444.1 28074.3 lineto
51387.8 28130.5 lineto
51331.6 28243 lineto
51275.3 28468 lineto
51275.3 28749.2 lineto
51331.6 28974.1 lineto
51387.8 29086.6 lineto
51444.1 29142.9 lineto
51556.5 29199.1 lineto
stroke
newpath
52681.4 29199.1 moveto
52793.9 29199.1 lineto
52906.4 29142.9 lineto
52962.6 29086.6 lineto
53018.9 28974.1 lineto
53075.1 28749.2 lineto
53075.1 28468 lineto
53018.9 28243 lineto
52962.6 28130.5 lineto
52906.4 28074.3 lineto
52793.9 28018 lineto
52681.4 28018 lineto
52568.9 28074.3 lineto
52512.7 28130.5 lineto
52456.4 28243 lineto
52400.2 28468 lineto
52400.2 28749.2 lineto
52456.4 28974.1 lineto
52512.7 29086.6 lineto
52568.9 29142.9 lineto
52681.4 29199.1 lineto
stroke
newpath
53581.3 28018 moveto
53581.3 28805.4 lineto
stroke
newpath
53581.3 28692.9 moveto
53637.5 28749.2 lineto
53750 28805.4 lineto
53918.7 28805.4 lineto
54031.2 28749.2 lineto
54087.5 28636.7 lineto
54087.5 28018 lineto
stroke
newpath
54087.5 28636.7 moveto
54143.7 28749.2 lineto
54256.2 28805.4 lineto
54424.9 28805.4 lineto
54537.4 28749.2 lineto
54593.7 28636.7 lineto
54593.7 28018 lineto
stroke
newpath
55156.1 28018 moveto
55156.1 28805.4 lineto
stroke
newpath
55156.1 28692.9 moveto
55212.3 28749.2 lineto
55324.8 28805.4 lineto
55493.5 28805.4 lineto
55606 28749.2 lineto
55662.3 28636.7 lineto
55662.3 28018 lineto
stroke
newpath
55662.3 28636.7 moveto
55718.5 28749.2 lineto
55831 28805.4 lineto
55999.7 28805.4 lineto
56112.2 28749.2 lineto
56168.5 28636.7 lineto
56168.5 28018 lineto
stroke
newpath
58474.4 29255.4 moveto
57462.1 27736.8 lineto
stroke
newpath
59993 29199.1 moveto
60105.5 29199.1 lineto
60218 29142.9 lineto
60274.2 29086.6 lineto
60330.4 28974.1 lineto
60386.7 28749.2 lineto
60386.7 28468 lineto
60330.4 28243 lineto
60274.2 28130.5 lineto
60218 28074.3 lineto
60105.5 28018 lineto
59993 28018 lineto
59880.5 28074.3 lineto
59824.3 28130.5 lineto
59768 28243 lineto
59711.8 28468 lineto
59711.8 28749.2 lineto
59768 28974.1 lineto
59824.3 29086.6 lineto
59880.5 29142.9 lineto
59993 29199.1 lineto
stroke
newpath
60892.9 28130.5 moveto
60949.1 28074.3 lineto
60892.9 28018 lineto
60836.6 28074.3 lineto
60892.9 28130.5 lineto
60892.9 28018 lineto
stroke
newpath
61680.3 29199.1 moveto
61792.8 29199.1 lineto
61905.2 29142.9 lineto
61961.5 29086.6 lineto
62017.7 28974.1 lineto
62074 28749.2 lineto
62074 28468 lineto
62017.7 28243 lineto
61961.5 28130.5 lineto
61905.2 28074.3 lineto
61792.8 28018 lineto
61680.3 28018 lineto
61567.8 28074.3 lineto
61511.5 28130.5 lineto
61455.3 28243 lineto
61399.1 28468 lineto
61399.1 28749.2 lineto
61455.3 28974.1 lineto
61511.5 29086.6 lineto
61567.8 29142.9 lineto
61680.3 29199.1 lineto
stroke
newpath
62467.7 29199.1 moveto
63198.8 29199.1 lineto
62805.1 28749.2 lineto
62973.9 28749.2 lineto
63086.3 28692.9 lineto
63142.6 28636.7 lineto
63198.8 28524.2 lineto
63198.8 28243 lineto
63142.6 28130.5 lineto
63086.3 28074.3 lineto
62973.9 28018 lineto
62636.4 28018 lineto
62523.9 28074.3 lineto
62467.7 28130.5 lineto
stroke
newpath
63761.3 28018 moveto
63986.2 28018 lineto
64098.7 28074.3 lineto
64155 28130.5 lineto
64267.5 28299.2 lineto
64323.7 28524.2 lineto
64323.7 28974.1 lineto
64267.5 29086.6 lineto
64211.2 29142.9 lineto
64098.7 29199.1 lineto
63873.7 29199.1 lineto
63761.3 29142.9 lineto
63705 29086.6 lineto
63648.8 28974.1 lineto
63648.8 28692.9 lineto
63705 28580.4 lineto
63761.3 28524.2 lineto
63873.7 28468 lineto
64098.7 28468 lineto
64211.2 28524.2 lineto
64267.5 28580.4 lineto
64323.7 28692.9 lineto
stroke
newpath
65336.1 28805.4 moveto
65336.1 28018 lineto
stroke
newpath
65054.9 29255.4 moveto
64773.6 28411.7 lineto
65504.8 28411.7 lineto
stroke
newpath
65898.5 29199.1 moveto
65898.5 28974.1 lineto
stroke
newpath
66348.4 29199.1 moveto
66348.4 28974.1 lineto
stroke
newpath
68092 27568.1 moveto
68035.7 27624.3 lineto
67923.2 27793 lineto
67867 27905.5 lineto
67810.8 28074.3 lineto
67754.5 28355.5 lineto
67754.5 28580.4 lineto
67810.8 28861.7 lineto
67867 29030.4 lineto
67923.2 29142.9 lineto
68035.7 29311.6 lineto
68092 29367.8 lineto
stroke
newpath
68429.4 29199.1 moveto
69160.6 29199.1 lineto
68766.9 28749.2 lineto
68935.6 28749.2 lineto
69048.1 28692.9 lineto
69104.3 28636.7 lineto
69160.6 28524.2 lineto
69160.6 28243 lineto
69104.3 28130.5 lineto
69048.1 28074.3 lineto
68935.6 28018 lineto
68598.2 28018 lineto
68485.7 28074.3 lineto
68429.4 28130.5 lineto
stroke
newpath
69835.5 28692.9 moveto
69723 28749.2 lineto
69666.8 28805.4 lineto
69610.5 28917.9 lineto
69610.5 28974.1 lineto
69666.8 29086.6 lineto
69723 29142.9 lineto
69835.5 29199.1 lineto
70060.5 29199.1 lineto
70173 29142.9 lineto
70229.2 29086.6 lineto
70285.4 28974.1 lineto
70285.4 28917.9 lineto
70229.2 28805.4 lineto
70173 28749.2 lineto
70060.5 28692.9 lineto
69835.5 28692.9 lineto
69723 28636.7 lineto
69666.8 28580.4 lineto
69610.5 28468 lineto
69610.5 28243 lineto
69666.8 28130.5 lineto
69723 28074.3 lineto
69835.5 28018 lineto
70060.5 28018 lineto
70173 28074.3 lineto
70229.2 28130.5 lineto
70285.4 28243 lineto
70285.4 28468 lineto
70229.2 28580.4 lineto
70173 28636.7 lineto
70060.5 28692.9 lineto
stroke
newpath
71691.5 28018 moveto
71691.5 29199.1 lineto
stroke
newpath
72197.7 28018 moveto
72197.7 28636.7 lineto
72141.5 28749.2 lineto
72029 28805.4 lineto
71860.2 28805.4 lineto
71747.8 28749.2 lineto
71691.5 28692.9 lineto
stroke
newpath
72928.9 28018 moveto
72816.4 28074.3 lineto
72760.1 28130.5 lineto
72703.9 28243 lineto
72703.9 28580.4 lineto
72760.1 28692.9 lineto
72816.4 28749.2 lineto
72928.9 28805.4 lineto
73097.6 28805.4 lineto
73210.1 28749.2 lineto
73266.3 28692.9 lineto
73322.6 28580.4 lineto
73322.6 28243 lineto
73266.3 28130.5 lineto
73210.1 28074.3 lineto
73097.6 28018 lineto
72928.9 28018 lineto
stroke
newpath
73997.5 28018 moveto
73885 28074.3 lineto
73828.8 28186.7 lineto
73828.8 29199.1 lineto
stroke
newpath
74897.4 28074.3 moveto
74784.9 28018 lineto
74559.9 28018 lineto
74447.4 28074.3 lineto
74391.2 28186.7 lineto
74391.2 28636.7 lineto
74447.4 28749.2 lineto
74559.9 28805.4 lineto
74784.9 28805.4 lineto
74897.4 28749.2 lineto
74953.6 28636.7 lineto
74953.6 28524.2 lineto
74391.2 28411.7 lineto
stroke
newpath
75403.6 28074.3 moveto
75516 28018 lineto
75741 28018 lineto
75853.5 28074.3 lineto
75909.7 28186.7 lineto
75909.7 28243 lineto
75853.5 28355.5 lineto
75741 28411.7 lineto
75572.3 28411.7 lineto
75459.8 28468 lineto
75403.6 28580.4 lineto
75403.6 28636.7 lineto
75459.8 28749.2 lineto
75572.3 28805.4 lineto
75741 28805.4 lineto
75853.5 28749.2 lineto
stroke
newpath
76303.4 27568.1 moveto
76359.7 27624.3 lineto
76472.2 27793 lineto
76528.4 27905.5 lineto
76584.7 28074.3 lineto
76640.9 28355.5 lineto
76640.9 28580.4 lineto
76584.7 28861.7 lineto
76528.4 29030.4 lineto
76472.2 29142.9 lineto
76359.7 29311.6 lineto
76303.4 29367.8 lineto
stroke
showpage
grestore
%%EOF
