M48
INCH,TZ
T1C0.0157
T2C0.0236
T3C0.0276
T4C0.0394
%
G90
G05
T1
X58650Y-32752
X58705Y-34917
X58839Y-21614
X59047Y-24854
X60378Y-36724
X60957Y-34874
X61839Y-32827
X61909Y-35028
X62524Y-33075
X63012Y-35008
X63764Y-26961
X64327Y-34177
X64492Y-32213
X65862Y-26780
X66488Y-32220
X71358Y-41114
T2
X62697Y-31366
X63484Y-31366
X65719Y-38108
X66506Y-38108
X67352Y-39644
X68140Y-39644
T3
X65079Y-33740
X65079Y-36740
T4
X59075Y-40687
X60039Y-20567
X60039Y-21567
X60039Y-22567
X60039Y-23567
X60039Y-24567
X60039Y-25567
X60039Y-26567
X60039Y-27567
X60039Y-28567
X60039Y-29567
X60075Y-40687
X61075Y-40687
X61362Y-36130
X62075Y-40687
X62362Y-36130
X62490Y-38384
X63490Y-38384
X63583Y-40057
X63583Y-41543
X64583Y-40057
X64583Y-41543
X65583Y-41543
X66583Y-41543
X66654Y-31031
X66657Y-33953
X66870Y-35667
X67583Y-41543
X67654Y-31031
X67657Y-33953
X67870Y-35667
X68583Y-41543
X68654Y-31031
X68657Y-33953
X69654Y-31031
X69657Y-33953
X70654Y-31031
X70657Y-33953
X70659Y-20549
X70659Y-21549
X70659Y-22549
X70659Y-23549
X70659Y-24549
X70659Y-25549
X70659Y-26549
X70659Y-27549
X70659Y-28549
X70659Y-29549
T0
M30
