{
    "0":{
        "name":"TechnoBase.FM",
        "numId": 5,
        "textId": "TechnoBase",
        "stream": "https://technobase.fm/",
        "logourl" : "https://www.technobase.fm/content/images/site/logo-technobase.fm.png"
    },
    "1":{
        "name":"HouseTime.FM",
        "numId": 6,
        "textId": "HouseTime",
        "stream": "https://housetime.fm/",
        "logourl" : "https://www.housetime.fm/content/images/site/logo-housetime.fm.png"
    },
    "2":{
        "name":"HardBase.FM",
        "numId": 7,
        "textId": "HardBase",
        "stream": "https://hardbase.fm/",
        "logourl" : "https://www.hardbase.fm/content/images/site/logo-hardbase.fm.png"
    },
    "3":{
        "name":"TranceBase.FM",
        "numId": 8,
        "textId": "TranceBase",
        "stream": "https://trancebase.fm/",
        "logourl" : "https://www.trancebase.fm/content/images/site/logo-trancebase.fm.png"
    },
    "4":{
        "name":"CoreTime.FM",
        "numId": 10,
        "textId": "CoreTime",
        "stream": "https://coretime.fm/",
        "logourl" : "https://www.coretime.fm/content/images/site/logo-coretime.fm.png"
    },
    "5":{
        "name":"ClubTime.FM",
        "numId": 11,
        "textId": "ClubTime",
        "stream": "https://teatime.fm/",
        "logourl" : "https://www.clubtime.fm/content/images/site/logo-clubtime.fm.png"
    },
    "6":{
        "name":"TeaTime.FM",
        "numId": 13,
        "textId": "TeaTime",
        "stream": "https://technobase.fm/",
        "logourl" : "https://www.teatime.fm/content/images/site/logo-teatime.fm.png"
    },
    "7":{
        "name":"Replay.FM",
        "numId": 14,
        "textId": "Replay",
        "stream": "https://replay.fm/",
        "logourl" : "https://www.replay.fm/content/images/site/logo-replay.fm.png"
    }
}