package_name,version,reason,source,correct_license,Editor
pyzmq,*,somehow mislabeled,https://snyk.io/advisor/python/pyzmq,BSD-3-Clause,Jannis
crashtest,*,somehow mislabeled,https://snyk.io/advisor/python/pyzmq,MIT,Jannis
tomlkit,*,somehow mislabeled,https://snyk.io/advisor/python/tomlkit,MIT,Jannis