{
  "current": [
    {"temperature": 23.75, "ticker": 12},
    {"temperature": 24.75, "ticker": 15},
    {"temperature": 25.52, "ticker": 30},
    {"temperature": 24.25, "ticker": 45},
    {"temperature": 24.53, "ticker": 60},
    {"temperature": 23.45, "ticker": 75}
  ]
}